lucene-builds mailing list archives

Site index · List index
Message view « Date » · « Thread »
Top « Date » · « Thread »
From Apache Jenkins Server <jenk...@builds.apache.org>
Subject [JENKINS] Lucene-Solr-Tests-8.x - Build # 785 - Still Unstable
Date Wed, 04 Dec 2019 03:53:57 GMT
Build: https://builds.apache.org/job/Lucene-Solr-Tests-8.x/785/

15 tests failed.
FAILED:  junit.framework.TestSuite.org.apache.solr.cloud.api.collections.TestHdfsCloudBackupRestore

Error Message:
failure to login: javax.security.auth.login.LoginException: Security Exception

Stack Trace:
org.apache.hadoop.security.KerberosAuthException: failure to login: javax.security.auth.login.LoginException: Security Exception
	at __randomizedtesting.SeedInfo.seed([4A996A0BC8F49F27]:0)
	at org.apache.hadoop.security.UserGroupInformation.doSubjectLogin(UserGroupInformation.java:1847)
	at org.apache.hadoop.security.UserGroupInformation.createLoginUser(UserGroupInformation.java:710)
	at org.apache.hadoop.security.UserGroupInformation.getLoginUser(UserGroupInformation.java:660)
	at org.apache.hadoop.security.UserGroupInformation.getCurrentUser(UserGroupInformation.java:571)
	at org.apache.hadoop.hdfs.server.namenode.FSNamesystem.<init>(FSNamesystem.java:767)
	at org.apache.hadoop.hdfs.server.namenode.FSNamesystem.<init>(FSNamesystem.java:733)
	at org.apache.hadoop.hdfs.server.namenode.NameNode.format(NameNode.java:1140)
	at org.apache.hadoop.hdfs.server.namenode.NameNode.format(NameNode.java:409)
	at org.apache.hadoop.hdfs.DFSTestUtil.formatNameNode(DFSTestUtil.java:261)
	at org.apache.hadoop.hdfs.MiniDFSCluster.configureNameService(MiniDFSCluster.java:1072)
	at org.apache.hadoop.hdfs.MiniDFSCluster.createNameNodesAndSetConf(MiniDFSCluster.java:958)
	at org.apache.hadoop.hdfs.MiniDFSCluster.initMiniDFSCluster(MiniDFSCluster.java:890)
	at org.apache.hadoop.hdfs.MiniDFSCluster.<init>(MiniDFSCluster.java:518)
	at org.apache.hadoop.hdfs.MiniDFSCluster$Builder.build(MiniDFSCluster.java:477)
	at org.apache.solr.cloud.hdfs.HdfsTestUtil.setupClass(HdfsTestUtil.java:134)
	at org.apache.solr.cloud.hdfs.HdfsTestUtil.setupClass(HdfsTestUtil.java:66)
	at org.apache.solr.cloud.api.collections.TestHdfsCloudBackupRestore.setupClass(TestHdfsCloudBackupRestore.java:110)
	at sun.reflect.NativeMethodAccessorImpl.invoke0(Native Method)
	at sun.reflect.NativeMethodAccessorImpl.invoke(NativeMethodAccessorImpl.java:62)
	at sun.reflect.DelegatingMethodAccessorImpl.invoke(DelegatingMethodAccessorImpl.java:43)
	at java.lang.reflect.Method.invoke(Method.java:498)
	at com.carrotsearch.randomizedtesting.RandomizedRunner.invoke(RandomizedRunner.java:1750)
	at com.carrotsearch.randomizedtesting.RandomizedRunner$6.evaluate(RandomizedRunner.java:878)
	at com.carrotsearch.randomizedtesting.RandomizedRunner$7.evaluate(RandomizedRunner.java:894)
	at com.carrotsearch.randomizedtesting.rules.StatementAdapter.evaluate(StatementAdapter.java:36)
	at com.carrotsearch.randomizedtesting.rules.SystemPropertiesRestoreRule$1.evaluate(SystemPropertiesRestoreRule.java:57)
	at org.apache.lucene.util.AbstractBeforeAfterRule$1.evaluate(AbstractBeforeAfterRule.java:45)
	at com.carrotsearch.randomizedtesting.rules.StatementAdapter.evaluate(StatementAdapter.java:36)
	at org.apache.lucene.util.TestRuleStoreClassName$1.evaluate(TestRuleStoreClassName.java:41)
	at com.carrotsearch.randomizedtesting.rules.NoShadowingOrOverridesOnMethodsRule$1.evaluate(NoShadowingOrOverridesOnMethodsRule.java:40)
	at com.carrotsearch.randomizedtesting.rules.NoShadowingOrOverridesOnMethodsRule$1.evaluate(NoShadowingOrOverridesOnMethodsRule.java:40)
	at com.carrotsearch.randomizedtesting.rules.StatementAdapter.evaluate(StatementAdapter.java:36)
	at com.carrotsearch.randomizedtesting.rules.StatementAdapter.evaluate(StatementAdapter.java:36)
	at com.carrotsearch.randomizedtesting.rules.StatementAdapter.evaluate(StatementAdapter.java:36)
	at org.apache.lucene.util.TestRuleAssertionsRequired$1.evaluate(TestRuleAssertionsRequired.java:53)
	at org.apache.lucene.util.TestRuleMarkFailure$1.evaluate(TestRuleMarkFailure.java:47)
	at org.apache.lucene.util.TestRuleIgnoreAfterMaxFailures$1.evaluate(TestRuleIgnoreAfterMaxFailures.java:64)
	at org.apache.lucene.util.TestRuleIgnoreTestSuites$1.evaluate(TestRuleIgnoreTestSuites.java:54)
	at com.carrotsearch.randomizedtesting.rules.StatementAdapter.evaluate(StatementAdapter.java:36)
	at com.carrotsearch.randomizedtesting.ThreadLeakControl$StatementRunner.run(ThreadLeakControl.java:368)
	at java.lang.Thread.run(Thread.java:748)
Caused by: javax.security.auth.login.LoginException: Security Exception
	at javax.security.auth.login.LoginContext.invoke(LoginContext.java:840)
	at javax.security.auth.login.LoginContext.access$000(LoginContext.java:195)
	at javax.security.auth.login.LoginContext$4.run(LoginContext.java:682)
	at javax.security.auth.login.LoginContext$4.run(LoginContext.java:680)
	at java.security.AccessController.doPrivileged(Native Method)
	at javax.security.auth.login.LoginContext.invokePriv(LoginContext.java:680)
	at javax.security.auth.login.LoginContext.login(LoginContext.java:587)
	at org.apache.hadoop.security.UserGroupInformation$HadoopLoginContext.login(UserGroupInformation.java:1926)
	at org.apache.hadoop.security.UserGroupInformation.doSubjectLogin(UserGroupInformation.java:1837)
	... 40 more
Caused by: java.lang.SecurityException
	at javax.security.auth.login.LoginContext.invoke(LoginContext.java:841)
	... 48 more


FAILED:  junit.framework.TestSuite.org.apache.solr.cloud.autoscaling.IndexSizeTriggerTest

Error Message:
Clean up static fields (in @AfterClass?) and null them, your test still has references to classes of which the sizes cannot be measured due to security restrictions or Java 9 module encapsulation:   - private static org.apache.solr.core.SolrResourceLoader org.apache.solr.cloud.autoscaling.IndexSizeTriggerTest.loader

Stack Trace:
junit.framework.AssertionFailedError: Clean up static fields (in @AfterClass?) and null them, your test still has references to classes of which the sizes cannot be measured due to security restrictions or Java 9 module encapsulation:
  - private static org.apache.solr.core.SolrResourceLoader org.apache.solr.cloud.autoscaling.IndexSizeTriggerTest.loader
	at __randomizedtesting.SeedInfo.seed([4A996A0BC8F49F27]:0)
	at com.carrotsearch.randomizedtesting.rules.StaticFieldsInvariantRule$1.afterAlways(StaticFieldsInvariantRule.java:146)
	at com.carrotsearch.randomizedtesting.rules.StatementAdapter.evaluate(StatementAdapter.java:43)
	at com.carrotsearch.randomizedtesting.rules.StatementAdapter.evaluate(StatementAdapter.java:36)
	at com.carrotsearch.randomizedtesting.rules.StatementAdapter.evaluate(StatementAdapter.java:36)
	at org.apache.lucene.util.TestRuleAssertionsRequired$1.evaluate(TestRuleAssertionsRequired.java:53)
	at org.apache.lucene.util.TestRuleMarkFailure$1.evaluate(TestRuleMarkFailure.java:47)
	at org.apache.lucene.util.TestRuleIgnoreAfterMaxFailures$1.evaluate(TestRuleIgnoreAfterMaxFailures.java:64)
	at org.apache.lucene.util.TestRuleIgnoreTestSuites$1.evaluate(TestRuleIgnoreTestSuites.java:54)
	at com.carrotsearch.randomizedtesting.rules.StatementAdapter.evaluate(StatementAdapter.java:36)
	at com.carrotsearch.randomizedtesting.ThreadLeakControl$StatementRunner.run(ThreadLeakControl.java:368)
	at java.lang.Thread.run(Thread.java:748)
Caused by: java.security.AccessControlException: access denied ("java.lang.RuntimePermission" "accessClassInPackage.sun.nio.fs")
	at java.security.AccessControlContext.checkPermission(AccessControlContext.java:472)
	at java.security.AccessController.checkPermission(AccessController.java:884)
	at java.lang.SecurityManager.checkPermission(SecurityManager.java:549)
	at java.lang.SecurityManager.checkPackageAccess(SecurityManager.java:1564)
	at java.lang.Class.checkPackageAccess(Class.java:2372)
	at java.lang.Class.checkMemberAccess(Class.java:2351)
	at java.lang.Class.getDeclaredFields(Class.java:1915)
	at com.carrotsearch.randomizedtesting.rules.RamUsageEstimator$2.run(RamUsageEstimator.java:585)
	at com.carrotsearch.randomizedtesting.rules.RamUsageEstimator$2.run(RamUsageEstimator.java:582)
	at java.security.AccessController.doPrivileged(Native Method)
	at com.carrotsearch.randomizedtesting.rules.RamUsageEstimator.createCacheEntry(RamUsageEstimator.java:582)
	at com.carrotsearch.randomizedtesting.rules.RamUsageEstimator.measureSizeOf(RamUsageEstimator.java:545)
	at com.carrotsearch.randomizedtesting.rules.RamUsageEstimator.sizeOfAll(RamUsageEstimator.java:387)
	at com.carrotsearch.randomizedtesting.rules.StaticFieldsInvariantRule$1.afterAlways(StaticFieldsInvariantRule.java:129)
	... 10 more


FAILED:  junit.framework.TestSuite.org.apache.solr.cloud.hdfs.HDFSCollectionsAPITest

Error Message:
failure to login: javax.security.auth.login.LoginException: Security Exception

Stack Trace:
org.apache.hadoop.security.KerberosAuthException: failure to login: javax.security.auth.login.LoginException: Security Exception
	at __randomizedtesting.SeedInfo.seed([4A996A0BC8F49F27]:0)
	at org.apache.hadoop.security.UserGroupInformation.doSubjectLogin(UserGroupInformation.java:1847)
	at org.apache.hadoop.security.UserGroupInformation.createLoginUser(UserGroupInformation.java:710)
	at org.apache.hadoop.security.UserGroupInformation.getLoginUser(UserGroupInformation.java:660)
	at org.apache.hadoop.security.UserGroupInformation.getCurrentUser(UserGroupInformation.java:571)
	at org.apache.hadoop.hdfs.server.namenode.FSNamesystem.<init>(FSNamesystem.java:767)
	at org.apache.hadoop.hdfs.server.namenode.FSNamesystem.<init>(FSNamesystem.java:733)
	at org.apache.hadoop.hdfs.server.namenode.NameNode.format(NameNode.java:1140)
	at org.apache.hadoop.hdfs.server.namenode.NameNode.format(NameNode.java:409)
	at org.apache.hadoop.hdfs.DFSTestUtil.formatNameNode(DFSTestUtil.java:261)
	at org.apache.hadoop.hdfs.MiniDFSCluster.configureNameService(MiniDFSCluster.java:1072)
	at org.apache.hadoop.hdfs.MiniDFSCluster.createNameNodesAndSetConf(MiniDFSCluster.java:958)
	at org.apache.hadoop.hdfs.MiniDFSCluster.initMiniDFSCluster(MiniDFSCluster.java:890)
	at org.apache.hadoop.hdfs.MiniDFSCluster.<init>(MiniDFSCluster.java:518)
	at org.apache.hadoop.hdfs.MiniDFSCluster$Builder.build(MiniDFSCluster.java:477)
	at org.apache.solr.cloud.hdfs.HdfsTestUtil.setupClass(HdfsTestUtil.java:134)
	at org.apache.solr.cloud.hdfs.HdfsTestUtil.setupClass(HdfsTestUtil.java:66)
	at org.apache.solr.cloud.hdfs.HDFSCollectionsAPITest.setupClass(HDFSCollectionsAPITest.java:46)
	at sun.reflect.NativeMethodAccessorImpl.invoke0(Native Method)
	at sun.reflect.NativeMethodAccessorImpl.invoke(NativeMethodAccessorImpl.java:62)
	at sun.reflect.DelegatingMethodAccessorImpl.invoke(DelegatingMethodAccessorImpl.java:43)
	at java.lang.reflect.Method.invoke(Method.java:498)
	at com.carrotsearch.randomizedtesting.RandomizedRunner.invoke(RandomizedRunner.java:1750)
	at com.carrotsearch.randomizedtesting.RandomizedRunner$6.evaluate(RandomizedRunner.java:878)
	at com.carrotsearch.randomizedtesting.RandomizedRunner$7.evaluate(RandomizedRunner.java:894)
	at com.carrotsearch.randomizedtesting.rules.StatementAdapter.evaluate(StatementAdapter.java:36)
	at com.carrotsearch.randomizedtesting.rules.SystemPropertiesRestoreRule$1.evaluate(SystemPropertiesRestoreRule.java:57)
	at org.apache.lucene.util.AbstractBeforeAfterRule$1.evaluate(AbstractBeforeAfterRule.java:45)
	at com.carrotsearch.randomizedtesting.rules.StatementAdapter.evaluate(StatementAdapter.java:36)
	at org.apache.lucene.util.TestRuleStoreClassName$1.evaluate(TestRuleStoreClassName.java:41)
	at com.carrotsearch.randomizedtesting.rules.NoShadowingOrOverridesOnMethodsRule$1.evaluate(NoShadowingOrOverridesOnMethodsRule.java:40)
	at com.carrotsearch.randomizedtesting.rules.NoShadowingOrOverridesOnMethodsRule$1.evaluate(NoShadowingOrOverridesOnMethodsRule.java:40)
	at com.carrotsearch.randomizedtesting.rules.StatementAdapter.evaluate(StatementAdapter.java:36)
	at com.carrotsearch.randomizedtesting.rules.StatementAdapter.evaluate(StatementAdapter.java:36)
	at com.carrotsearch.randomizedtesting.rules.StatementAdapter.evaluate(StatementAdapter.java:36)
	at org.apache.lucene.util.TestRuleAssertionsRequired$1.evaluate(TestRuleAssertionsRequired.java:53)
	at org.apache.lucene.util.TestRuleMarkFailure$1.evaluate(TestRuleMarkFailure.java:47)
	at org.apache.lucene.util.TestRuleIgnoreAfterMaxFailures$1.evaluate(TestRuleIgnoreAfterMaxFailures.java:64)
	at org.apache.lucene.util.TestRuleIgnoreTestSuites$1.evaluate(TestRuleIgnoreTestSuites.java:54)
	at com.carrotsearch.randomizedtesting.rules.StatementAdapter.evaluate(StatementAdapter.java:36)
	at com.carrotsearch.randomizedtesting.ThreadLeakControl$StatementRunner.run(ThreadLeakControl.java:368)
	at java.lang.Thread.run(Thread.java:748)
Caused by: javax.security.auth.login.LoginException: Security Exception
	at javax.security.auth.login.LoginContext.invoke(LoginContext.java:840)
	at javax.security.auth.login.LoginContext.access$000(LoginContext.java:195)
	at javax.security.auth.login.LoginContext$4.run(LoginContext.java:682)
	at javax.security.auth.login.LoginContext$4.run(LoginContext.java:680)
	at java.security.AccessController.doPrivileged(Native Method)
	at javax.security.auth.login.LoginContext.invokePriv(LoginContext.java:680)
	at javax.security.auth.login.LoginContext.login(LoginContext.java:587)
	at org.apache.hadoop.security.UserGroupInformation$HadoopLoginContext.login(UserGroupInformation.java:1926)
	at org.apache.hadoop.security.UserGroupInformation.doSubjectLogin(UserGroupInformation.java:1837)
	... 40 more
Caused by: java.lang.SecurityException
	at javax.security.auth.login.LoginContext.invoke(LoginContext.java:841)
	... 48 more


FAILED:  junit.framework.TestSuite.org.apache.solr.cloud.hdfs.HdfsNNFailoverTest

Error Message:
failure to login: javax.security.auth.login.LoginException: Security Exception

Stack Trace:
org.apache.hadoop.security.KerberosAuthException: failure to login: javax.security.auth.login.LoginException: Security Exception
	at __randomizedtesting.SeedInfo.seed([4A996A0BC8F49F27]:0)
	at org.apache.hadoop.security.UserGroupInformation.doSubjectLogin(UserGroupInformation.java:1847)
	at org.apache.hadoop.security.UserGroupInformation.createLoginUser(UserGroupInformation.java:710)
	at org.apache.hadoop.security.UserGroupInformation.getLoginUser(UserGroupInformation.java:660)
	at org.apache.hadoop.security.UserGroupInformation.getCurrentUser(UserGroupInformation.java:571)
	at org.apache.hadoop.hdfs.server.namenode.FSNamesystem.<init>(FSNamesystem.java:767)
	at org.apache.hadoop.hdfs.server.namenode.FSNamesystem.<init>(FSNamesystem.java:733)
	at org.apache.hadoop.hdfs.server.namenode.NameNode.format(NameNode.java:1140)
	at org.apache.hadoop.hdfs.server.namenode.NameNode.format(NameNode.java:409)
	at org.apache.hadoop.hdfs.DFSTestUtil.formatNameNode(DFSTestUtil.java:261)
	at org.apache.hadoop.hdfs.MiniDFSCluster.configureNameService(MiniDFSCluster.java:1072)
	at org.apache.hadoop.hdfs.MiniDFSCluster.createNameNodesAndSetConf(MiniDFSCluster.java:958)
	at org.apache.hadoop.hdfs.MiniDFSCluster.initMiniDFSCluster(MiniDFSCluster.java:890)
	at org.apache.hadoop.hdfs.MiniDFSCluster.<init>(MiniDFSCluster.java:518)
	at org.apache.hadoop.hdfs.MiniDFSCluster$Builder.build(MiniDFSCluster.java:477)
	at org.apache.solr.cloud.hdfs.HdfsTestUtil.setupClass(HdfsTestUtil.java:134)
	at org.apache.solr.cloud.hdfs.HdfsNNFailoverTest.setupClass(HdfsNNFailoverTest.java:41)
	at sun.reflect.NativeMethodAccessorImpl.invoke0(Native Method)
	at sun.reflect.NativeMethodAccessorImpl.invoke(NativeMethodAccessorImpl.java:62)
	at sun.reflect.DelegatingMethodAccessorImpl.invoke(DelegatingMethodAccessorImpl.java:43)
	at java.lang.reflect.Method.invoke(Method.java:498)
	at com.carrotsearch.randomizedtesting.RandomizedRunner.invoke(RandomizedRunner.java:1750)
	at com.carrotsearch.randomizedtesting.RandomizedRunner$6.evaluate(RandomizedRunner.java:878)
	at com.carrotsearch.randomizedtesting.RandomizedRunner$7.evaluate(RandomizedRunner.java:894)
	at com.carrotsearch.randomizedtesting.rules.StatementAdapter.evaluate(StatementAdapter.java:36)
	at com.carrotsearch.randomizedtesting.rules.SystemPropertiesRestoreRule$1.evaluate(SystemPropertiesRestoreRule.java:57)
	at org.apache.lucene.util.AbstractBeforeAfterRule$1.evaluate(AbstractBeforeAfterRule.java:45)
	at com.carrotsearch.randomizedtesting.rules.StatementAdapter.evaluate(StatementAdapter.java:36)
	at org.apache.lucene.util.TestRuleStoreClassName$1.evaluate(TestRuleStoreClassName.java:41)
	at com.carrotsearch.randomizedtesting.rules.NoShadowingOrOverridesOnMethodsRule$1.evaluate(NoShadowingOrOverridesOnMethodsRule.java:40)
	at com.carrotsearch.randomizedtesting.rules.NoShadowingOrOverridesOnMethodsRule$1.evaluate(NoShadowingOrOverridesOnMethodsRule.java:40)
	at com.carrotsearch.randomizedtesting.rules.StatementAdapter.evaluate(StatementAdapter.java:36)
	at com.carrotsearch.randomizedtesting.rules.StatementAdapter.evaluate(StatementAdapter.java:36)
	at com.carrotsearch.randomizedtesting.rules.StatementAdapter.evaluate(StatementAdapter.java:36)
	at org.apache.lucene.util.TestRuleAssertionsRequired$1.evaluate(TestRuleAssertionsRequired.java:53)
	at org.apache.lucene.util.TestRuleMarkFailure$1.evaluate(TestRuleMarkFailure.java:47)
	at org.apache.lucene.util.TestRuleIgnoreAfterMaxFailures$1.evaluate(TestRuleIgnoreAfterMaxFailures.java:64)
	at org.apache.lucene.util.TestRuleIgnoreTestSuites$1.evaluate(TestRuleIgnoreTestSuites.java:54)
	at com.carrotsearch.randomizedtesting.rules.StatementAdapter.evaluate(StatementAdapter.java:36)
	at com.carrotsearch.randomizedtesting.ThreadLeakControl$StatementRunner.run(ThreadLeakControl.java:368)
	at java.lang.Thread.run(Thread.java:748)
Caused by: javax.security.auth.login.LoginException: Security Exception
	at javax.security.auth.login.LoginContext.invoke(LoginContext.java:840)
	at javax.security.auth.login.LoginContext.access$000(LoginContext.java:195)
	at javax.security.auth.login.LoginContext$4.run(LoginContext.java:682)
	at javax.security.auth.login.LoginContext$4.run(LoginContext.java:680)
	at java.security.AccessController.doPrivileged(Native Method)
	at javax.security.auth.login.LoginContext.invokePriv(LoginContext.java:680)
	at javax.security.auth.login.LoginContext.login(LoginContext.java:587)
	at org.apache.hadoop.security.UserGroupInformation$HadoopLoginContext.login(UserGroupInformation.java:1926)
	at org.apache.hadoop.security.UserGroupInformation.doSubjectLogin(UserGroupInformation.java:1837)
	... 39 more
Caused by: java.lang.SecurityException
	at javax.security.auth.login.LoginContext.invoke(LoginContext.java:841)
	... 47 more


FAILED:  junit.framework.TestSuite.org.apache.solr.cloud.hdfs.HdfsRecoverLeaseTest

Error Message:
failure to login: javax.security.auth.login.LoginException: Security Exception

Stack Trace:
org.apache.hadoop.security.KerberosAuthException: failure to login: javax.security.auth.login.LoginException: Security Exception
	at __randomizedtesting.SeedInfo.seed([4A996A0BC8F49F27]:0)
	at org.apache.hadoop.security.UserGroupInformation.doSubjectLogin(UserGroupInformation.java:1847)
	at org.apache.hadoop.security.UserGroupInformation.createLoginUser(UserGroupInformation.java:710)
	at org.apache.hadoop.security.UserGroupInformation.getLoginUser(UserGroupInformation.java:660)
	at org.apache.hadoop.security.UserGroupInformation.getCurrentUser(UserGroupInformation.java:571)
	at org.apache.hadoop.hdfs.server.namenode.FSNamesystem.<init>(FSNamesystem.java:767)
	at org.apache.hadoop.hdfs.server.namenode.FSNamesystem.<init>(FSNamesystem.java:733)
	at org.apache.hadoop.hdfs.server.namenode.NameNode.format(NameNode.java:1140)
	at org.apache.hadoop.hdfs.server.namenode.NameNode.format(NameNode.java:409)
	at org.apache.hadoop.hdfs.DFSTestUtil.formatNameNode(DFSTestUtil.java:261)
	at org.apache.hadoop.hdfs.MiniDFSCluster.configureNameService(MiniDFSCluster.java:1072)
	at org.apache.hadoop.hdfs.MiniDFSCluster.createNameNodesAndSetConf(MiniDFSCluster.java:958)
	at org.apache.hadoop.hdfs.MiniDFSCluster.initMiniDFSCluster(MiniDFSCluster.java:890)
	at org.apache.hadoop.hdfs.MiniDFSCluster.<init>(MiniDFSCluster.java:518)
	at org.apache.hadoop.hdfs.MiniDFSCluster$Builder.build(MiniDFSCluster.java:477)
	at org.apache.solr.cloud.hdfs.HdfsTestUtil.setupClass(HdfsTestUtil.java:134)
	at org.apache.solr.cloud.hdfs.HdfsTestUtil.setupClass(HdfsTestUtil.java:70)
	at org.apache.solr.cloud.hdfs.HdfsRecoverLeaseTest.beforeClass(HdfsRecoverLeaseTest.java:50)
	at sun.reflect.NativeMethodAccessorImpl.invoke0(Native Method)
	at sun.reflect.NativeMethodAccessorImpl.invoke(NativeMethodAccessorImpl.java:62)
	at sun.reflect.DelegatingMethodAccessorImpl.invoke(DelegatingMethodAccessorImpl.java:43)
	at java.lang.reflect.Method.invoke(Method.java:498)
	at com.carrotsearch.randomizedtesting.RandomizedRunner.invoke(RandomizedRunner.java:1750)
	at com.carrotsearch.randomizedtesting.RandomizedRunner$6.evaluate(RandomizedRunner.java:878)
	at com.carrotsearch.randomizedtesting.RandomizedRunner$7.evaluate(RandomizedRunner.java:894)
	at com.carrotsearch.randomizedtesting.rules.StatementAdapter.evaluate(StatementAdapter.java:36)
	at com.carrotsearch.randomizedtesting.rules.SystemPropertiesRestoreRule$1.evaluate(SystemPropertiesRestoreRule.java:57)
	at org.apache.lucene.util.AbstractBeforeAfterRule$1.evaluate(AbstractBeforeAfterRule.java:45)
	at com.carrotsearch.randomizedtesting.rules.StatementAdapter.evaluate(StatementAdapter.java:36)
	at org.apache.lucene.util.TestRuleStoreClassName$1.evaluate(TestRuleStoreClassName.java:41)
	at com.carrotsearch.randomizedtesting.rules.NoShadowingOrOverridesOnMethodsRule$1.evaluate(NoShadowingOrOverridesOnMethodsRule.java:40)
	at com.carrotsearch.randomizedtesting.rules.NoShadowingOrOverridesOnMethodsRule$1.evaluate(NoShadowingOrOverridesOnMethodsRule.java:40)
	at com.carrotsearch.randomizedtesting.rules.StatementAdapter.evaluate(StatementAdapter.java:36)
	at com.carrotsearch.randomizedtesting.rules.StatementAdapter.evaluate(StatementAdapter.java:36)
	at com.carrotsearch.randomizedtesting.rules.StatementAdapter.evaluate(StatementAdapter.java:36)
	at org.apache.lucene.util.TestRuleAssertionsRequired$1.evaluate(TestRuleAssertionsRequired.java:53)
	at org.apache.lucene.util.TestRuleMarkFailure$1.evaluate(TestRuleMarkFailure.java:47)
	at org.apache.lucene.util.TestRuleIgnoreAfterMaxFailures$1.evaluate(TestRuleIgnoreAfterMaxFailures.java:64)
	at org.apache.lucene.util.TestRuleIgnoreTestSuites$1.evaluate(TestRuleIgnoreTestSuites.java:54)
	at com.carrotsearch.randomizedtesting.rules.StatementAdapter.evaluate(StatementAdapter.java:36)
	at com.carrotsearch.randomizedtesting.ThreadLeakControl$StatementRunner.run(ThreadLeakControl.java:368)
	at java.lang.Thread.run(Thread.java:748)
Caused by: javax.security.auth.login.LoginException: Security Exception
	at javax.security.auth.login.LoginContext.invoke(LoginContext.java:840)
	at javax.security.auth.login.LoginContext.access$000(LoginContext.java:195)
	at javax.security.auth.login.LoginContext$4.run(LoginContext.java:682)
	at javax.security.auth.login.LoginContext$4.run(LoginContext.java:680)
	at java.security.AccessController.doPrivileged(Native Method)
	at javax.security.auth.login.LoginContext.invokePriv(LoginContext.java:680)
	at javax.security.auth.login.LoginContext.login(LoginContext.java:587)
	at org.apache.hadoop.security.UserGroupInformation$HadoopLoginContext.login(UserGroupInformation.java:1926)
	at org.apache.hadoop.security.UserGroupInformation.doSubjectLogin(UserGroupInformation.java:1837)
	... 40 more
Caused by: java.lang.SecurityException
	at javax.security.auth.login.LoginContext.invoke(LoginContext.java:841)
	... 48 more


FAILED:  junit.framework.TestSuite.org.apache.solr.cloud.hdfs.HdfsThreadLeakTest

Error Message:
failure to login: javax.security.auth.login.LoginException: Security Exception

Stack Trace:
org.apache.hadoop.security.KerberosAuthException: failure to login: javax.security.auth.login.LoginException: Security Exception
	at __randomizedtesting.SeedInfo.seed([4A996A0BC8F49F27]:0)
	at org.apache.hadoop.security.UserGroupInformation.doSubjectLogin(UserGroupInformation.java:1847)
	at org.apache.hadoop.security.UserGroupInformation.createLoginUser(UserGroupInformation.java:710)
	at org.apache.hadoop.security.UserGroupInformation.getLoginUser(UserGroupInformation.java:660)
	at org.apache.hadoop.security.UserGroupInformation.getCurrentUser(UserGroupInformation.java:571)
	at org.apache.hadoop.hdfs.server.namenode.FSNamesystem.<init>(FSNamesystem.java:767)
	at org.apache.hadoop.hdfs.server.namenode.FSNamesystem.<init>(FSNamesystem.java:733)
	at org.apache.hadoop.hdfs.server.namenode.NameNode.format(NameNode.java:1140)
	at org.apache.hadoop.hdfs.server.namenode.NameNode.format(NameNode.java:409)
	at org.apache.hadoop.hdfs.DFSTestUtil.formatNameNode(DFSTestUtil.java:261)
	at org.apache.hadoop.hdfs.MiniDFSCluster.configureNameService(MiniDFSCluster.java:1072)
	at org.apache.hadoop.hdfs.MiniDFSCluster.createNameNodesAndSetConf(MiniDFSCluster.java:958)
	at org.apache.hadoop.hdfs.MiniDFSCluster.initMiniDFSCluster(MiniDFSCluster.java:890)
	at org.apache.hadoop.hdfs.MiniDFSCluster.<init>(MiniDFSCluster.java:518)
	at org.apache.hadoop.hdfs.MiniDFSCluster$Builder.build(MiniDFSCluster.java:477)
	at org.apache.solr.cloud.hdfs.HdfsTestUtil.setupClass(HdfsTestUtil.java:134)
	at org.apache.solr.cloud.hdfs.HdfsThreadLeakTest.beforeClass(HdfsThreadLeakTest.java:42)
	at sun.reflect.NativeMethodAccessorImpl.invoke0(Native Method)
	at sun.reflect.NativeMethodAccessorImpl.invoke(NativeMethodAccessorImpl.java:62)
	at sun.reflect.DelegatingMethodAccessorImpl.invoke(DelegatingMethodAccessorImpl.java:43)
	at java.lang.reflect.Method.invoke(Method.java:498)
	at com.carrotsearch.randomizedtesting.RandomizedRunner.invoke(RandomizedRunner.java:1750)
	at com.carrotsearch.randomizedtesting.RandomizedRunner$6.evaluate(RandomizedRunner.java:878)
	at com.carrotsearch.randomizedtesting.RandomizedRunner$7.evaluate(RandomizedRunner.java:894)
	at com.carrotsearch.randomizedtesting.rules.StatementAdapter.evaluate(StatementAdapter.java:36)
	at com.carrotsearch.randomizedtesting.rules.SystemPropertiesRestoreRule$1.evaluate(SystemPropertiesRestoreRule.java:57)
	at org.apache.lucene.util.AbstractBeforeAfterRule$1.evaluate(AbstractBeforeAfterRule.java:45)
	at com.carrotsearch.randomizedtesting.rules.StatementAdapter.evaluate(StatementAdapter.java:36)
	at org.apache.lucene.util.TestRuleStoreClassName$1.evaluate(TestRuleStoreClassName.java:41)
	at com.carrotsearch.randomizedtesting.rules.NoShadowingOrOverridesOnMethodsRule$1.evaluate(NoShadowingOrOverridesOnMethodsRule.java:40)
	at com.carrotsearch.randomizedtesting.rules.NoShadowingOrOverridesOnMethodsRule$1.evaluate(NoShadowingOrOverridesOnMethodsRule.java:40)
	at com.carrotsearch.randomizedtesting.rules.StatementAdapter.evaluate(StatementAdapter.java:36)
	at com.carrotsearch.randomizedtesting.rules.StatementAdapter.evaluate(StatementAdapter.java:36)
	at com.carrotsearch.randomizedtesting.rules.StatementAdapter.evaluate(StatementAdapter.java:36)
	at org.apache.lucene.util.TestRuleAssertionsRequired$1.evaluate(TestRuleAssertionsRequired.java:53)
	at org.apache.lucene.util.TestRuleMarkFailure$1.evaluate(TestRuleMarkFailure.java:47)
	at org.apache.lucene.util.TestRuleIgnoreAfterMaxFailures$1.evaluate(TestRuleIgnoreAfterMaxFailures.java:64)
	at org.apache.lucene.util.TestRuleIgnoreTestSuites$1.evaluate(TestRuleIgnoreTestSuites.java:54)
	at com.carrotsearch.randomizedtesting.rules.StatementAdapter.evaluate(StatementAdapter.java:36)
	at com.carrotsearch.randomizedtesting.ThreadLeakControl$StatementRunner.run(ThreadLeakControl.java:368)
	at java.lang.Thread.run(Thread.java:748)
Caused by: javax.security.auth.login.LoginException: Security Exception
	at javax.security.auth.login.LoginContext.invoke(LoginContext.java:840)
	at javax.security.auth.login.LoginContext.access$000(LoginContext.java:195)
	at javax.security.auth.login.LoginContext$4.run(LoginContext.java:682)
	at javax.security.auth.login.LoginContext$4.run(LoginContext.java:680)
	at java.security.AccessController.doPrivileged(Native Method)
	at javax.security.auth.login.LoginContext.invokePriv(LoginContext.java:680)
	at javax.security.auth.login.LoginContext.login(LoginContext.java:587)
	at org.apache.hadoop.security.UserGroupInformation$HadoopLoginContext.login(UserGroupInformation.java:1926)
	at org.apache.hadoop.security.UserGroupInformation.doSubjectLogin(UserGroupInformation.java:1837)
	... 39 more
Caused by: java.lang.SecurityException
	at javax.security.auth.login.LoginContext.invoke(LoginContext.java:841)
	... 47 more


FAILED:  junit.framework.TestSuite.org.apache.solr.core.HdfsDirectoryFactoryTest

Error Message:
failure to login: javax.security.auth.login.LoginException: Security Exception

Stack Trace:
org.apache.hadoop.security.KerberosAuthException: failure to login: javax.security.auth.login.LoginException: Security Exception
	at __randomizedtesting.SeedInfo.seed([4A996A0BC8F49F27]:0)
	at org.apache.hadoop.security.UserGroupInformation.doSubjectLogin(UserGroupInformation.java:1847)
	at org.apache.hadoop.security.UserGroupInformation.createLoginUser(UserGroupInformation.java:710)
	at org.apache.hadoop.security.UserGroupInformation.getLoginUser(UserGroupInformation.java:660)
	at org.apache.hadoop.security.UserGroupInformation.getCurrentUser(UserGroupInformation.java:571)
	at org.apache.hadoop.hdfs.server.namenode.FSNamesystem.<init>(FSNamesystem.java:767)
	at org.apache.hadoop.hdfs.server.namenode.FSNamesystem.<init>(FSNamesystem.java:733)
	at org.apache.hadoop.hdfs.server.namenode.NameNode.format(NameNode.java:1140)
	at org.apache.hadoop.hdfs.server.namenode.NameNode.format(NameNode.java:409)
	at org.apache.hadoop.hdfs.DFSTestUtil.formatNameNode(DFSTestUtil.java:261)
	at org.apache.hadoop.hdfs.MiniDFSCluster.configureNameService(MiniDFSCluster.java:1072)
	at org.apache.hadoop.hdfs.MiniDFSCluster.createNameNodesAndSetConf(MiniDFSCluster.java:958)
	at org.apache.hadoop.hdfs.MiniDFSCluster.initMiniDFSCluster(MiniDFSCluster.java:890)
	at org.apache.hadoop.hdfs.MiniDFSCluster.<init>(MiniDFSCluster.java:518)
	at org.apache.hadoop.hdfs.MiniDFSCluster$Builder.build(MiniDFSCluster.java:477)
	at org.apache.solr.cloud.hdfs.HdfsTestUtil.setupClass(HdfsTestUtil.java:134)
	at org.apache.solr.cloud.hdfs.HdfsTestUtil.setupClass(HdfsTestUtil.java:70)
	at org.apache.solr.core.HdfsDirectoryFactoryTest.setupClass(HdfsDirectoryFactoryTest.java:62)
	at sun.reflect.NativeMethodAccessorImpl.invoke0(Native Method)
	at sun.reflect.NativeMethodAccessorImpl.invoke(NativeMethodAccessorImpl.java:62)
	at sun.reflect.DelegatingMethodAccessorImpl.invoke(DelegatingMethodAccessorImpl.java:43)
	at java.lang.reflect.Method.invoke(Method.java:498)
	at com.carrotsearch.randomizedtesting.RandomizedRunner.invoke(RandomizedRunner.java:1750)
	at com.carrotsearch.randomizedtesting.RandomizedRunner$6.evaluate(RandomizedRunner.java:878)
	at com.carrotsearch.randomizedtesting.RandomizedRunner$7.evaluate(RandomizedRunner.java:894)
	at com.carrotsearch.randomizedtesting.rules.StatementAdapter.evaluate(StatementAdapter.java:36)
	at com.carrotsearch.randomizedtesting.rules.SystemPropertiesRestoreRule$1.evaluate(SystemPropertiesRestoreRule.java:57)
	at org.apache.lucene.util.AbstractBeforeAfterRule$1.evaluate(AbstractBeforeAfterRule.java:45)
	at com.carrotsearch.randomizedtesting.rules.StatementAdapter.evaluate(StatementAdapter.java:36)
	at org.apache.lucene.util.TestRuleStoreClassName$1.evaluate(TestRuleStoreClassName.java:41)
	at com.carrotsearch.randomizedtesting.rules.NoShadowingOrOverridesOnMethodsRule$1.evaluate(NoShadowingOrOverridesOnMethodsRule.java:40)
	at com.carrotsearch.randomizedtesting.rules.NoShadowingOrOverridesOnMethodsRule$1.evaluate(NoShadowingOrOverridesOnMethodsRule.java:40)
	at com.carrotsearch.randomizedtesting.rules.StatementAdapter.evaluate(StatementAdapter.java:36)
	at com.carrotsearch.randomizedtesting.rules.StatementAdapter.evaluate(StatementAdapter.java:36)
	at com.carrotsearch.randomizedtesting.rules.StatementAdapter.evaluate(StatementAdapter.java:36)
	at org.apache.lucene.util.TestRuleAssertionsRequired$1.evaluate(TestRuleAssertionsRequired.java:53)
	at org.apache.lucene.util.TestRuleMarkFailure$1.evaluate(TestRuleMarkFailure.java:47)
	at org.apache.lucene.util.TestRuleIgnoreAfterMaxFailures$1.evaluate(TestRuleIgnoreAfterMaxFailures.java:64)
	at org.apache.lucene.util.TestRuleIgnoreTestSuites$1.evaluate(TestRuleIgnoreTestSuites.java:54)
	at com.carrotsearch.randomizedtesting.rules.StatementAdapter.evaluate(StatementAdapter.java:36)
	at com.carrotsearch.randomizedtesting.ThreadLeakControl$StatementRunner.run(ThreadLeakControl.java:368)
	at java.lang.Thread.run(Thread.java:748)
Caused by: javax.security.auth.login.LoginException: Security Exception
	at javax.security.auth.login.LoginContext.invoke(LoginContext.java:840)
	at javax.security.auth.login.LoginContext.access$000(LoginContext.java:195)
	at javax.security.auth.login.LoginContext$4.run(LoginContext.java:682)
	at javax.security.auth.login.LoginContext$4.run(LoginContext.java:680)
	at java.security.AccessController.doPrivileged(Native Method)
	at javax.security.auth.login.LoginContext.invokePriv(LoginContext.java:680)
	at javax.security.auth.login.LoginContext.login(LoginContext.java:587)
	at org.apache.hadoop.security.UserGroupInformation$HadoopLoginContext.login(UserGroupInformation.java:1926)
	at org.apache.hadoop.security.UserGroupInformation.doSubjectLogin(UserGroupInformation.java:1837)
	... 40 more
Caused by: java.lang.SecurityException
	at javax.security.auth.login.LoginContext.invoke(LoginContext.java:841)
	... 48 more


FAILED:  org.apache.solr.core.backup.repository.HdfsBackupRepositoryTest.testCopyBufferDefaultSize

Error Message:
org.apache.hadoop.security.KerberosAuthException: failure to login: javax.security.auth.login.LoginException: Security Exception

Stack Trace:
org.apache.solr.common.SolrException: org.apache.hadoop.security.KerberosAuthException: failure to login: javax.security.auth.login.LoginException: Security Exception
	at org.apache.solr.core.backup.repository.HdfsBackupRepository.init(HdfsBackupRepository.java:91)
	at org.apache.solr.core.backup.repository.HdfsBackupRepositoryTest.testCopyBufferDefaultSize(HdfsBackupRepositoryTest.java:92)
	at sun.reflect.NativeMethodAccessorImpl.invoke0(Native Method)
	at sun.reflect.NativeMethodAccessorImpl.invoke(NativeMethodAccessorImpl.java:62)
	at sun.reflect.DelegatingMethodAccessorImpl.invoke(DelegatingMethodAccessorImpl.java:43)
	at java.lang.reflect.Method.invoke(Method.java:498)
	at org.junit.runners.model.FrameworkMethod$1.runReflectiveCall(FrameworkMethod.java:50)
	at org.junit.internal.runners.model.ReflectiveCallable.run(ReflectiveCallable.java:12)
	at org.junit.runners.model.FrameworkMethod.invokeExplosively(FrameworkMethod.java:47)
	at org.junit.internal.runners.statements.InvokeMethod.evaluate(InvokeMethod.java:17)
	at org.junit.runners.ParentRunner.runLeaf(ParentRunner.java:325)
	at org.junit.runners.BlockJUnit4ClassRunner.runChild(BlockJUnit4ClassRunner.java:78)
	at org.junit.runners.BlockJUnit4ClassRunner.runChild(BlockJUnit4ClassRunner.java:57)
	at org.junit.runners.ParentRunner$3.run(ParentRunner.java:290)
	at org.junit.runners.ParentRunner$1.schedule(ParentRunner.java:71)
	at org.junit.runners.ParentRunner.runChildren(ParentRunner.java:288)
	at org.junit.runners.ParentRunner.access$000(ParentRunner.java:58)
	at org.junit.runners.ParentRunner$2.evaluate(ParentRunner.java:268)
	at org.junit.runners.ParentRunner.run(ParentRunner.java:363)
	at com.carrotsearch.ant.tasks.junit4.slave.SlaveMain.execute(SlaveMain.java:269)
	at com.carrotsearch.ant.tasks.junit4.slave.SlaveMain.main(SlaveMain.java:394)
	at com.carrotsearch.ant.tasks.junit4.slave.SlaveMainSafe.main(SlaveMainSafe.java:13)
Caused by: org.apache.hadoop.security.KerberosAuthException: failure to login: javax.security.auth.login.LoginException: Security Exception
	at org.apache.hadoop.security.UserGroupInformation.doSubjectLogin(UserGroupInformation.java:1847)
	at org.apache.hadoop.security.UserGroupInformation.createLoginUser(UserGroupInformation.java:710)
	at org.apache.hadoop.security.UserGroupInformation.getLoginUser(UserGroupInformation.java:660)
	at org.apache.hadoop.security.UserGroupInformation.getCurrentUser(UserGroupInformation.java:571)
	at org.apache.hadoop.hdfs.DFSClient.<init>(DFSClient.java:322)
	at org.apache.hadoop.hdfs.DFSClient.<init>(DFSClient.java:289)
	at org.apache.hadoop.hdfs.DistributedFileSystem.initialize(DistributedFileSystem.java:176)
	at org.apache.hadoop.fs.FileSystem.createFileSystem(FileSystem.java:3303)
	at org.apache.hadoop.fs.FileSystem.get(FileSystem.java:476)
	at org.apache.solr.core.backup.repository.HdfsBackupRepository.init(HdfsBackupRepository.java:89)
	... 21 more
Caused by: javax.security.auth.login.LoginException: Security Exception
	at javax.security.auth.login.LoginContext.invoke(LoginContext.java:840)
	at javax.security.auth.login.LoginContext.access$000(LoginContext.java:195)
	at javax.security.auth.login.LoginContext$4.run(LoginContext.java:682)
	at javax.security.auth.login.LoginContext$4.run(LoginContext.java:680)
	at java.security.AccessController.doPrivileged(Native Method)
	at javax.security.auth.login.LoginContext.invokePriv(LoginContext.java:680)
	at javax.security.auth.login.LoginContext.login(LoginContext.java:587)
	at org.apache.hadoop.security.UserGroupInformation$HadoopLoginContext.login(UserGroupInformation.java:1926)
	at org.apache.hadoop.security.UserGroupInformation.doSubjectLogin(UserGroupInformation.java:1837)
	... 30 more
Caused by: java.lang.SecurityException
	at javax.security.auth.login.LoginContext.invoke(LoginContext.java:841)
	... 38 more


FAILED:  org.apache.solr.core.backup.repository.HdfsBackupRepositoryTest.testHdfsHomePropertySet

Error Message:
org.apache.hadoop.security.KerberosAuthException: failure to login: javax.security.auth.login.LoginException: Security Exception

Stack Trace:
org.apache.solr.common.SolrException: org.apache.hadoop.security.KerberosAuthException: failure to login: javax.security.auth.login.LoginException: Security Exception
	at org.apache.solr.core.backup.repository.HdfsBackupRepository.init(HdfsBackupRepository.java:91)
	at org.apache.solr.core.backup.repository.HdfsBackupRepositoryTest.testHdfsHomePropertySet(HdfsBackupRepositoryTest.java:42)
	at sun.reflect.NativeMethodAccessorImpl.invoke0(Native Method)
	at sun.reflect.NativeMethodAccessorImpl.invoke(NativeMethodAccessorImpl.java:62)
	at sun.reflect.DelegatingMethodAccessorImpl.invoke(DelegatingMethodAccessorImpl.java:43)
	at java.lang.reflect.Method.invoke(Method.java:498)
	at org.junit.runners.model.FrameworkMethod$1.runReflectiveCall(FrameworkMethod.java:50)
	at org.junit.internal.runners.model.ReflectiveCallable.run(ReflectiveCallable.java:12)
	at org.junit.runners.model.FrameworkMethod.invokeExplosively(FrameworkMethod.java:47)
	at org.junit.internal.runners.statements.InvokeMethod.evaluate(InvokeMethod.java:17)
	at org.junit.runners.ParentRunner.runLeaf(ParentRunner.java:325)
	at org.junit.runners.BlockJUnit4ClassRunner.runChild(BlockJUnit4ClassRunner.java:78)
	at org.junit.runners.BlockJUnit4ClassRunner.runChild(BlockJUnit4ClassRunner.java:57)
	at org.junit.runners.ParentRunner$3.run(ParentRunner.java:290)
	at org.junit.runners.ParentRunner$1.schedule(ParentRunner.java:71)
	at org.junit.runners.ParentRunner.runChildren(ParentRunner.java:288)
	at org.junit.runners.ParentRunner.access$000(ParentRunner.java:58)
	at org.junit.runners.ParentRunner$2.evaluate(ParentRunner.java:268)
	at org.junit.runners.ParentRunner.run(ParentRunner.java:363)
	at com.carrotsearch.ant.tasks.junit4.slave.SlaveMain.execute(SlaveMain.java:269)
	at com.carrotsearch.ant.tasks.junit4.slave.SlaveMain.main(SlaveMain.java:394)
	at com.carrotsearch.ant.tasks.junit4.slave.SlaveMainSafe.main(SlaveMainSafe.java:13)
Caused by: org.apache.hadoop.security.KerberosAuthException: failure to login: javax.security.auth.login.LoginException: Security Exception
	at org.apache.hadoop.security.UserGroupInformation.doSubjectLogin(UserGroupInformation.java:1847)
	at org.apache.hadoop.security.UserGroupInformation.createLoginUser(UserGroupInformation.java:710)
	at org.apache.hadoop.security.UserGroupInformation.getLoginUser(UserGroupInformation.java:660)
	at org.apache.hadoop.security.UserGroupInformation.getCurrentUser(UserGroupInformation.java:571)
	at org.apache.hadoop.hdfs.DFSClient.<init>(DFSClient.java:322)
	at org.apache.hadoop.hdfs.DFSClient.<init>(DFSClient.java:289)
	at org.apache.hadoop.hdfs.DistributedFileSystem.initialize(DistributedFileSystem.java:176)
	at org.apache.hadoop.fs.FileSystem.createFileSystem(FileSystem.java:3303)
	at org.apache.hadoop.fs.FileSystem.get(FileSystem.java:476)
	at org.apache.solr.core.backup.repository.HdfsBackupRepository.init(HdfsBackupRepository.java:89)
	... 21 more
Caused by: javax.security.auth.login.LoginException: Security Exception
	at javax.security.auth.login.LoginContext.invoke(LoginContext.java:840)
	at javax.security.auth.login.LoginContext.access$000(LoginContext.java:195)
	at javax.security.auth.login.LoginContext$4.run(LoginContext.java:682)
	at javax.security.auth.login.LoginContext$4.run(LoginContext.java:680)
	at java.security.AccessController.doPrivileged(Native Method)
	at javax.security.auth.login.LoginContext.invokePriv(LoginContext.java:680)
	at javax.security.auth.login.LoginContext.login(LoginContext.java:587)
	at org.apache.hadoop.security.UserGroupInformation$HadoopLoginContext.login(UserGroupInformation.java:1926)
	at org.apache.hadoop.security.UserGroupInformation.doSubjectLogin(UserGroupInformation.java:1837)
	... 30 more
Caused by: java.lang.SecurityException
	at javax.security.auth.login.LoginContext.invoke(LoginContext.java:841)
	... 38 more


FAILED:  org.apache.solr.core.backup.repository.HdfsBackupRepositoryTest.testCopyBufferSet

Error Message:
org.apache.hadoop.security.KerberosAuthException: failure to login: javax.security.auth.login.LoginException: Security Exception

Stack Trace:
org.apache.solr.common.SolrException: org.apache.hadoop.security.KerberosAuthException: failure to login: javax.security.auth.login.LoginException: Security Exception
	at org.apache.solr.core.backup.repository.HdfsBackupRepository.init(HdfsBackupRepository.java:91)
	at org.apache.solr.core.backup.repository.HdfsBackupRepositoryTest.testCopyBufferSet(HdfsBackupRepositoryTest.java:83)
	at sun.reflect.NativeMethodAccessorImpl.invoke0(Native Method)
	at sun.reflect.NativeMethodAccessorImpl.invoke(NativeMethodAccessorImpl.java:62)
	at sun.reflect.DelegatingMethodAccessorImpl.invoke(DelegatingMethodAccessorImpl.java:43)
	at java.lang.reflect.Method.invoke(Method.java:498)
	at org.junit.runners.model.FrameworkMethod$1.runReflectiveCall(FrameworkMethod.java:50)
	at org.junit.internal.runners.model.ReflectiveCallable.run(ReflectiveCallable.java:12)
	at org.junit.runners.model.FrameworkMethod.invokeExplosively(FrameworkMethod.java:47)
	at org.junit.internal.runners.statements.InvokeMethod.evaluate(InvokeMethod.java:17)
	at org.junit.runners.ParentRunner.runLeaf(ParentRunner.java:325)
	at org.junit.runners.BlockJUnit4ClassRunner.runChild(BlockJUnit4ClassRunner.java:78)
	at org.junit.runners.BlockJUnit4ClassRunner.runChild(BlockJUnit4ClassRunner.java:57)
	at org.junit.runners.ParentRunner$3.run(ParentRunner.java:290)
	at org.junit.runners.ParentRunner$1.schedule(ParentRunner.java:71)
	at org.junit.runners.ParentRunner.runChildren(ParentRunner.java:288)
	at org.junit.runners.ParentRunner.access$000(ParentRunner.java:58)
	at org.junit.runners.ParentRunner$2.evaluate(ParentRunner.java:268)
	at org.junit.runners.ParentRunner.run(ParentRunner.java:363)
	at com.carrotsearch.ant.tasks.junit4.slave.SlaveMain.execute(SlaveMain.java:269)
	at com.carrotsearch.ant.tasks.junit4.slave.SlaveMain.main(SlaveMain.java:394)
	at com.carrotsearch.ant.tasks.junit4.slave.SlaveMainSafe.main(SlaveMainSafe.java:13)
Caused by: org.apache.hadoop.security.KerberosAuthException: failure to login: javax.security.auth.login.LoginException: Security Exception
	at org.apache.hadoop.security.UserGroupInformation.doSubjectLogin(UserGroupInformation.java:1847)
	at org.apache.hadoop.security.UserGroupInformation.createLoginUser(UserGroupInformation.java:710)
	at org.apache.hadoop.security.UserGroupInformation.getLoginUser(UserGroupInformation.java:660)
	at org.apache.hadoop.security.UserGroupInformation.getCurrentUser(UserGroupInformation.java:571)
	at org.apache.hadoop.hdfs.DFSClient.<init>(DFSClient.java:322)
	at org.apache.hadoop.hdfs.DFSClient.<init>(DFSClient.java:289)
	at org.apache.hadoop.hdfs.DistributedFileSystem.initialize(DistributedFileSystem.java:176)
	at org.apache.hadoop.fs.FileSystem.createFileSystem(FileSystem.java:3303)
	at org.apache.hadoop.fs.FileSystem.get(FileSystem.java:476)
	at org.apache.solr.core.backup.repository.HdfsBackupRepository.init(HdfsBackupRepository.java:89)
	... 21 more
Caused by: javax.security.auth.login.LoginException: Security Exception
	at javax.security.auth.login.LoginContext.invoke(LoginContext.java:840)
	at javax.security.auth.login.LoginContext.access$000(LoginContext.java:195)
	at javax.security.auth.login.LoginContext$4.run(LoginContext.java:682)
	at javax.security.auth.login.LoginContext$4.run(LoginContext.java:680)
	at java.security.AccessController.doPrivileged(Native Method)
	at javax.security.auth.login.LoginContext.invokePriv(LoginContext.java:680)
	at javax.security.auth.login.LoginContext.login(LoginContext.java:587)
	at org.apache.hadoop.security.UserGroupInformation$HadoopLoginContext.login(UserGroupInformation.java:1926)
	at org.apache.hadoop.security.UserGroupInformation.doSubjectLogin(UserGroupInformation.java:1837)
	... 30 more
Caused by: java.lang.SecurityException
	at javax.security.auth.login.LoginContext.invoke(LoginContext.java:841)
	... 38 more


FAILED:  junit.framework.TestSuite.org.apache.solr.handler.TestHdfsBackupRestoreCore

Error Message:
failure to login: javax.security.auth.login.LoginException: Security Exception

Stack Trace:
org.apache.hadoop.security.KerberosAuthException: failure to login: javax.security.auth.login.LoginException: Security Exception
	at __randomizedtesting.SeedInfo.seed([4A996A0BC8F49F27]:0)
	at org.apache.hadoop.security.UserGroupInformation.doSubjectLogin(UserGroupInformation.java:1847)
	at org.apache.hadoop.security.UserGroupInformation.createLoginUser(UserGroupInformation.java:710)
	at org.apache.hadoop.security.UserGroupInformation.getLoginUser(UserGroupInformation.java:660)
	at org.apache.hadoop.security.UserGroupInformation.getCurrentUser(UserGroupInformation.java:571)
	at org.apache.hadoop.hdfs.server.namenode.FSNamesystem.<init>(FSNamesystem.java:767)
	at org.apache.hadoop.hdfs.server.namenode.FSNamesystem.<init>(FSNamesystem.java:733)
	at org.apache.hadoop.hdfs.server.namenode.NameNode.format(NameNode.java:1140)
	at org.apache.hadoop.hdfs.server.namenode.NameNode.format(NameNode.java:409)
	at org.apache.hadoop.hdfs.DFSTestUtil.formatNameNode(DFSTestUtil.java:261)
	at org.apache.hadoop.hdfs.MiniDFSCluster.configureNameService(MiniDFSCluster.java:1072)
	at org.apache.hadoop.hdfs.MiniDFSCluster.createNameNodesAndSetConf(MiniDFSCluster.java:958)
	at org.apache.hadoop.hdfs.MiniDFSCluster.initMiniDFSCluster(MiniDFSCluster.java:890)
	at org.apache.hadoop.hdfs.MiniDFSCluster.<init>(MiniDFSCluster.java:518)
	at org.apache.hadoop.hdfs.MiniDFSCluster$Builder.build(MiniDFSCluster.java:477)
	at org.apache.solr.cloud.hdfs.HdfsTestUtil.setupClass(HdfsTestUtil.java:134)
	at org.apache.solr.cloud.hdfs.HdfsTestUtil.setupClass(HdfsTestUtil.java:66)
	at org.apache.solr.handler.TestHdfsBackupRestoreCore.setupClass(TestHdfsBackupRestoreCore.java:106)
	at sun.reflect.NativeMethodAccessorImpl.invoke0(Native Method)
	at sun.reflect.NativeMethodAccessorImpl.invoke(NativeMethodAccessorImpl.java:62)
	at sun.reflect.DelegatingMethodAccessorImpl.invoke(DelegatingMethodAccessorImpl.java:43)
	at java.lang.reflect.Method.invoke(Method.java:498)
	at com.carrotsearch.randomizedtesting.RandomizedRunner.invoke(RandomizedRunner.java:1750)
	at com.carrotsearch.randomizedtesting.RandomizedRunner$6.evaluate(RandomizedRunner.java:878)
	at com.carrotsearch.randomizedtesting.RandomizedRunner$7.evaluate(RandomizedRunner.java:894)
	at com.carrotsearch.randomizedtesting.rules.StatementAdapter.evaluate(StatementAdapter.java:36)
	at com.carrotsearch.randomizedtesting.rules.SystemPropertiesRestoreRule$1.evaluate(SystemPropertiesRestoreRule.java:57)
	at org.apache.lucene.util.AbstractBeforeAfterRule$1.evaluate(AbstractBeforeAfterRule.java:45)
	at com.carrotsearch.randomizedtesting.rules.StatementAdapter.evaluate(StatementAdapter.java:36)
	at org.apache.lucene.util.TestRuleStoreClassName$1.evaluate(TestRuleStoreClassName.java:41)
	at com.carrotsearch.randomizedtesting.rules.NoShadowingOrOverridesOnMethodsRule$1.evaluate(NoShadowingOrOverridesOnMethodsRule.java:40)
	at com.carrotsearch.randomizedtesting.rules.NoShadowingOrOverridesOnMethodsRule$1.evaluate(NoShadowingOrOverridesOnMethodsRule.java:40)
	at com.carrotsearch.randomizedtesting.rules.StatementAdapter.evaluate(StatementAdapter.java:36)
	at com.carrotsearch.randomizedtesting.rules.StatementAdapter.evaluate(StatementAdapter.java:36)
	at com.carrotsearch.randomizedtesting.rules.StatementAdapter.evaluate(StatementAdapter.java:36)
	at org.apache.lucene.util.TestRuleAssertionsRequired$1.evaluate(TestRuleAssertionsRequired.java:53)
	at org.apache.lucene.util.TestRuleMarkFailure$1.evaluate(TestRuleMarkFailure.java:47)
	at org.apache.lucene.util.TestRuleIgnoreAfterMaxFailures$1.evaluate(TestRuleIgnoreAfterMaxFailures.java:64)
	at org.apache.lucene.util.TestRuleIgnoreTestSuites$1.evaluate(TestRuleIgnoreTestSuites.java:54)
	at com.carrotsearch.randomizedtesting.rules.StatementAdapter.evaluate(StatementAdapter.java:36)
	at com.carrotsearch.randomizedtesting.ThreadLeakControl$StatementRunner.run(ThreadLeakControl.java:368)
	at java.lang.Thread.run(Thread.java:748)
Caused by: javax.security.auth.login.LoginException: Security Exception
	at javax.security.auth.login.LoginContext.invoke(LoginContext.java:840)
	at javax.security.auth.login.LoginContext.access$000(LoginContext.java:195)
	at javax.security.auth.login.LoginContext$4.run(LoginContext.java:682)
	at javax.security.auth.login.LoginContext$4.run(LoginContext.java:680)
	at java.security.AccessController.doPrivileged(Native Method)
	at javax.security.auth.login.LoginContext.invokePriv(LoginContext.java:680)
	at javax.security.auth.login.LoginContext.login(LoginContext.java:587)
	at org.apache.hadoop.security.UserGroupInformation$HadoopLoginContext.login(UserGroupInformation.java:1926)
	at org.apache.hadoop.security.UserGroupInformation.doSubjectLogin(UserGroupInformation.java:1837)
	... 40 more
Caused by: java.lang.SecurityException
	at javax.security.auth.login.LoginContext.invoke(LoginContext.java:841)
	... 48 more


FAILED:  junit.framework.TestSuite.org.apache.solr.index.hdfs.CheckHdfsIndexTest

Error Message:
failure to login: javax.security.auth.login.LoginException: Security Exception

Stack Trace:
org.apache.hadoop.security.KerberosAuthException: failure to login: javax.security.auth.login.LoginException: Security Exception
	at __randomizedtesting.SeedInfo.seed([4A996A0BC8F49F27]:0)
	at org.apache.hadoop.security.UserGroupInformation.doSubjectLogin(UserGroupInformation.java:1847)
	at org.apache.hadoop.security.UserGroupInformation.createLoginUser(UserGroupInformation.java:710)
	at org.apache.hadoop.security.UserGroupInformation.getLoginUser(UserGroupInformation.java:660)
	at org.apache.hadoop.security.UserGroupInformation.getCurrentUser(UserGroupInformation.java:571)
	at org.apache.hadoop.hdfs.server.namenode.FSNamesystem.<init>(FSNamesystem.java:767)
	at org.apache.hadoop.hdfs.server.namenode.FSNamesystem.<init>(FSNamesystem.java:733)
	at org.apache.hadoop.hdfs.server.namenode.NameNode.format(NameNode.java:1140)
	at org.apache.hadoop.hdfs.server.namenode.NameNode.format(NameNode.java:409)
	at org.apache.hadoop.hdfs.DFSTestUtil.formatNameNode(DFSTestUtil.java:261)
	at org.apache.hadoop.hdfs.MiniDFSCluster.configureNameService(MiniDFSCluster.java:1072)
	at org.apache.hadoop.hdfs.MiniDFSCluster.createNameNodesAndSetConf(MiniDFSCluster.java:958)
	at org.apache.hadoop.hdfs.MiniDFSCluster.initMiniDFSCluster(MiniDFSCluster.java:890)
	at org.apache.hadoop.hdfs.MiniDFSCluster.<init>(MiniDFSCluster.java:518)
	at org.apache.hadoop.hdfs.MiniDFSCluster$Builder.build(MiniDFSCluster.java:477)
	at org.apache.solr.cloud.hdfs.HdfsTestUtil.setupClass(HdfsTestUtil.java:134)
	at org.apache.solr.cloud.hdfs.HdfsTestUtil.setupClass(HdfsTestUtil.java:66)
	at org.apache.solr.index.hdfs.CheckHdfsIndexTest.setupClass(CheckHdfsIndexTest.java:64)
	at sun.reflect.NativeMethodAccessorImpl.invoke0(Native Method)
	at sun.reflect.NativeMethodAccessorImpl.invoke(NativeMethodAccessorImpl.java:62)
	at sun.reflect.DelegatingMethodAccessorImpl.invoke(DelegatingMethodAccessorImpl.java:43)
	at java.lang.reflect.Method.invoke(Method.java:498)
	at com.carrotsearch.randomizedtesting.RandomizedRunner.invoke(RandomizedRunner.java:1750)
	at com.carrotsearch.randomizedtesting.RandomizedRunner$6.evaluate(RandomizedRunner.java:878)
	at com.carrotsearch.randomizedtesting.RandomizedRunner$7.evaluate(RandomizedRunner.java:894)
	at com.carrotsearch.randomizedtesting.rules.StatementAdapter.evaluate(StatementAdapter.java:36)
	at com.carrotsearch.randomizedtesting.rules.SystemPropertiesRestoreRule$1.evaluate(SystemPropertiesRestoreRule.java:57)
	at org.apache.lucene.util.AbstractBeforeAfterRule$1.evaluate(AbstractBeforeAfterRule.java:45)
	at com.carrotsearch.randomizedtesting.rules.StatementAdapter.evaluate(StatementAdapter.java:36)
	at org.apache.lucene.util.TestRuleStoreClassName$1.evaluate(TestRuleStoreClassName.java:41)
	at com.carrotsearch.randomizedtesting.rules.NoShadowingOrOverridesOnMethodsRule$1.evaluate(NoShadowingOrOverridesOnMethodsRule.java:40)
	at com.carrotsearch.randomizedtesting.rules.NoShadowingOrOverridesOnMethodsRule$1.evaluate(NoShadowingOrOverridesOnMethodsRule.java:40)
	at com.carrotsearch.randomizedtesting.rules.StatementAdapter.evaluate(StatementAdapter.java:36)
	at com.carrotsearch.randomizedtesting.rules.StatementAdapter.evaluate(StatementAdapter.java:36)
	at com.carrotsearch.randomizedtesting.rules.StatementAdapter.evaluate(StatementAdapter.java:36)
	at org.apache.lucene.util.TestRuleAssertionsRequired$1.evaluate(TestRuleAssertionsRequired.java:53)
	at org.apache.lucene.util.TestRuleMarkFailure$1.evaluate(TestRuleMarkFailure.java:47)
	at org.apache.lucene.util.TestRuleIgnoreAfterMaxFailures$1.evaluate(TestRuleIgnoreAfterMaxFailures.java:64)
	at org.apache.lucene.util.TestRuleIgnoreTestSuites$1.evaluate(TestRuleIgnoreTestSuites.java:54)
	at com.carrotsearch.randomizedtesting.rules.StatementAdapter.evaluate(StatementAdapter.java:36)
	at com.carrotsearch.randomizedtesting.ThreadLeakControl$StatementRunner.run(ThreadLeakControl.java:368)
	at java.lang.Thread.run(Thread.java:748)
Caused by: javax.security.auth.login.LoginException: Security Exception
	at javax.security.auth.login.LoginContext.invoke(LoginContext.java:840)
	at javax.security.auth.login.LoginContext.access$000(LoginContext.java:195)
	at javax.security.auth.login.LoginContext$4.run(LoginContext.java:682)
	at javax.security.auth.login.LoginContext$4.run(LoginContext.java:680)
	at java.security.AccessController.doPrivileged(Native Method)
	at javax.security.auth.login.LoginContext.invokePriv(LoginContext.java:680)
	at javax.security.auth.login.LoginContext.login(LoginContext.java:587)
	at org.apache.hadoop.security.UserGroupInformation$HadoopLoginContext.login(UserGroupInformation.java:1926)
	at org.apache.hadoop.security.UserGroupInformation.doSubjectLogin(UserGroupInformation.java:1837)
	... 40 more
Caused by: java.lang.SecurityException
	at javax.security.auth.login.LoginContext.invoke(LoginContext.java:841)
	... 48 more


FAILED:  junit.framework.TestSuite.org.apache.solr.search.TestRecoveryHdfs

Error Message:
failure to login: javax.security.auth.login.LoginException: Security Exception

Stack Trace:
org.apache.hadoop.security.KerberosAuthException: failure to login: javax.security.auth.login.LoginException: Security Exception
	at __randomizedtesting.SeedInfo.seed([4A996A0BC8F49F27]:0)
	at org.apache.hadoop.security.UserGroupInformation.doSubjectLogin(UserGroupInformation.java:1847)
	at org.apache.hadoop.security.UserGroupInformation.createLoginUser(UserGroupInformation.java:710)
	at org.apache.hadoop.security.UserGroupInformation.getLoginUser(UserGroupInformation.java:660)
	at org.apache.hadoop.security.UserGroupInformation.getCurrentUser(UserGroupInformation.java:571)
	at org.apache.hadoop.hdfs.server.namenode.FSNamesystem.<init>(FSNamesystem.java:767)
	at org.apache.hadoop.hdfs.server.namenode.FSNamesystem.<init>(FSNamesystem.java:733)
	at org.apache.hadoop.hdfs.server.namenode.NameNode.format(NameNode.java:1140)
	at org.apache.hadoop.hdfs.server.namenode.NameNode.format(NameNode.java:409)
	at org.apache.hadoop.hdfs.DFSTestUtil.formatNameNode(DFSTestUtil.java:261)
	at org.apache.hadoop.hdfs.MiniDFSCluster.configureNameService(MiniDFSCluster.java:1072)
	at org.apache.hadoop.hdfs.MiniDFSCluster.createNameNodesAndSetConf(MiniDFSCluster.java:958)
	at org.apache.hadoop.hdfs.MiniDFSCluster.initMiniDFSCluster(MiniDFSCluster.java:890)
	at org.apache.hadoop.hdfs.MiniDFSCluster.<init>(MiniDFSCluster.java:518)
	at org.apache.hadoop.hdfs.MiniDFSCluster$Builder.build(MiniDFSCluster.java:477)
	at org.apache.solr.cloud.hdfs.HdfsTestUtil.setupClass(HdfsTestUtil.java:134)
	at org.apache.solr.cloud.hdfs.HdfsTestUtil.setupClass(HdfsTestUtil.java:66)
	at org.apache.solr.search.TestRecoveryHdfs.beforeClass(TestRecoveryHdfs.java:78)
	at sun.reflect.NativeMethodAccessorImpl.invoke0(Native Method)
	at sun.reflect.NativeMethodAccessorImpl.invoke(NativeMethodAccessorImpl.java:62)
	at sun.reflect.DelegatingMethodAccessorImpl.invoke(DelegatingMethodAccessorImpl.java:43)
	at java.lang.reflect.Method.invoke(Method.java:498)
	at com.carrotsearch.randomizedtesting.RandomizedRunner.invoke(RandomizedRunner.java:1750)
	at com.carrotsearch.randomizedtesting.RandomizedRunner$6.evaluate(RandomizedRunner.java:878)
	at com.carrotsearch.randomizedtesting.RandomizedRunner$7.evaluate(RandomizedRunner.java:894)
	at com.carrotsearch.randomizedtesting.rules.StatementAdapter.evaluate(StatementAdapter.java:36)
	at com.carrotsearch.randomizedtesting.rules.SystemPropertiesRestoreRule$1.evaluate(SystemPropertiesRestoreRule.java:57)
	at org.apache.lucene.util.AbstractBeforeAfterRule$1.evaluate(AbstractBeforeAfterRule.java:45)
	at com.carrotsearch.randomizedtesting.rules.StatementAdapter.evaluate(StatementAdapter.java:36)
	at org.apache.lucene.util.TestRuleStoreClassName$1.evaluate(TestRuleStoreClassName.java:41)
	at com.carrotsearch.randomizedtesting.rules.NoShadowingOrOverridesOnMethodsRule$1.evaluate(NoShadowingOrOverridesOnMethodsRule.java:40)
	at com.carrotsearch.randomizedtesting.rules.NoShadowingOrOverridesOnMethodsRule$1.evaluate(NoShadowingOrOverridesOnMethodsRule.java:40)
	at com.carrotsearch.randomizedtesting.rules.StatementAdapter.evaluate(StatementAdapter.java:36)
	at com.carrotsearch.randomizedtesting.rules.StatementAdapter.evaluate(StatementAdapter.java:36)
	at com.carrotsearch.randomizedtesting.rules.StatementAdapter.evaluate(StatementAdapter.java:36)
	at org.apache.lucene.util.TestRuleAssertionsRequired$1.evaluate(TestRuleAssertionsRequired.java:53)
	at org.apache.lucene.util.TestRuleMarkFailure$1.evaluate(TestRuleMarkFailure.java:47)
	at org.apache.lucene.util.TestRuleIgnoreAfterMaxFailures$1.evaluate(TestRuleIgnoreAfterMaxFailures.java:64)
	at org.apache.lucene.util.TestRuleIgnoreTestSuites$1.evaluate(TestRuleIgnoreTestSuites.java:54)
	at com.carrotsearch.randomizedtesting.rules.StatementAdapter.evaluate(StatementAdapter.java:36)
	at com.carrotsearch.randomizedtesting.ThreadLeakControl$StatementRunner.run(ThreadLeakControl.java:368)
	at java.lang.Thread.run(Thread.java:748)
Caused by: javax.security.auth.login.LoginException: Security Exception
	at javax.security.auth.login.LoginContext.invoke(LoginContext.java:840)
	at javax.security.auth.login.LoginContext.access$000(LoginContext.java:195)
	at javax.security.auth.login.LoginContext$4.run(LoginContext.java:682)
	at javax.security.auth.login.LoginContext$4.run(LoginContext.java:680)
	at java.security.AccessController.doPrivileged(Native Method)
	at javax.security.auth.login.LoginContext.invokePriv(LoginContext.java:680)
	at javax.security.auth.login.LoginContext.login(LoginContext.java:587)
	at org.apache.hadoop.security.UserGroupInformation$HadoopLoginContext.login(UserGroupInformation.java:1926)
	at org.apache.hadoop.security.UserGroupInformation.doSubjectLogin(UserGroupInformation.java:1837)
	... 40 more
Caused by: java.lang.SecurityException
	at javax.security.auth.login.LoginContext.invoke(LoginContext.java:841)
	... 48 more


FAILED:  junit.framework.TestSuite.org.apache.solr.store.hdfs.HdfsDirectoryTest

Error Message:
failure to login: javax.security.auth.login.LoginException: Security Exception

Stack Trace:
org.apache.hadoop.security.KerberosAuthException: failure to login: javax.security.auth.login.LoginException: Security Exception
	at __randomizedtesting.SeedInfo.seed([4A996A0BC8F49F27]:0)
	at org.apache.hadoop.security.UserGroupInformation.doSubjectLogin(UserGroupInformation.java:1847)
	at org.apache.hadoop.security.UserGroupInformation.createLoginUser(UserGroupInformation.java:710)
	at org.apache.hadoop.security.UserGroupInformation.getLoginUser(UserGroupInformation.java:660)
	at org.apache.hadoop.security.UserGroupInformation.getCurrentUser(UserGroupInformation.java:571)
	at org.apache.hadoop.hdfs.server.namenode.FSNamesystem.<init>(FSNamesystem.java:767)
	at org.apache.hadoop.hdfs.server.namenode.FSNamesystem.<init>(FSNamesystem.java:733)
	at org.apache.hadoop.hdfs.server.namenode.NameNode.format(NameNode.java:1140)
	at org.apache.hadoop.hdfs.server.namenode.NameNode.format(NameNode.java:409)
	at org.apache.hadoop.hdfs.DFSTestUtil.formatNameNode(DFSTestUtil.java:261)
	at org.apache.hadoop.hdfs.MiniDFSCluster.configureNameService(MiniDFSCluster.java:1072)
	at org.apache.hadoop.hdfs.MiniDFSCluster.createNameNodesAndSetConf(MiniDFSCluster.java:958)
	at org.apache.hadoop.hdfs.MiniDFSCluster.initMiniDFSCluster(MiniDFSCluster.java:890)
	at org.apache.hadoop.hdfs.MiniDFSCluster.<init>(MiniDFSCluster.java:518)
	at org.apache.hadoop.hdfs.MiniDFSCluster$Builder.build(MiniDFSCluster.java:477)
	at org.apache.solr.cloud.hdfs.HdfsTestUtil.setupClass(HdfsTestUtil.java:134)
	at org.apache.solr.cloud.hdfs.HdfsTestUtil.setupClass(HdfsTestUtil.java:66)
	at org.apache.solr.store.hdfs.HdfsDirectoryTest.beforeClass(HdfsDirectoryTest.java:60)
	at sun.reflect.NativeMethodAccessorImpl.invoke0(Native Method)
	at sun.reflect.NativeMethodAccessorImpl.invoke(NativeMethodAccessorImpl.java:62)
	at sun.reflect.DelegatingMethodAccessorImpl.invoke(DelegatingMethodAccessorImpl.java:43)
	at java.lang.reflect.Method.invoke(Method.java:498)
	at com.carrotsearch.randomizedtesting.RandomizedRunner.invoke(RandomizedRunner.java:1750)
	at com.carrotsearch.randomizedtesting.RandomizedRunner$6.evaluate(RandomizedRunner.java:878)
	at com.carrotsearch.randomizedtesting.RandomizedRunner$7.evaluate(RandomizedRunner.java:894)
	at com.carrotsearch.randomizedtesting.rules.StatementAdapter.evaluate(StatementAdapter.java:36)
	at com.carrotsearch.randomizedtesting.rules.SystemPropertiesRestoreRule$1.evaluate(SystemPropertiesRestoreRule.java:57)
	at org.apache.lucene.util.AbstractBeforeAfterRule$1.evaluate(AbstractBeforeAfterRule.java:45)
	at com.carrotsearch.randomizedtesting.rules.StatementAdapter.evaluate(StatementAdapter.java:36)
	at org.apache.lucene.util.TestRuleStoreClassName$1.evaluate(TestRuleStoreClassName.java:41)
	at com.carrotsearch.randomizedtesting.rules.NoShadowingOrOverridesOnMethodsRule$1.evaluate(NoShadowingOrOverridesOnMethodsRule.java:40)
	at com.carrotsearch.randomizedtesting.rules.NoShadowingOrOverridesOnMethodsRule$1.evaluate(NoShadowingOrOverridesOnMethodsRule.java:40)
	at com.carrotsearch.randomizedtesting.rules.StatementAdapter.evaluate(StatementAdapter.java:36)
	at com.carrotsearch.randomizedtesting.rules.StatementAdapter.evaluate(StatementAdapter.java:36)
	at com.carrotsearch.randomizedtesting.rules.StatementAdapter.evaluate(StatementAdapter.java:36)
	at org.apache.lucene.util.TestRuleAssertionsRequired$1.evaluate(TestRuleAssertionsRequired.java:53)
	at org.apache.lucene.util.TestRuleMarkFailure$1.evaluate(TestRuleMarkFailure.java:47)
	at org.apache.lucene.util.TestRuleIgnoreAfterMaxFailures$1.evaluate(TestRuleIgnoreAfterMaxFailures.java:64)
	at org.apache.lucene.util.TestRuleIgnoreTestSuites$1.evaluate(TestRuleIgnoreTestSuites.java:54)
	at com.carrotsearch.randomizedtesting.rules.StatementAdapter.evaluate(StatementAdapter.java:36)
	at com.carrotsearch.randomizedtesting.ThreadLeakControl$StatementRunner.run(ThreadLeakControl.java:368)
	at java.lang.Thread.run(Thread.java:748)
Caused by: javax.security.auth.login.LoginException: Security Exception
	at javax.security.auth.login.LoginContext.invoke(LoginContext.java:840)
	at javax.security.auth.login.LoginContext.access$000(LoginContext.java:195)
	at javax.security.auth.login.LoginContext$4.run(LoginContext.java:682)
	at javax.security.auth.login.LoginContext$4.run(LoginContext.java:680)
	at java.security.AccessController.doPrivileged(Native Method)
	at javax.security.auth.login.LoginContext.invokePriv(LoginContext.java:680)
	at javax.security.auth.login.LoginContext.login(LoginContext.java:587)
	at org.apache.hadoop.security.UserGroupInformation$HadoopLoginContext.login(UserGroupInformation.java:1926)
	at org.apache.hadoop.security.UserGroupInformation.doSubjectLogin(UserGroupInformation.java:1837)
	... 40 more
Caused by: java.lang.SecurityException
	at javax.security.auth.login.LoginContext.invoke(LoginContext.java:841)
	... 48 more


FAILED:  junit.framework.TestSuite.org.apache.solr.update.TestHdfsUpdateLog

Error Message:
failure to login: javax.security.auth.login.LoginException: Security Exception

Stack Trace:
org.apache.hadoop.security.KerberosAuthException: failure to login: javax.security.auth.login.LoginException: Security Exception
	at __randomizedtesting.SeedInfo.seed([4A996A0BC8F49F27]:0)
	at org.apache.hadoop.security.UserGroupInformation.doSubjectLogin(UserGroupInformation.java:1847)
	at org.apache.hadoop.security.UserGroupInformation.createLoginUser(UserGroupInformation.java:710)
	at org.apache.hadoop.security.UserGroupInformation.getLoginUser(UserGroupInformation.java:660)
	at org.apache.hadoop.security.UserGroupInformation.getCurrentUser(UserGroupInformation.java:571)
	at org.apache.hadoop.hdfs.server.namenode.FSNamesystem.<init>(FSNamesystem.java:767)
	at org.apache.hadoop.hdfs.server.namenode.FSNamesystem.<init>(FSNamesystem.java:733)
	at org.apache.hadoop.hdfs.server.namenode.NameNode.format(NameNode.java:1140)
	at org.apache.hadoop.hdfs.server.namenode.NameNode.format(NameNode.java:409)
	at org.apache.hadoop.hdfs.DFSTestUtil.formatNameNode(DFSTestUtil.java:261)
	at org.apache.hadoop.hdfs.MiniDFSCluster.configureNameService(MiniDFSCluster.java:1072)
	at org.apache.hadoop.hdfs.MiniDFSCluster.createNameNodesAndSetConf(MiniDFSCluster.java:958)
	at org.apache.hadoop.hdfs.MiniDFSCluster.initMiniDFSCluster(MiniDFSCluster.java:890)
	at org.apache.hadoop.hdfs.MiniDFSCluster.<init>(MiniDFSCluster.java:518)
	at org.apache.hadoop.hdfs.MiniDFSCluster$Builder.build(MiniDFSCluster.java:477)
	at org.apache.solr.cloud.hdfs.HdfsTestUtil.setupClass(HdfsTestUtil.java:134)
	at org.apache.solr.cloud.hdfs.HdfsTestUtil.setupClass(HdfsTestUtil.java:66)
	at org.apache.solr.update.TestHdfsUpdateLog.beforeClass(TestHdfsUpdateLog.java:47)
	at sun.reflect.NativeMethodAccessorImpl.invoke0(Native Method)
	at sun.reflect.NativeMethodAccessorImpl.invoke(NativeMethodAccessorImpl.java:62)
	at sun.reflect.DelegatingMethodAccessorImpl.invoke(DelegatingMethodAccessorImpl.java:43)
	at java.lang.reflect.Method.invoke(Method.java:498)
	at com.carrotsearch.randomizedtesting.RandomizedRunner.invoke(RandomizedRunner.java:1750)
	at com.carrotsearch.randomizedtesting.RandomizedRunner$6.evaluate(RandomizedRunner.java:878)
	at com.carrotsearch.randomizedtesting.RandomizedRunner$7.evaluate(RandomizedRunner.java:894)
	at com.carrotsearch.randomizedtesting.rules.StatementAdapter.evaluate(StatementAdapter.java:36)
	at com.carrotsearch.randomizedtesting.rules.SystemPropertiesRestoreRule$1.evaluate(SystemPropertiesRestoreRule.java:57)
	at org.apache.lucene.util.AbstractBeforeAfterRule$1.evaluate(AbstractBeforeAfterRule.java:45)
	at com.carrotsearch.randomizedtesting.rules.StatementAdapter.evaluate(StatementAdapter.java:36)
	at org.apache.lucene.util.TestRuleStoreClassName$1.evaluate(TestRuleStoreClassName.java:41)
	at com.carrotsearch.randomizedtesting.rules.NoShadowingOrOverridesOnMethodsRule$1.evaluate(NoShadowingOrOverridesOnMethodsRule.java:40)
	at com.carrotsearch.randomizedtesting.rules.NoShadowingOrOverridesOnMethodsRule$1.evaluate(NoShadowingOrOverridesOnMethodsRule.java:40)
	at com.carrotsearch.randomizedtesting.rules.StatementAdapter.evaluate(StatementAdapter.java:36)
	at com.carrotsearch.randomizedtesting.rules.StatementAdapter.evaluate(StatementAdapter.java:36)
	at com.carrotsearch.randomizedtesting.rules.StatementAdapter.evaluate(StatementAdapter.java:36)
	at org.apache.lucene.util.TestRuleAssertionsRequired$1.evaluate(TestRuleAssertionsRequired.java:53)
	at org.apache.lucene.util.TestRuleMarkFailure$1.evaluate(TestRuleMarkFailure.java:47)
	at org.apache.lucene.util.TestRuleIgnoreAfterMaxFailures$1.evaluate(TestRuleIgnoreAfterMaxFailures.java:64)
	at org.apache.lucene.util.TestRuleIgnoreTestSuites$1.evaluate(TestRuleIgnoreTestSuites.java:54)
	at com.carrotsearch.randomizedtesting.rules.StatementAdapter.evaluate(StatementAdapter.java:36)
	at com.carrotsearch.randomizedtesting.ThreadLeakControl$StatementRunner.run(ThreadLeakControl.java:368)
	at java.lang.Thread.run(Thread.java:748)
Caused by: javax.security.auth.login.LoginException: Security Exception
	at javax.security.auth.login.LoginContext.invoke(LoginContext.java:840)
	at javax.security.auth.login.LoginContext.access$000(LoginContext.java:195)
	at javax.security.auth.login.LoginContext$4.run(LoginContext.java:682)
	at javax.security.auth.login.LoginContext$4.run(LoginContext.java:680)
	at java.security.AccessController.doPrivileged(Native Method)
	at javax.security.auth.login.LoginContext.invokePriv(LoginContext.java:680)
	at javax.security.auth.login.LoginContext.login(LoginContext.java:587)
	at org.apache.hadoop.security.UserGroupInformation$HadoopLoginContext.login(UserGroupInformation.java:1926)
	at org.apache.hadoop.security.UserGroupInformation.doSubjectLogin(UserGroupInformation.java:1837)
	... 40 more
Caused by: java.lang.SecurityException
	at javax.security.auth.login.LoginContext.invoke(LoginContext.java:841)
	... 48 more




Build Log:
[...truncated 13366 lines...]
   [junit4] Suite: org.apache.solr.cloud.hdfs.HDFSCollectionsAPITest
   [junit4]   2> 103725 INFO  (SUITE-HDFSCollectionsAPITest-seed#[4A996A0BC8F49F27]-worker) [     ] o.a.s.SolrTestCaseJ4 Created dataDir: /home/jenkins/jenkins-slave/workspace/Lucene-Solr-Tests-8.x/solr/build/solr-core/test/J2/temp/solr.cloud.hdfs.HDFSCollectionsAPITest_4A996A0BC8F49F27-001/data-dir-15-001
   [junit4]   2> 103725 WARN  (SUITE-HDFSCollectionsAPITest-seed#[4A996A0BC8F49F27]-worker) [     ] o.a.s.SolrTestCaseJ4 startTrackingSearchers: numOpens=14 numCloses=14
   [junit4]   2> 103725 INFO  (SUITE-HDFSCollectionsAPITest-seed#[4A996A0BC8F49F27]-worker) [     ] o.a.s.SolrTestCaseJ4 Using PointFields (NUMERIC_POINTS_SYSPROP=true) w/NUMERIC_DOCVALUES_SYSPROP=true
   [junit4]   2> 103727 INFO  (SUITE-HDFSCollectionsAPITest-seed#[4A996A0BC8F49F27]-worker) [     ] o.a.s.SolrTestCaseJ4 Randomized ssl (true) and clientAuth (true) via: @org.apache.solr.util.RandomizeSSL(reason=, value=NaN, ssl=NaN, clientAuth=NaN)
   [junit4]   2> 103728 INFO  (SUITE-HDFSCollectionsAPITest-seed#[4A996A0BC8F49F27]-worker) [     ] o.a.s.SolrTestCaseJ4 SecureRandom sanity checks: test.solr.allowed.securerandom=null & java.security.egd=file:/dev/./urandom
   [junit4]   2> 103728 INFO  (SUITE-HDFSCollectionsAPITest-seed#[4A996A0BC8F49F27]-worker) [     ] o.a.s.c.MiniSolrCloudCluster Starting cluster of 2 servers in /home/jenkins/jenkins-slave/workspace/Lucene-Solr-Tests-8.x/solr/build/solr-core/test/J2/temp/solr.cloud.hdfs.HDFSCollectionsAPITest_4A996A0BC8F49F27-001/tempDir-001
   [junit4]   2> 103728 INFO  (SUITE-HDFSCollectionsAPITest-seed#[4A996A0BC8F49F27]-worker) [     ] o.a.s.c.ZkTestServer STARTING ZK TEST SERVER
   [junit4]   2> 103728 INFO  (ZkTestServer Run Thread) [     ] o.a.s.c.ZkTestServer client port:0.0.0.0/0.0.0.0:0
   [junit4]   2> 103729 INFO  (ZkTestServer Run Thread) [     ] o.a.s.c.ZkTestServer Starting server
   [junit4]   2> 103828 INFO  (SUITE-HDFSCollectionsAPITest-seed#[4A996A0BC8F49F27]-worker) [     ] o.a.s.c.ZkTestServer start zk server on port:32925
   [junit4]   2> 103829 INFO  (SUITE-HDFSCollectionsAPITest-seed#[4A996A0BC8F49F27]-worker) [     ] o.a.s.c.ZkTestServer waitForServerUp: 127.0.0.1:32925
   [junit4]   2> 103829 INFO  (SUITE-HDFSCollectionsAPITest-seed#[4A996A0BC8F49F27]-worker) [     ] o.a.s.c.ZkTestServer parse host and port list: 127.0.0.1:32925
   [junit4]   2> 103829 INFO  (SUITE-HDFSCollectionsAPITest-seed#[4A996A0BC8F49F27]-worker) [     ] o.a.s.c.ZkTestServer connecting to 127.0.0.1 32925
   [junit4]   2> 103830 INFO  (SUITE-HDFSCollectionsAPITest-seed#[4A996A0BC8F49F27]-worker) [     ] o.a.s.c.c.ConnectionManager Waiting for client to connect to ZooKeeper
   [junit4]   2> 103832 INFO  (zkConnectionManagerCallback-308-thread-1) [     ] o.a.s.c.c.ConnectionManager zkClient has connected
   [junit4]   2> 103832 INFO  (SUITE-HDFSCollectionsAPITest-seed#[4A996A0BC8F49F27]-worker) [     ] o.a.s.c.c.ConnectionManager Client is connected to ZooKeeper
   [junit4]   2> 103835 INFO  (SUITE-HDFSCollectionsAPITest-seed#[4A996A0BC8F49F27]-worker) [     ] o.a.s.c.c.ConnectionManager Waiting for client to connect to ZooKeeper
   [junit4]   2> 103843 INFO  (zkConnectionManagerCallback-310-thread-1) [     ] o.a.s.c.c.ConnectionManager zkClient has connected
   [junit4]   2> 103843 INFO  (SUITE-HDFSCollectionsAPITest-seed#[4A996A0BC8F49F27]-worker) [     ] o.a.s.c.c.ConnectionManager Client is connected to ZooKeeper
   [junit4]   2> 103848 INFO  (SUITE-HDFSCollectionsAPITest-seed#[4A996A0BC8F49F27]-worker) [     ] o.a.s.c.c.ConnectionManager Waiting for client to connect to ZooKeeper
   [junit4]   2> 103853 INFO  (zkConnectionManagerCallback-312-thread-1) [     ] o.a.s.c.c.ConnectionManager zkClient has connected
   [junit4]   2> 103853 INFO  (SUITE-HDFSCollectionsAPITest-seed#[4A996A0BC8F49F27]-worker) [     ] o.a.s.c.c.ConnectionManager Client is connected to ZooKeeper
   [junit4]   2> 103966 WARN  (jetty-launcher-313-thread-1) [     ] o.e.j.s.AbstractConnector Ignoring deprecated socket close linger time
   [junit4]   2> 103966 INFO  (jetty-launcher-313-thread-1) [     ] o.a.s.c.s.e.JettySolrRunner Start Jetty (configured port=0, binding port=0)
   [junit4]   2> 103966 INFO  (jetty-launcher-313-thread-1) [     ] o.a.s.c.s.e.JettySolrRunner Trying to start Jetty on port 0 try number 1 ...
   [junit4]   2> 103967 INFO  (jetty-launcher-313-thread-1) [     ] o.e.j.s.Server jetty-9.4.19.v20190610; built: 2019-06-10T16:30:51.723Z; git: afcf563148970e98786327af5e07c261fda175d3; jvm 1.8.0_191-b12
   [junit4]   2> 103967 WARN  (jetty-launcher-313-thread-2) [     ] o.e.j.s.AbstractConnector Ignoring deprecated socket close linger time
   [junit4]   2> 103968 INFO  (jetty-launcher-313-thread-2) [     ] o.a.s.c.s.e.JettySolrRunner Start Jetty (configured port=0, binding port=0)
   [junit4]   2> 103968 INFO  (jetty-launcher-313-thread-2) [     ] o.a.s.c.s.e.JettySolrRunner Trying to start Jetty on port 0 try number 1 ...
   [junit4]   2> 103968 INFO  (jetty-launcher-313-thread-2) [     ] o.e.j.s.Server jetty-9.4.19.v20190610; built: 2019-06-10T16:30:51.723Z; git: afcf563148970e98786327af5e07c261fda175d3; jvm 1.8.0_191-b12
   [junit4]   2> 103970 INFO  (jetty-launcher-313-thread-1) [     ] o.e.j.s.session DefaultSessionIdManager workerName=node0
   [junit4]   2> 103970 INFO  (jetty-launcher-313-thread-1) [     ] o.e.j.s.session No SessionScavenger set, using defaults
   [junit4]   2> 103970 INFO  (jetty-launcher-313-thread-1) [     ] o.e.j.s.session node0 Scavenging every 660000ms
   [junit4]   2> 103970 INFO  (jetty-launcher-313-thread-1) [     ] o.e.j.s.h.ContextHandler Started o.e.j.s.ServletContextHandler@151bdbe6{/solr,null,AVAILABLE}
   [junit4]   2> 103972 INFO  (jetty-launcher-313-thread-2) [     ] o.e.j.s.session DefaultSessionIdManager workerName=node0
   [junit4]   2> 103972 INFO  (jetty-launcher-313-thread-2) [     ] o.e.j.s.session No SessionScavenger set, using defaults
   [junit4]   2> 103972 INFO  (jetty-launcher-313-thread-2) [     ] o.e.j.s.session node0 Scavenging every 660000ms
   [junit4]   2> 103972 INFO  (jetty-launcher-313-thread-2) [     ] o.e.j.s.h.ContextHandler Started o.e.j.s.ServletContextHandler@3b350de7{/solr,null,AVAILABLE}
   [junit4]   2> 103975 INFO  (jetty-launcher-313-thread-2) [     ] o.e.j.s.AbstractConnector Started ServerConnector@387714b9{SSL,[ssl, http/1.1]}{127.0.0.1:42075}
   [junit4]   2> 103975 INFO  (jetty-launcher-313-thread-2) [     ] o.e.j.s.Server Started @104002ms
   [junit4]   2> 103975 INFO  (jetty-launcher-313-thread-2) [     ] o.a.s.c.s.e.JettySolrRunner Jetty properties: {hostContext=/solr, hostPort=42075}
   [junit4]   2> 103975 INFO  (jetty-launcher-313-thread-1) [     ] o.e.j.s.AbstractConnector Started ServerConnector@56288811{SSL,[ssl, http/1.1]}{127.0.0.1:46401}
   [junit4]   2> 103975 INFO  (jetty-launcher-313-thread-1) [     ] o.e.j.s.Server Started @104002ms
   [junit4]   2> 103975 INFO  (jetty-launcher-313-thread-1) [     ] o.a.s.c.s.e.JettySolrRunner Jetty properties: {hostContext=/solr, hostPort=46401}
   [junit4]   2> 103975 ERROR (jetty-launcher-313-thread-2) [     ] o.a.s.u.StartupLoggingUtils Missing Java Option solr.log.dir. Logging may be missing or incomplete.
   [junit4]   2> 103975 INFO  (jetty-launcher-313-thread-2) [     ] o.a.s.s.SolrDispatchFilter Using logger factory org.apache.logging.slf4j.Log4jLoggerFactory
   [junit4]   2> 103975 INFO  (jetty-launcher-313-thread-2) [     ] o.a.s.s.SolrDispatchFilter  ___      _       Welcome to Apache Solr? version 8.4.0
   [junit4]   2> 103975 INFO  (jetty-launcher-313-thread-2) [     ] o.a.s.s.SolrDispatchFilter / __| ___| |_ _   Starting in cloud mode on port null
   [junit4]   2> 103975 INFO  (jetty-launcher-313-thread-2) [     ] o.a.s.s.SolrDispatchFilter \__ \/ _ \ | '_|  Install dir: null
   [junit4]   2> 103975 INFO  (jetty-launcher-313-thread-2) [     ] o.a.s.s.SolrDispatchFilter |___/\___/_|_|    Start time: 2019-12-04T02:55:59.187Z
   [junit4]   2> 103975 ERROR (jetty-launcher-313-thread-1) [     ] o.a.s.u.StartupLoggingUtils Missing Java Option solr.log.dir. Logging may be missing or incomplete.
   [junit4]   2> 103975 INFO  (jetty-launcher-313-thread-1) [     ] o.a.s.s.SolrDispatchFilter Using logger factory org.apache.logging.slf4j.Log4jLoggerFactory
   [junit4]   2> 103975 INFO  (jetty-launcher-313-thread-1) [     ] o.a.s.s.SolrDispatchFilter  ___      _       Welcome to Apache Solr? version 8.4.0
   [junit4]   2> 103975 INFO  (jetty-launcher-313-thread-1) [     ] o.a.s.s.SolrDispatchFilter / __| ___| |_ _   Starting in cloud mode on port null
   [junit4]   2> 103975 INFO  (jetty-launcher-313-thread-1) [     ] o.a.s.s.SolrDispatchFilter \__ \/ _ \ | '_|  Install dir: null
   [junit4]   2> 103975 INFO  (jetty-launcher-313-thread-1) [     ] o.a.s.s.SolrDispatchFilter |___/\___/_|_|    Start time: 2019-12-04T02:55:59.187Z
   [junit4]   2> 103976 INFO  (jetty-launcher-313-thread-2) [     ] o.a.s.c.c.ConnectionManager Waiting for client to connect to ZooKeeper
   [junit4]   2> 103977 INFO  (jetty-launcher-313-thread-1) [     ] o.a.s.c.c.ConnectionManager Waiting for client to connect to ZooKeeper
   [junit4]   2> 103979 INFO  (zkConnectionManagerCallback-315-thread-1) [     ] o.a.s.c.c.ConnectionManager zkClient has connected
   [junit4]   2> 103979 INFO  (jetty-launcher-313-thread-2) [     ] o.a.s.c.c.ConnectionManager Client is connected to ZooKeeper
   [junit4]   2> 103986 INFO  (zkConnectionManagerCallback-317-thread-1) [     ] o.a.s.c.c.ConnectionManager zkClient has connected
   [junit4]   2> 103986 INFO  (jetty-launcher-313-thread-1) [     ] o.a.s.c.c.ConnectionManager Client is connected to ZooKeeper
   [junit4]   2> 103987 INFO  (jetty-launcher-313-thread-2) [     ] o.a.s.s.SolrDispatchFilter solr.xml found in ZooKeeper. Loading...
   [junit4]   2> 103987 INFO  (jetty-launcher-313-thread-1) [     ] o.a.s.s.SolrDispatchFilter solr.xml found in ZooKeeper. Loading...
   [junit4]   2> 104138 INFO  (jetty-launcher-313-thread-2) [     ] o.a.s.h.c.HttpShardHandlerFactory Host whitelist initialized: WhitelistHostChecker [whitelistHosts=null, whitelistHostCheckingEnabled=true]
   [junit4]   2> 104139 WARN  (jetty-launcher-313-thread-2) [     ] o.a.s.c.s.i.Http2SolrClient Create Http2SolrClient with HTTP/1.1 transport since Java 8 or lower versions does not support SSL + HTTP/2
   [junit4]   2> 104139 WARN  (jetty-launcher-313-thread-2) [     ] o.e.j.u.s.S.config Trusting all certificates configured for Client@1f9511c6[provider=null,keyStore=null,trustStore=null]
   [junit4]   2> 104139 WARN  (jetty-launcher-313-thread-2) [     ] o.e.j.u.s.S.config No Client EndPointIdentificationAlgorithm configured for Client@1f9511c6[provider=null,keyStore=null,trustStore=null]
   [junit4]   2> 104142 WARN  (jetty-launcher-313-thread-2) [     ] o.a.s.c.s.i.Http2SolrClient Create Http2SolrClient with HTTP/1.1 transport since Java 8 or lower versions does not support SSL + HTTP/2
   [junit4]   2> 104143 WARN  (jetty-launcher-313-thread-2) [     ] o.e.j.u.s.S.config Trusting all certificates configured for Client@68ebed89[provider=null,keyStore=null,trustStore=null]
   [junit4]   2> 104143 WARN  (jetty-launcher-313-thread-2) [     ] o.e.j.u.s.S.config No Client EndPointIdentificationAlgorithm configured for Client@68ebed89[provider=null,keyStore=null,trustStore=null]
   [junit4]   2> 104143 INFO  (jetty-launcher-313-thread-2) [     ] o.a.s.c.ZkContainer Zookeeper client=127.0.0.1:32925/solr
   [junit4]   2> 104144 INFO  (jetty-launcher-313-thread-2) [     ] o.a.s.c.c.ConnectionManager Waiting for client to connect to ZooKeeper
   [junit4]   2> 104148 INFO  (zkConnectionManagerCallback-324-thread-1) [     ] o.a.s.c.c.ConnectionManager zkClient has connected
   [junit4]   2> 104148 INFO  (jetty-launcher-313-thread-2) [     ] o.a.s.c.c.ConnectionManager Client is connected to ZooKeeper
   [junit4]   2> 104284 INFO  (jetty-launcher-313-thread-1) [     ] o.a.s.h.c.HttpShardHandlerFactory Host whitelist initialized: WhitelistHostChecker [whitelistHosts=null, whitelistHostCheckingEnabled=true]
   [junit4]   2> 104285 WARN  (jetty-launcher-313-thread-1) [     ] o.a.s.c.s.i.Http2SolrClient Create Http2SolrClient with HTTP/1.1 transport since Java 8 or lower versions does not support SSL + HTTP/2
   [junit4]   2> 104286 WARN  (jetty-launcher-313-thread-1) [     ] o.e.j.u.s.S.config Trusting all certificates configured for Client@38a20a80[provider=null,keyStore=null,trustStore=null]
   [junit4]   2> 104286 WARN  (jetty-launcher-313-thread-1) [     ] o.e.j.u.s.S.config No Client EndPointIdentificationAlgorithm configured for Client@38a20a80[provider=null,keyStore=null,trustStore=null]
   [junit4]   2> 104288 WARN  (jetty-launcher-313-thread-1) [     ] o.a.s.c.s.i.Http2SolrClient Create Http2SolrClient with HTTP/1.1 transport since Java 8 or lower versions does not support SSL + HTTP/2
   [junit4]   2> 104291 WARN  (jetty-launcher-313-thread-1) [     ] o.e.j.u.s.S.config Trusting all certificates configured for Client@7529b460[provider=null,keyStore=null,trustStore=null]
   [junit4]   2> 104291 WARN  (jetty-launcher-313-thread-1) [     ] o.e.j.u.s.S.config No Client EndPointIdentificationAlgorithm configured for Client@7529b460[provider=null,keyStore=null,trustStore=null]
   [junit4]   2> 104292 INFO  (jetty-launcher-313-thread-1) [     ] o.a.s.c.ZkContainer Zookeeper client=127.0.0.1:32925/solr
   [junit4]   2> 104293 INFO  (jetty-launcher-313-thread-1) [     ] o.a.s.c.c.ConnectionManager Waiting for client to connect to ZooKeeper
   [junit4]   2> 104293 INFO  (jetty-launcher-313-thread-2) [n:127.0.0.1:42075_solr     ] o.a.s.c.c.ConnectionManager Waiting for client to connect to ZooKeeper
   [junit4]   2> 104295 INFO  (zkConnectionManagerCallback-331-thread-1) [     ] o.a.s.c.c.ConnectionManager zkClient has connected
   [junit4]   2> 104295 INFO  (jetty-launcher-313-thread-1) [     ] o.a.s.c.c.ConnectionManager Client is connected to ZooKeeper
   [junit4]   2> 104295 INFO  (zkConnectionManagerCallback-333-thread-1) [     ] o.a.s.c.c.ConnectionManager zkClient has connected
   [junit4]   2> 104295 INFO  (jetty-launcher-313-thread-2) [n:127.0.0.1:42075_solr     ] o.a.s.c.c.ConnectionManager Client is connected to ZooKeeper
   [junit4]   2> 104355 INFO  (jetty-launcher-313-thread-2) [n:127.0.0.1:42075_solr     ] o.a.s.c.OverseerElectionContext I am going to be the leader 127.0.0.1:42075_solr
   [junit4]   2> 104355 INFO  (jetty-launcher-313-thread-2) [n:127.0.0.1:42075_solr     ] o.a.s.c.Overseer Overseer (id=72834179397255174-127.0.0.1:42075_solr-n_0000000000) starting
   [junit4]   2> 104363 INFO  (OverseerStateUpdate-72834179397255174-127.0.0.1:42075_solr-n_0000000000) [n:127.0.0.1:42075_solr     ] o.a.s.c.Overseer Starting to work on the main queue : 127.0.0.1:42075_solr
   [junit4]   2> 104364 INFO  (jetty-launcher-313-thread-2) [n:127.0.0.1:42075_solr     ] o.a.s.c.ZkController Register node as live in ZooKeeper:/live_nodes/127.0.0.1:42075_solr
   [junit4]   2> 104365 INFO  (OverseerStateUpdate-72834179397255174-127.0.0.1:42075_solr-n_0000000000) [n:127.0.0.1:42075_solr     ] o.a.s.c.c.ZkStateReader Updated live nodes from ZooKeeper... (0) -> (1)
   [junit4]   2> 104378 INFO  (jetty-launcher-313-thread-2) [n:127.0.0.1:42075_solr     ] o.a.s.h.a.MetricsHistoryHandler No .system collection, keeping metrics history in memory.
   [junit4]   2> 104403 INFO  (jetty-launcher-313-thread-1) [n:127.0.0.1:46401_solr     ] o.a.s.c.c.ConnectionManager Waiting for client to connect to ZooKeeper
   [junit4]   2> 104405 INFO  (zkConnectionManagerCallback-339-thread-1) [     ] o.a.s.c.c.ConnectionManager zkClient has connected
   [junit4]   2> 104405 INFO  (jetty-launcher-313-thread-1) [n:127.0.0.1:46401_solr     ] o.a.s.c.c.ConnectionManager Client is connected to ZooKeeper
   [junit4]   2> 104405 INFO  (jetty-launcher-313-thread-2) [n:127.0.0.1:42075_solr     ] o.a.s.m.r.SolrJmxReporter JMX monitoring for 'solr_42075.solr.node' (registry 'solr.node') enabled at server: com.sun.jmx.mbeanserver.JmxMBeanServer@270c9c80
   [junit4]   2> 104410 INFO  (jetty-launcher-313-thread-2) [n:127.0.0.1:42075_solr     ] o.a.s.m.r.SolrJmxReporter JMX monitoring for 'solr_42075.solr.jvm' (registry 'solr.jvm') enabled at server: com.sun.jmx.mbeanserver.JmxMBeanServer@270c9c80
   [junit4]   2> 104410 INFO  (jetty-launcher-313-thread-2) [n:127.0.0.1:42075_solr     ] o.a.s.m.r.SolrJmxReporter JMX monitoring for 'solr_42075.solr.jetty' (registry 'solr.jetty') enabled at server: com.sun.jmx.mbeanserver.JmxMBeanServer@270c9c80
   [junit4]   2> 104411 INFO  (jetty-launcher-313-thread-1) [n:127.0.0.1:46401_solr     ] o.a.s.c.c.ZkStateReader Updated live nodes from ZooKeeper... (0) -> (1)
   [junit4]   2> 104411 INFO  (jetty-launcher-313-thread-2) [n:127.0.0.1:42075_solr     ] o.a.s.p.PackageLoader /packages.json updated to version -1
   [junit4]   2> 104412 INFO  (jetty-launcher-313-thread-2) [n:127.0.0.1:42075_solr     ] o.a.s.c.CorePropertiesLocator Found 0 core definitions underneath /home/jenkins/jenkins-slave/workspace/Lucene-Solr-Tests-8.x/solr/build/solr-core/test/J2/temp/solr.cloud.hdfs.HDFSCollectionsAPITest_4A996A0BC8F49F27-001/tempDir-001/node1/.
   [junit4]   2> 104422 INFO  (jetty-launcher-313-thread-1) [n:127.0.0.1:46401_solr     ] o.a.s.c.ZkController Publish node=127.0.0.1:46401_solr as DOWN
   [junit4]   2> 104422 INFO  (jetty-launcher-313-thread-1) [n:127.0.0.1:46401_solr     ] o.a.s.c.TransientSolrCoreCacheDefault Allocating transient cache for 2147483647 transient cores
   [junit4]   2> 104422 INFO  (jetty-launcher-313-thread-1) [n:127.0.0.1:46401_solr     ] o.a.s.c.ZkController Register node as live in ZooKeeper:/live_nodes/127.0.0.1:46401_solr
   [junit4]   2> 104423 INFO  (zkCallback-332-thread-1) [     ] o.a.s.c.c.ZkStateReader Updated live nodes from ZooKeeper... (1) -> (2)
   [junit4]   2> 104424 INFO  (zkCallback-338-thread-1) [     ] o.a.s.c.c.ZkStateReader Updated live nodes from ZooKeeper... (1) -> (2)
   [junit4]   2> 104434 INFO  (jetty-launcher-313-thread-1) [n:127.0.0.1:46401_solr     ] o.a.s.h.a.MetricsHistoryHandler No .system collection, keeping metrics history in memory.
   [junit4]   2> 104445 INFO  (jetty-launcher-313-thread-1) [n:127.0.0.1:46401_solr     ] o.a.s.m.r.SolrJmxReporter JMX monitoring for 'solr_46401.solr.node' (registry 'solr.node') enabled at server: com.sun.jmx.mbeanserver.JmxMBeanServer@270c9c80
   [junit4]   2> 104451 INFO  (jetty-launcher-313-thread-1) [n:127.0.0.1:46401_solr     ] o.a.s.m.r.SolrJmxReporter JMX monitoring for 'solr_46401.solr.jvm' (registry 'solr.jvm') enabled at server: com.sun.jmx.mbeanserver.JmxMBeanServer@270c9c80
   [junit4]   2> 104451 INFO  (jetty-launcher-313-thread-1) [n:127.0.0.1:46401_solr     ] o.a.s.m.r.SolrJmxReporter JMX monitoring for 'solr_46401.solr.jetty' (registry 'solr.jetty') enabled at server: com.sun.jmx.mbeanserver.JmxMBeanServer@270c9c80
   [junit4]   2> 104452 INFO  (jetty-launcher-3

[...truncated too long message...]

t, HdfsTlogReplayBufferedWhileIndexingTest, GraphQueryTest, RestartWhileUpdatingTest, TestPseudoReturnFields, TestGraphTermsQParserPlugin, PeerSyncTest, LeaderElectionContextKeyTest, TestFilteredDocIdSet, TestAddFieldRealTimeGet, TestSimGenericDistributedQueue, BadIndexSchemaTest, RequestHandlersTest, BasicFunctionalityTest, TestJsonFacetsStatsParsing, TestExactSharedStatsCache, DirectoryFactoryTest, TestDFRSimilarityFactory, DateRangeFieldTest, TestSerializedLuceneMatchVersion, ShowFileRequestHandlerTest, TestPerFieldSimilarity, SchemaVersionSpecificBehaviorTest, NodeLostTriggerIntegrationTest, TestSolrCloudWithSecureImpersonation, XmlInterpolationTest, MoveReplicaHDFSFailoverTest, TestAuthorizationFramework, PluginInfoTest, TestHashPartitioner, ComputePlanActionTest, TestDownShardTolerantSearch, LargeFieldTest, ZkCLITest, HighlighterMaxOffsetTest, TestUseDocValuesAsStored2, ClassificationUpdateProcessorFactoryTest, SuggesterFSTTest, TestSubQueryTransformer, TestManagedSynonymFilterFactory, StatsReloadRaceTest, TestFieldTypeCollectionResource, TestCustomSort, DocumentAnalysisRequestHandlerTest, HttpPartitionOnCommitTest, QueryParsingTest, SignificantTermsQParserPluginTest, AnalyticsQueryTest, TestIndexingPerformance, SolrCLIZkUtilsTest, AddReplicaTest, MetricsHistoryWithAuthIntegrationTest, ZkNodePropsTest, TestSolrConfigHandler, TestManagedResource, TestCorePropertiesReload, TestScoreJoinQPNoScore, BasicAuthOnSingleNodeTest, TestDistributedStatsComponentCardinality, TestChildDocTransformer, HdfsNNFailoverTest, TestWithCollection, DisMaxRequestHandlerTest, TestMissingGroups, TestEmbeddedSolrServerAdminHandler, SolrMetricReporterTest, ConcurrentDeleteAndCreateCollectionTest, TriggerEventQueueTest, DocValuesTest, SolrCloudReportersTest, TestDocTermOrdsUninvertLimit, TestBadConfig, NestedAtomicUpdateTest, TestMacros, OverseerCollectionConfigSetProcessorTest, TestCloudInspectUtil, AnalysisErrorHandlingTest, TestConfigReload, Tagger2Test, StressHdfsTest, TestDynamicFieldResource, AuditLoggerIntegrationTest, ConvertedLegacyTest, EchoParamsTest, MinimalSchemaTest, SampleTest, SolrInfoBeanTest, TestCrossCoreJoin, TestCursorMarkWithoutUniqueKey, TestDistributedGrouping, TestDistributedMissingSort, TestDistributedSearch, TestGroupingSearch, TestHighlightDedupGrouping, TestSolrCoreProperties, TestSolrTestCaseJ4, TestTrie, PathHierarchyTokenizerFactoryTest, TokenizerChainTest, TestEmbeddedSolrServerSchemaAPI, TestJettySolrRunner, ConnectionReuseTest, BasicDistributedZkTest, ChaosMonkeySafeLeaderTest, ChaosMonkeySafeLeaderWithPullReplicasTest, CleanupOldIndexTest, CloudExitableDirectoryReaderTest, ClusterStateUpdateTest, CollectionPropsTest, CollectionStateFormat2Test, ConcurrentCreateRoutedAliasTest, ConfigSetsAPITest, CreateRoutedAliasTest, DeleteInactiveReplicaTest, DeleteLastCustomShardedReplicaTest, DeleteNodeTest, DistribCursorPagingTest, DistribJoinFromCollectionTest, DistributedQueueTest, DistributedVersionInfoTest, LeaderFailoverAfterPartitionTest, MoveReplicaTest, OverseerStatusTest, PeerSyncReplicationTest, RoutingToNodesWithPropertiesTest, SSLMigrationTest, SaslZkACLProviderTest, SolrCloudExampleTest, SyncSliceTest, TestConfigSetsAPIExclusivity, TestDistribDocBasedVersion, TestLeaderElectionZkExpiry, TestPrepRecovery, TestRandomRequestDistribution, TestSegmentSorting, TestTolerantUpdateProcessorCloud, TestUtilizeNode, ZkShardTermsTest, AsyncCallRequestStatusResponseTest, CollectionReloadTest, CollectionTooManyReplicasTest, HdfsCollectionsAPIDistributedZkTest, ShardSplitTest, ScheduledTriggerIntegrationTest, TestSimComputePlanAction, TestSimNodeAddedTrigger, TestSimNodeLostTrigger, TestSimPolicyCloud, TestSimScenario, TestSimTriggerIntegration, CdcrOpsAndBoundariesTest, CdcrReplicationHandlerTest, CdcrVersionReplicationTest, CdcrWithNodesRestartsTest, HdfsBasicDistributedZk2Test, HdfsBasicDistributedZkTest, HdfsRecoveryZkTest, HdfsRestartWhileUpdatingTest, HdfsSyncSliceTest, HdfsUnloadDistributedZkTest, TestClusterStateMutator, ZkCollectionPropsCachingTest, ZkStateReaderTest, AlternateDirectoryTest, BlobRepositoryCloudTest, ResourceLoaderTest, TestCodecSupport, TestConfig, TestConfigOverlay, TestConfigSetImmutable, TestDirectoryFactory, TestDynamicLoadingUrl, TestInfoStreamLogging, TestInitParams, TestJmxIntegration, TestMergePolicyConfig, TestNRTOpen, TestQuerySenderNoQuery, TestReloadAndDeleteDocs, TestShardHandlerFactory, TestSolrXml, TestSolrCoreSnapshots, FieldAnalysisRequestHandlerTest, PingRequestHandlerTest, TestHdfsBackupRestoreCore, TestReplicationHandler, CustomTermsComponentTest, DistributedFacetPivotSmallTest, DistributedQueryComponentOptimizationTest, FacetPivotSmallTest, InfixSuggestersTest, PhrasesIdentificationComponentTest, ResponseLogComponentTest, SpellCheckComponentTest, SuggestComponentContextFilterQueryTest, SuggestComponentTest, CheckHdfsIndexTest, TestLegacyTerms, TestNumericTokenStream, JvmMetricsTest, SolrGraphiteReporterTest, SolrRrdBackendFactoryTest, TestPackages, TestSubQueryTransformerCrossCore, TestRestManager, TestBulkSchemaAPI, PreAnalyzedFieldManagedSchemaCloudTest, SynonymTokenizerTest, TestBinaryField, TestBulkSchemaConcurrent, TestManagedSchema, TestSchemaField, TestSchemaManager, TestSchemalessBufferedUpdates, TestSortableTextField, CurrencyRangeFacetCloudTest, TestComplexPhraseQParserPlugin, TestDocSet, TestElisionMultitermQuery, TestExtendedDismaxParser, TestMaxScoreQueryParser, TestPayloadCheckQParserPlugin, TestQueryUtils, TestReRankQParserPlugin, TestReload, TestSolr4Spatial, TestSolrCoreParser, TestSolrQueryParser, TestStressLucene, TestStressRecovery, TestStressReorder, TestStressUserVersions, TestStressVersions, TestSurroundQueryParser, TestValueSourceCache, TestXmlQParser, DistributedFacetSimpleRefinementLongTailTest, RangeFacetCloudTest, TestCloudJSONFacetSKG, DistanceFunctionTest, BJQFilterAccessibleTest, TestClassicSimilarityFactory, TestIBSimilarityFactory, TestLMDirichletSimilarityFactory, TestLMJelinekMercerSimilarityFactory, TestDefaultStatsCache, JWTVerificationkeyResolverTest, TestImpersonationWithHadoopAuth, TestZkAclsWithHadoopAuth, CacheHeaderTest, DirectSolrConnectionTest, FileBasedSpellCheckerTest, SuggesterTest, TestBlendedInfixSuggestions, BlockCacheTest, TestUninvertingReader, CdcrUpdateLogTest, DirectUpdateHandlerTest, RootFieldTest, TestAtomicUpdateErrorCases, TestHdfsUpdateLog]
   [junit4]   2> NOTE: reproduce with: ant test  -Dtestcase=TestHdfsUpdateLog -Dtests.seed=4A996A0BC8F49F27 -Dtests.multiplier=2 -Dtests.slow=true -Dtests.locale=be -Dtests.timezone=Pacific/Johnston -Dtests.asserts=true -Dtests.file.encoding=ISO-8859-1
   [junit4] ERROR   0.00s J1 | TestHdfsUpdateLog (suite) <<<
   [junit4]    > Throwable #1: org.apache.hadoop.security.KerberosAuthException: failure to login: javax.security.auth.login.LoginException: Security Exception
   [junit4]    > 	at __randomizedtesting.SeedInfo.seed([4A996A0BC8F49F27]:0)
   [junit4]    > 	at org.apache.hadoop.security.UserGroupInformation.doSubjectLogin(UserGroupInformation.java:1847)
   [junit4]    > 	at org.apache.hadoop.security.UserGroupInformation.createLoginUser(UserGroupInformation.java:710)
   [junit4]    > 	at org.apache.hadoop.security.UserGroupInformation.getLoginUser(UserGroupInformation.java:660)
   [junit4]    > 	at org.apache.hadoop.security.UserGroupInformation.getCurrentUser(UserGroupInformation.java:571)
   [junit4]    > 	at org.apache.hadoop.hdfs.server.namenode.FSNamesystem.<init>(FSNamesystem.java:767)
   [junit4]    > 	at org.apache.hadoop.hdfs.server.namenode.FSNamesystem.<init>(FSNamesystem.java:733)
   [junit4]    > 	at org.apache.hadoop.hdfs.server.namenode.NameNode.format(NameNode.java:1140)
   [junit4]    > 	at org.apache.hadoop.hdfs.server.namenode.NameNode.format(NameNode.java:409)
   [junit4]    > 	at org.apache.hadoop.hdfs.DFSTestUtil.formatNameNode(DFSTestUtil.java:261)
   [junit4]    > 	at org.apache.hadoop.hdfs.MiniDFSCluster.configureNameService(MiniDFSCluster.java:1072)
   [junit4]    > 	at org.apache.hadoop.hdfs.MiniDFSCluster.createNameNodesAndSetConf(MiniDFSCluster.java:958)
   [junit4]    > 	at org.apache.hadoop.hdfs.MiniDFSCluster.initMiniDFSCluster(MiniDFSCluster.java:890)
   [junit4]    > 	at org.apache.hadoop.hdfs.MiniDFSCluster.<init>(MiniDFSCluster.java:518)
   [junit4]    > 	at org.apache.hadoop.hdfs.MiniDFSCluster$Builder.build(MiniDFSCluster.java:477)
   [junit4]    > 	at org.apache.solr.cloud.hdfs.HdfsTestUtil.setupClass(HdfsTestUtil.java:134)
   [junit4]    > 	at org.apache.solr.cloud.hdfs.HdfsTestUtil.setupClass(HdfsTestUtil.java:66)
   [junit4]    > 	at org.apache.solr.update.TestHdfsUpdateLog.beforeClass(TestHdfsUpdateLog.java:47)
   [junit4]    > 	at java.lang.Thread.run(Thread.java:748)
   [junit4]    > Caused by: javax.security.auth.login.LoginException: Security Exception
   [junit4]    > 	at javax.security.auth.login.LoginContext.invoke(LoginContext.java:840)
   [junit4]    > 	at javax.security.auth.login.LoginContext.access$000(LoginContext.java:195)
   [junit4]    > 	at javax.security.auth.login.LoginContext$4.run(LoginContext.java:682)
   [junit4]    > 	at javax.security.auth.login.LoginContext$4.run(LoginContext.java:680)
   [junit4]    > 	at java.security.AccessController.doPrivileged(Native Method)
   [junit4]    > 	at javax.security.auth.login.LoginContext.invokePriv(LoginContext.java:680)
   [junit4]    > 	at javax.security.auth.login.LoginContext.login(LoginContext.java:587)
   [junit4]    > 	at org.apache.hadoop.security.UserGroupInformation$HadoopLoginContext.login(UserGroupInformation.java:1926)
   [junit4]    > 	at org.apache.hadoop.security.UserGroupInformation.doSubjectLogin(UserGroupInformation.java:1837)
   [junit4]    > 	... 40 more
   [junit4]    > Caused by: java.lang.SecurityException
   [junit4]    > 	at javax.security.auth.login.LoginContext.invoke(LoginContext.java:841)
   [junit4]    > 	... 48 more
   [junit4] Completed [841/887 (13!)] on J1 in 0.25s, 0 tests, 1 error <<< FAILURES!

[...truncated 53046 lines...]

Mime
View raw message