lucene-builds mailing list archives

Site index · List index
Message view « Date » · « Thread »
Top « Date » · « Thread »
From Apache Jenkins Server <jenk...@builds.apache.org>
Subject [JENKINS] Lucene-Solr-NightlyTests-8.3 - Build # 71 - Still Unstable
Date Wed, 04 Dec 2019 02:13:09 GMT
Build: https://builds.apache.org/job/Lucene-Solr-NightlyTests-8.3/71/

1 tests failed.
FAILED:  junit.framework.TestSuite.org.apache.solr.handler.TestReplicationHandler

Error Message:
ObjectTracker found 6 object(s) that were not released!!! [MockDirectoryWrapper, InternalHttpClient, MockDirectoryWrapper, SolrCore, MockDirectoryWrapper, MockDirectoryWrapper] org.apache.solr.common.util.ObjectReleaseTracker$ObjectTrackerException: org.apache.lucene.store.MockDirectoryWrapper  at org.apache.solr.common.util.ObjectReleaseTracker.track(ObjectReleaseTracker.java:42)  at org.apache.solr.core.CachingDirectoryFactory.get(CachingDirectoryFactory.java:348)  at org.apache.solr.handler.IndexFetcher.fetchLatestIndex(IndexFetcher.java:509)  at org.apache.solr.handler.IndexFetcher.fetchLatestIndex(IndexFetcher.java:351)  at org.apache.solr.handler.ReplicationHandler.doFetch(ReplicationHandler.java:424)  at org.apache.solr.handler.ReplicationHandler.lambda$setupPolling$13(ReplicationHandler.java:1192)  at java.util.concurrent.Executors$RunnableAdapter.call(Executors.java:511)  at java.util.concurrent.FutureTask.runAndReset(FutureTask.java:308)  at java.util.concurrent.ScheduledThreadPoolExecutor$ScheduledFutureTask.access$301(ScheduledThreadPoolExecutor.java:180)  at java.util.concurrent.ScheduledThreadPoolExecutor$ScheduledFutureTask.run(ScheduledThreadPoolExecutor.java:294)  at java.util.concurrent.ThreadPoolExecutor.runWorker(ThreadPoolExecutor.java:1149)  at java.util.concurrent.ThreadPoolExecutor$Worker.run(ThreadPoolExecutor.java:624)  at java.lang.Thread.run(Thread.java:748)  org.apache.solr.common.util.ObjectReleaseTracker$ObjectTrackerException: org.apache.http.impl.client.InternalHttpClient  at org.apache.solr.common.util.ObjectReleaseTracker.track(ObjectReleaseTracker.java:42)  at org.apache.solr.client.solrj.impl.HttpClientUtil.createClient(HttpClientUtil.java:321)  at org.apache.solr.client.solrj.impl.HttpClientUtil.createClient(HttpClientUtil.java:330)  at org.apache.solr.handler.IndexFetcher.createHttpClient(IndexFetcher.java:230)  at org.apache.solr.handler.IndexFetcher.<init>(IndexFetcher.java:272)  at org.apache.solr.handler.ReplicationHandler.inform(ReplicationHandler.java:1223)  at org.apache.solr.core.SolrResourceLoader.inform(SolrResourceLoader.java:696)  at org.apache.solr.core.SolrCore.<init>(SolrCore.java:1003)  at org.apache.solr.core.SolrCore.<init>(SolrCore.java:881)  at org.apache.solr.core.CoreContainer.createFromDescriptor(CoreContainer.java:1251)  at org.apache.solr.core.CoreContainer.lambda$load$13(CoreContainer.java:765)  at com.codahale.metrics.InstrumentedExecutorService$InstrumentedCallable.call(InstrumentedExecutorService.java:202)  at java.util.concurrent.FutureTask.run(FutureTask.java:266)  at org.apache.solr.common.util.ExecutorUtil$MDCAwareThreadPoolExecutor.lambda$execute$0(ExecutorUtil.java:210)  at java.util.concurrent.ThreadPoolExecutor.runWorker(ThreadPoolExecutor.java:1149)  at java.util.concurrent.ThreadPoolExecutor$Worker.run(ThreadPoolExecutor.java:624)  at java.lang.Thread.run(Thread.java:748)  org.apache.solr.common.util.ObjectReleaseTracker$ObjectTrackerException: org.apache.lucene.store.MockDirectoryWrapper  at org.apache.solr.common.util.ObjectReleaseTracker.track(ObjectReleaseTracker.java:42)  at org.apache.solr.core.CachingDirectoryFactory.get(CachingDirectoryFactory.java:348)  at org.apache.solr.core.SolrCore.getNewIndexDir(SolrCore.java:368)  at org.apache.solr.core.SolrCore.initIndex(SolrCore.java:745)  at org.apache.solr.core.SolrCore.<init>(SolrCore.java:969)  at org.apache.solr.core.SolrCore.<init>(SolrCore.java:881)  at org.apache.solr.core.CoreContainer.createFromDescriptor(CoreContainer.java:1251)  at org.apache.solr.core.CoreContainer.lambda$load$13(CoreContainer.java:765)  at com.codahale.metrics.InstrumentedExecutorService$InstrumentedCallable.call(InstrumentedExecutorService.java:202)  at java.util.concurrent.FutureTask.run(FutureTask.java:266)  at org.apache.solr.common.util.ExecutorUtil$MDCAwareThreadPoolExecutor.lambda$execute$0(ExecutorUtil.java:210)  at java.util.concurrent.ThreadPoolExecutor.runWorker(ThreadPoolExecutor.java:1149)  at java.util.concurrent.ThreadPoolExecutor$Worker.run(ThreadPoolExecutor.java:624)  at java.lang.Thread.run(Thread.java:748)  org.apache.solr.common.util.ObjectReleaseTracker$ObjectTrackerException: org.apache.solr.core.SolrCore  at org.apache.solr.common.util.ObjectReleaseTracker.track(ObjectReleaseTracker.java:42)  at org.apache.solr.core.SolrCore.<init>(SolrCore.java:1058)  at org.apache.solr.core.SolrCore.<init>(SolrCore.java:881)  at org.apache.solr.core.CoreContainer.createFromDescriptor(CoreContainer.java:1251)  at org.apache.solr.core.CoreContainer.lambda$load$13(CoreContainer.java:765)  at com.codahale.metrics.InstrumentedExecutorService$InstrumentedCallable.call(InstrumentedExecutorService.java:202)  at java.util.concurrent.FutureTask.run(FutureTask.java:266)  at org.apache.solr.common.util.ExecutorUtil$MDCAwareThreadPoolExecutor.lambda$execute$0(ExecutorUtil.java:210)  at java.util.concurrent.ThreadPoolExecutor.runWorker(ThreadPoolExecutor.java:1149)  at java.util.concurrent.ThreadPoolExecutor$Worker.run(ThreadPoolExecutor.java:624)  at java.lang.Thread.run(Thread.java:748)  org.apache.solr.common.util.ObjectReleaseTracker$ObjectTrackerException: org.apache.lucene.store.MockDirectoryWrapper  at org.apache.solr.common.util.ObjectReleaseTracker.track(ObjectReleaseTracker.java:42)  at org.apache.solr.core.CachingDirectoryFactory.get(CachingDirectoryFactory.java:348)  at org.apache.solr.core.SolrCore.initSnapshotMetaDataManager(SolrCore.java:516)  at org.apache.solr.core.SolrCore.<init>(SolrCore.java:961)  at org.apache.solr.core.SolrCore.<init>(SolrCore.java:881)  at org.apache.solr.core.CoreContainer.createFromDescriptor(CoreContainer.java:1251)  at org.apache.solr.core.CoreContainer.lambda$load$13(CoreContainer.java:765)  at com.codahale.metrics.InstrumentedExecutorService$InstrumentedCallable.call(InstrumentedExecutorService.java:202)  at java.util.concurrent.FutureTask.run(FutureTask.java:266)  at org.apache.solr.common.util.ExecutorUtil$MDCAwareThreadPoolExecutor.lambda$execute$0(ExecutorUtil.java:210)  at java.util.concurrent.ThreadPoolExecutor.runWorker(ThreadPoolExecutor.java:1149)  at java.util.concurrent.ThreadPoolExecutor$Worker.run(ThreadPoolExecutor.java:624)  at java.lang.Thread.run(Thread.java:748)  org.apache.solr.common.util.ObjectReleaseTracker$ObjectTrackerException: org.apache.lucene.store.MockDirectoryWrapper  at org.apache.solr.common.util.ObjectReleaseTracker.track(ObjectReleaseTracker.java:42)  at org.apache.solr.core.CachingDirectoryFactory.get(CachingDirectoryFactory.java:348)  at org.apache.solr.update.SolrIndexWriter.create(SolrIndexWriter.java:98)  at org.apache.solr.core.SolrCore.initIndex(SolrCore.java:777)  at org.apache.solr.core.SolrCore.<init>(SolrCore.java:969)  at org.apache.solr.core.SolrCore.<init>(SolrCore.java:881)  at org.apache.solr.core.CoreContainer.createFromDescriptor(CoreContainer.java:1251)  at org.apache.solr.core.CoreContainer.lambda$load$13(CoreContainer.java:765)  at com.codahale.metrics.InstrumentedExecutorService$InstrumentedCallable.call(InstrumentedExecutorService.java:202)  at java.util.concurrent.FutureTask.run(FutureTask.java:266)  at org.apache.solr.common.util.ExecutorUtil$MDCAwareThreadPoolExecutor.lambda$execute$0(ExecutorUtil.java:210)  at java.util.concurrent.ThreadPoolExecutor.runWorker(ThreadPoolExecutor.java:1149)  at java.util.concurrent.ThreadPoolExecutor$Worker.run(ThreadPoolExecutor.java:624)  at java.lang.Thread.run(Thread.java:748)   expected null, but was:<ObjectTracker found 6 object(s) that were not released!!! [MockDirectoryWrapper, InternalHttpClient, MockDirectoryWrapper, SolrCore, MockDirectoryWrapper, MockDirectoryWrapper] org.apache.solr.common.util.ObjectReleaseTracker$ObjectTrackerException: org.apache.lucene.store.MockDirectoryWrapper  at org.apache.solr.common.util.ObjectReleaseTracker.track(ObjectReleaseTracker.java:42)  at org.apache.solr.core.CachingDirectoryFactory.get(CachingDirectoryFactory.java:348)  at org.apache.solr.handler.IndexFetcher.fetchLatestIndex(IndexFetcher.java:509)  at org.apache.solr.handler.IndexFetcher.fetchLatestIndex(IndexFetcher.java:351)  at org.apache.solr.handler.ReplicationHandler.doFetch(ReplicationHandler.java:424)  at org.apache.solr.handler.ReplicationHandler.lambda$setupPolling$13(ReplicationHandler.java:1192)  at java.util.concurrent.Executors$RunnableAdapter.call(Executors.java:511)  at java.util.concurrent.FutureTask.runAndReset(FutureTask.java:308)  at java.util.concurrent.ScheduledThreadPoolExecutor$ScheduledFutureTask.access$301(ScheduledThreadPoolExecutor.java:180)  at java.util.concurrent.ScheduledThreadPoolExecutor$ScheduledFutureTask.run(ScheduledThreadPoolExecutor.java:294)  at java.util.concurrent.ThreadPoolExecutor.runWorker(ThreadPoolExecutor.java:1149)  at java.util.concurrent.ThreadPoolExecutor$Worker.run(ThreadPoolExecutor.java:624)  at java.lang.Thread.run(Thread.java:748)  org.apache.solr.common.util.ObjectReleaseTracker$ObjectTrackerException: org.apache.http.impl.client.InternalHttpClient  at org.apache.solr.common.util.ObjectReleaseTracker.track(ObjectReleaseTracker.java:42)  at org.apache.solr.client.solrj.impl.HttpClientUtil.createClient(HttpClientUtil.java:321)  at org.apache.solr.client.solrj.impl.HttpClientUtil.createClient(HttpClientUtil.java:330)  at org.apache.solr.handler.IndexFetcher.createHttpClient(IndexFetcher.java:230)  at org.apache.solr.handler.IndexFetcher.<init>(IndexFetcher.java:272)  at org.apache.solr.handler.ReplicationHandler.inform(ReplicationHandler.java:1223)  at org.apache.solr.core.SolrResourceLoader.inform(SolrResourceLoader.java:696)  at org.apache.solr.core.SolrCore.<init>(SolrCore.java:1003)  at org.apache.solr.core.SolrCore.<init>(SolrCore.java:881)  at org.apache.solr.core.CoreContainer.createFromDescriptor(CoreContainer.java:1251)  at org.apache.solr.core.CoreContainer.lambda$load$13(CoreContainer.java:765)  at com.codahale.metrics.InstrumentedExecutorService$InstrumentedCallable.call(InstrumentedExecutorService.java:202)  at java.util.concurrent.FutureTask.run(FutureTask.java:266)  at org.apache.solr.common.util.ExecutorUtil$MDCAwareThreadPoolExecutor.lambda$execute$0(ExecutorUtil.java:210)  at java.util.concurrent.ThreadPoolExecutor.runWorker(ThreadPoolExecutor.java:1149)  at java.util.concurrent.ThreadPoolExecutor$Worker.run(ThreadPoolExecutor.java:624)  at java.lang.Thread.run(Thread.java:748)  org.apache.solr.common.util.ObjectReleaseTracker$ObjectTrackerException: org.apache.lucene.store.MockDirectoryWrapper  at org.apache.solr.common.util.ObjectReleaseTracker.track(ObjectReleaseTracker.java:42)  at org.apache.solr.core.CachingDirectoryFactory.get(CachingDirectoryFactory.java:348)  at org.apache.solr.core.SolrCore.getNewIndexDir(SolrCore.java:368)  at org.apache.solr.core.SolrCore.initIndex(SolrCore.java:745)  at org.apache.solr.core.SolrCore.<init>(SolrCore.java:969)  at org.apache.solr.core.SolrCore.<init>(SolrCore.java:881)  at org.apache.solr.core.CoreContainer.createFromDescriptor(CoreContainer.java:1251)  at org.apache.solr.core.CoreContainer.lambda$load$13(CoreContainer.java:765)  at com.codahale.metrics.InstrumentedExecutorService$InstrumentedCallable.call(InstrumentedExecutorService.java:202)  at java.util.concurrent.FutureTask.run(FutureTask.java:266)  at org.apache.solr.common.util.ExecutorUtil$MDCAwareThreadPoolExecutor.lambda$execute$0(ExecutorUtil.java:210)  at java.util.concurrent.ThreadPoolExecutor.runWorker(ThreadPoolExecutor.java:1149)  at java.util.concurrent.ThreadPoolExecutor$Worker.run(ThreadPoolExecutor.java:624)  at java.lang.Thread.run(Thread.java:748)  org.apache.solr.common.util.ObjectReleaseTracker$ObjectTrackerException: org.apache.solr.core.SolrCore  at org.apache.solr.common.util.ObjectReleaseTracker.track(ObjectReleaseTracker.java:42)  at org.apache.solr.core.SolrCore.<init>(SolrCore.java:1058)  at org.apache.solr.core.SolrCore.<init>(SolrCore.java:881)  at org.apache.solr.core.CoreContainer.createFromDescriptor(CoreContainer.java:1251)  at org.apache.solr.core.CoreContainer.lambda$load$13(CoreContainer.java:765)  at com.codahale.metrics.InstrumentedExecutorService$InstrumentedCallable.call(InstrumentedExecutorService.java:202)  at java.util.concurrent.FutureTask.run(FutureTask.java:266)  at org.apache.solr.common.util.ExecutorUtil$MDCAwareThreadPoolExecutor.lambda$execute$0(ExecutorUtil.java:210)  at java.util.concurrent.ThreadPoolExecutor.runWorker(ThreadPoolExecutor.java:1149)  at java.util.concurrent.ThreadPoolExecutor$Worker.run(ThreadPoolExecutor.java:624)  at java.lang.Thread.run(Thread.java:748)  org.apache.solr.common.util.ObjectReleaseTracker$ObjectTrackerException: org.apache.lucene.store.MockDirectoryWrapper  at org.apache.solr.common.util.ObjectReleaseTracker.track(ObjectReleaseTracker.java:42)  at org.apache.solr.core.CachingDirectoryFactory.get(CachingDirectoryFactory.java:348)  at org.apache.solr.core.SolrCore.initSnapshotMetaDataManager(SolrCore.java:516)  at org.apache.solr.core.SolrCore.<init>(SolrCore.java:961)  at org.apache.solr.core.SolrCore.<init>(SolrCore.java:881)  at org.apache.solr.core.CoreContainer.createFromDescriptor(CoreContainer.java:1251)  at org.apache.solr.core.CoreContainer.lambda$load$13(CoreContainer.java:765)  at com.codahale.metrics.InstrumentedExecutorService$InstrumentedCallable.call(InstrumentedExecutorService.java:202)  at java.util.concurrent.FutureTask.run(FutureTask.java:266)  at org.apache.solr.common.util.ExecutorUtil$MDCAwareThreadPoolExecutor.lambda$execute$0(ExecutorUtil.java:210)  at java.util.concurrent.ThreadPoolExecutor.runWorker(ThreadPoolExecutor.java:1149)  at java.util.concurrent.ThreadPoolExecutor$Worker.run(ThreadPoolExecutor.java:624)  at java.lang.Thread.run(Thread.java:748)  org.apache.solr.common.util.ObjectReleaseTracker$ObjectTrackerException: org.apache.lucene.store.MockDirectoryWrapper  at org.apache.solr.common.util.ObjectReleaseTracker.track(ObjectReleaseTracker.java:42)  at org.apache.solr.core.CachingDirectoryFactory.get(CachingDirectoryFactory.java:348)  at org.apache.solr.update.SolrIndexWriter.create(SolrIndexWriter.java:98)  at org.apache.solr.core.SolrCore.initIndex(SolrCore.java:777)  at org.apache.solr.core.SolrCore.<init>(SolrCore.java:969)  at org.apache.solr.core.SolrCore.<init>(SolrCore.java:881)  at org.apache.solr.core.CoreContainer.createFromDescriptor(CoreContainer.java:1251)  at org.apache.solr.core.CoreContainer.lambda$load$13(CoreContainer.java:765)  at com.codahale.metrics.InstrumentedExecutorService$InstrumentedCallable.call(InstrumentedExecutorService.java:202)  at java.util.concurrent.FutureTask.run(FutureTask.java:266)  at org.apache.solr.common.util.ExecutorUtil$MDCAwareThreadPoolExecutor.lambda$execute$0(ExecutorUtil.java:210)  at java.util.concurrent.ThreadPoolExecutor.runWorker(ThreadPoolExecutor.java:1149)  at java.util.concurrent.ThreadPoolExecutor$Worker.run(ThreadPoolExecutor.java:624)  at java.lang.Thread.run(Thread.java:748)  >

Stack Trace:
java.lang.AssertionError: ObjectTracker found 6 object(s) that were not released!!! [MockDirectoryWrapper, InternalHttpClient, MockDirectoryWrapper, SolrCore, MockDirectoryWrapper, MockDirectoryWrapper]
org.apache.solr.common.util.ObjectReleaseTracker$ObjectTrackerException: org.apache.lucene.store.MockDirectoryWrapper
	at org.apache.solr.common.util.ObjectReleaseTracker.track(ObjectReleaseTracker.java:42)
	at org.apache.solr.core.CachingDirectoryFactory.get(CachingDirectoryFactory.java:348)
	at org.apache.solr.handler.IndexFetcher.fetchLatestIndex(IndexFetcher.java:509)
	at org.apache.solr.handler.IndexFetcher.fetchLatestIndex(IndexFetcher.java:351)
	at org.apache.solr.handler.ReplicationHandler.doFetch(ReplicationHandler.java:424)
	at org.apache.solr.handler.ReplicationHandler.lambda$setupPolling$13(ReplicationHandler.java:1192)
	at java.util.concurrent.Executors$RunnableAdapter.call(Executors.java:511)
	at java.util.concurrent.FutureTask.runAndReset(FutureTask.java:308)
	at java.util.concurrent.ScheduledThreadPoolExecutor$ScheduledFutureTask.access$301(ScheduledThreadPoolExecutor.java:180)
	at java.util.concurrent.ScheduledThreadPoolExecutor$ScheduledFutureTask.run(ScheduledThreadPoolExecutor.java:294)
	at java.util.concurrent.ThreadPoolExecutor.runWorker(ThreadPoolExecutor.java:1149)
	at java.util.concurrent.ThreadPoolExecutor$Worker.run(ThreadPoolExecutor.java:624)
	at java.lang.Thread.run(Thread.java:748)

org.apache.solr.common.util.ObjectReleaseTracker$ObjectTrackerException: org.apache.http.impl.client.InternalHttpClient
	at org.apache.solr.common.util.ObjectReleaseTracker.track(ObjectReleaseTracker.java:42)
	at org.apache.solr.client.solrj.impl.HttpClientUtil.createClient(HttpClientUtil.java:321)
	at org.apache.solr.client.solrj.impl.HttpClientUtil.createClient(HttpClientUtil.java:330)
	at org.apache.solr.handler.IndexFetcher.createHttpClient(IndexFetcher.java:230)
	at org.apache.solr.handler.IndexFetcher.<init>(IndexFetcher.java:272)
	at org.apache.solr.handler.ReplicationHandler.inform(ReplicationHandler.java:1223)
	at org.apache.solr.core.SolrResourceLoader.inform(SolrResourceLoader.java:696)
	at org.apache.solr.core.SolrCore.<init>(SolrCore.java:1003)
	at org.apache.solr.core.SolrCore.<init>(SolrCore.java:881)
	at org.apache.solr.core.CoreContainer.createFromDescriptor(CoreContainer.java:1251)
	at org.apache.solr.core.CoreContainer.lambda$load$13(CoreContainer.java:765)
	at com.codahale.metrics.InstrumentedExecutorService$InstrumentedCallable.call(InstrumentedExecutorService.java:202)
	at java.util.concurrent.FutureTask.run(FutureTask.java:266)
	at org.apache.solr.common.util.ExecutorUtil$MDCAwareThreadPoolExecutor.lambda$execute$0(ExecutorUtil.java:210)
	at java.util.concurrent.ThreadPoolExecutor.runWorker(ThreadPoolExecutor.java:1149)
	at java.util.concurrent.ThreadPoolExecutor$Worker.run(ThreadPoolExecutor.java:624)
	at java.lang.Thread.run(Thread.java:748)

org.apache.solr.common.util.ObjectReleaseTracker$ObjectTrackerException: org.apache.lucene.store.MockDirectoryWrapper
	at org.apache.solr.common.util.ObjectReleaseTracker.track(ObjectReleaseTracker.java:42)
	at org.apache.solr.core.CachingDirectoryFactory.get(CachingDirectoryFactory.java:348)
	at org.apache.solr.core.SolrCore.getNewIndexDir(SolrCore.java:368)
	at org.apache.solr.core.SolrCore.initIndex(SolrCore.java:745)
	at org.apache.solr.core.SolrCore.<init>(SolrCore.java:969)
	at org.apache.solr.core.SolrCore.<init>(SolrCore.java:881)
	at org.apache.solr.core.CoreContainer.createFromDescriptor(CoreContainer.java:1251)
	at org.apache.solr.core.CoreContainer.lambda$load$13(CoreContainer.java:765)
	at com.codahale.metrics.InstrumentedExecutorService$InstrumentedCallable.call(InstrumentedExecutorService.java:202)
	at java.util.concurrent.FutureTask.run(FutureTask.java:266)
	at org.apache.solr.common.util.ExecutorUtil$MDCAwareThreadPoolExecutor.lambda$execute$0(ExecutorUtil.java:210)
	at java.util.concurrent.ThreadPoolExecutor.runWorker(ThreadPoolExecutor.java:1149)
	at java.util.concurrent.ThreadPoolExecutor$Worker.run(ThreadPoolExecutor.java:624)
	at java.lang.Thread.run(Thread.java:748)

org.apache.solr.common.util.ObjectReleaseTracker$ObjectTrackerException: org.apache.solr.core.SolrCore
	at org.apache.solr.common.util.ObjectReleaseTracker.track(ObjectReleaseTracker.java:42)
	at org.apache.solr.core.SolrCore.<init>(SolrCore.java:1058)
	at org.apache.solr.core.SolrCore.<init>(SolrCore.java:881)
	at org.apache.solr.core.CoreContainer.createFromDescriptor(CoreContainer.java:1251)
	at org.apache.solr.core.CoreContainer.lambda$load$13(CoreContainer.java:765)
	at com.codahale.metrics.InstrumentedExecutorService$InstrumentedCallable.call(InstrumentedExecutorService.java:202)
	at java.util.concurrent.FutureTask.run(FutureTask.java:266)
	at org.apache.solr.common.util.ExecutorUtil$MDCAwareThreadPoolExecutor.lambda$execute$0(ExecutorUtil.java:210)
	at java.util.concurrent.ThreadPoolExecutor.runWorker(ThreadPoolExecutor.java:1149)
	at java.util.concurrent.ThreadPoolExecutor$Worker.run(ThreadPoolExecutor.java:624)
	at java.lang.Thread.run(Thread.java:748)

org.apache.solr.common.util.ObjectReleaseTracker$ObjectTrackerException: org.apache.lucene.store.MockDirectoryWrapper
	at org.apache.solr.common.util.ObjectReleaseTracker.track(ObjectReleaseTracker.java:42)
	at org.apache.solr.core.CachingDirectoryFactory.get(CachingDirectoryFactory.java:348)
	at org.apache.solr.core.SolrCore.initSnapshotMetaDataManager(SolrCore.java:516)
	at org.apache.solr.core.SolrCore.<init>(SolrCore.java:961)
	at org.apache.solr.core.SolrCore.<init>(SolrCore.java:881)
	at org.apache.solr.core.CoreContainer.createFromDescriptor(CoreContainer.java:1251)
	at org.apache.solr.core.CoreContainer.lambda$load$13(CoreContainer.java:765)
	at com.codahale.metrics.InstrumentedExecutorService$InstrumentedCallable.call(InstrumentedExecutorService.java:202)
	at java.util.concurrent.FutureTask.run(FutureTask.java:266)
	at org.apache.solr.common.util.ExecutorUtil$MDCAwareThreadPoolExecutor.lambda$execute$0(ExecutorUtil.java:210)
	at java.util.concurrent.ThreadPoolExecutor.runWorker(ThreadPoolExecutor.java:1149)
	at java.util.concurrent.ThreadPoolExecutor$Worker.run(ThreadPoolExecutor.java:624)
	at java.lang.Thread.run(Thread.java:748)

org.apache.solr.common.util.ObjectReleaseTracker$ObjectTrackerException: org.apache.lucene.store.MockDirectoryWrapper
	at org.apache.solr.common.util.ObjectReleaseTracker.track(ObjectReleaseTracker.java:42)
	at org.apache.solr.core.CachingDirectoryFactory.get(CachingDirectoryFactory.java:348)
	at org.apache.solr.update.SolrIndexWriter.create(SolrIndexWriter.java:98)
	at org.apache.solr.core.SolrCore.initIndex(SolrCore.java:777)
	at org.apache.solr.core.SolrCore.<init>(SolrCore.java:969)
	at org.apache.solr.core.SolrCore.<init>(SolrCore.java:881)
	at org.apache.solr.core.CoreContainer.createFromDescriptor(CoreContainer.java:1251)
	at org.apache.solr.core.CoreContainer.lambda$load$13(CoreContainer.java:765)
	at com.codahale.metrics.InstrumentedExecutorService$InstrumentedCallable.call(InstrumentedExecutorService.java:202)
	at java.util.concurrent.FutureTask.run(FutureTask.java:266)
	at org.apache.solr.common.util.ExecutorUtil$MDCAwareThreadPoolExecutor.lambda$execute$0(ExecutorUtil.java:210)
	at java.util.concurrent.ThreadPoolExecutor.runWorker(ThreadPoolExecutor.java:1149)
	at java.util.concurrent.ThreadPoolExecutor$Worker.run(ThreadPoolExecutor.java:624)
	at java.lang.Thread.run(Thread.java:748)

 expected null, but was:<ObjectTracker found 6 object(s) that were not released!!! [MockDirectoryWrapper, InternalHttpClient, MockDirectoryWrapper, SolrCore, MockDirectoryWrapper, MockDirectoryWrapper]
org.apache.solr.common.util.ObjectReleaseTracker$ObjectTrackerException: org.apache.lucene.store.MockDirectoryWrapper
	at org.apache.solr.common.util.ObjectReleaseTracker.track(ObjectReleaseTracker.java:42)
	at org.apache.solr.core.CachingDirectoryFactory.get(CachingDirectoryFactory.java:348)
	at org.apache.solr.handler.IndexFetcher.fetchLatestIndex(IndexFetcher.java:509)
	at org.apache.solr.handler.IndexFetcher.fetchLatestIndex(IndexFetcher.java:351)
	at org.apache.solr.handler.ReplicationHandler.doFetch(ReplicationHandler.java:424)
	at org.apache.solr.handler.ReplicationHandler.lambda$setupPolling$13(ReplicationHandler.java:1192)
	at java.util.concurrent.Executors$RunnableAdapter.call(Executors.java:511)
	at java.util.concurrent.FutureTask.runAndReset(FutureTask.java:308)
	at java.util.concurrent.ScheduledThreadPoolExecutor$ScheduledFutureTask.access$301(ScheduledThreadPoolExecutor.java:180)
	at java.util.concurrent.ScheduledThreadPoolExecutor$ScheduledFutureTask.run(ScheduledThreadPoolExecutor.java:294)
	at java.util.concurrent.ThreadPoolExecutor.runWorker(ThreadPoolExecutor.java:1149)
	at java.util.concurrent.ThreadPoolExecutor$Worker.run(ThreadPoolExecutor.java:624)
	at java.lang.Thread.run(Thread.java:748)

org.apache.solr.common.util.ObjectReleaseTracker$ObjectTrackerException: org.apache.http.impl.client.InternalHttpClient
	at org.apache.solr.common.util.ObjectReleaseTracker.track(ObjectReleaseTracker.java:42)
	at org.apache.solr.client.solrj.impl.HttpClientUtil.createClient(HttpClientUtil.java:321)
	at org.apache.solr.client.solrj.impl.HttpClientUtil.createClient(HttpClientUtil.java:330)
	at org.apache.solr.handler.IndexFetcher.createHttpClient(IndexFetcher.java:230)
	at org.apache.solr.handler.IndexFetcher.<init>(IndexFetcher.java:272)
	at org.apache.solr.handler.ReplicationHandler.inform(ReplicationHandler.java:1223)
	at org.apache.solr.core.SolrResourceLoader.inform(SolrResourceLoader.java:696)
	at org.apache.solr.core.SolrCore.<init>(SolrCore.java:1003)
	at org.apache.solr.core.SolrCore.<init>(SolrCore.java:881)
	at org.apache.solr.core.CoreContainer.createFromDescriptor(CoreContainer.java:1251)
	at org.apache.solr.core.CoreContainer.lambda$load$13(CoreContainer.java:765)
	at com.codahale.metrics.InstrumentedExecutorService$InstrumentedCallable.call(InstrumentedExecutorService.java:202)
	at java.util.concurrent.FutureTask.run(FutureTask.java:266)
	at org.apache.solr.common.util.ExecutorUtil$MDCAwareThreadPoolExecutor.lambda$execute$0(ExecutorUtil.java:210)
	at java.util.concurrent.ThreadPoolExecutor.runWorker(ThreadPoolExecutor.java:1149)
	at java.util.concurrent.ThreadPoolExecutor$Worker.run(ThreadPoolExecutor.java:624)
	at java.lang.Thread.run(Thread.java:748)

org.apache.solr.common.util.ObjectReleaseTracker$ObjectTrackerException: org.apache.lucene.store.MockDirectoryWrapper
	at org.apache.solr.common.util.ObjectReleaseTracker.track(ObjectReleaseTracker.java:42)
	at org.apache.solr.core.CachingDirectoryFactory.get(CachingDirectoryFactory.java:348)
	at org.apache.solr.core.SolrCore.getNewIndexDir(SolrCore.java:368)
	at org.apache.solr.core.SolrCore.initIndex(SolrCore.java:745)
	at org.apache.solr.core.SolrCore.<init>(SolrCore.java:969)
	at org.apache.solr.core.SolrCore.<init>(SolrCore.java:881)
	at org.apache.solr.core.CoreContainer.createFromDescriptor(CoreContainer.java:1251)
	at org.apache.solr.core.CoreContainer.lambda$load$13(CoreContainer.java:765)
	at com.codahale.metrics.InstrumentedExecutorService$InstrumentedCallable.call(InstrumentedExecutorService.java:202)
	at java.util.concurrent.FutureTask.run(FutureTask.java:266)
	at org.apache.solr.common.util.ExecutorUtil$MDCAwareThreadPoolExecutor.lambda$execute$0(ExecutorUtil.java:210)
	at java.util.concurrent.ThreadPoolExecutor.runWorker(ThreadPoolExecutor.java:1149)
	at java.util.concurrent.ThreadPoolExecutor$Worker.run(ThreadPoolExecutor.java:624)
	at java.lang.Thread.run(Thread.java:748)

org.apache.solr.common.util.ObjectReleaseTracker$ObjectTrackerException: org.apache.solr.core.SolrCore
	at org.apache.solr.common.util.ObjectReleaseTracker.track(ObjectReleaseTracker.java:42)
	at org.apache.solr.core.SolrCore.<init>(SolrCore.java:1058)
	at org.apache.solr.core.SolrCore.<init>(SolrCore.java:881)
	at org.apache.solr.core.CoreContainer.createFromDescriptor(CoreContainer.java:1251)
	at org.apache.solr.core.CoreContainer.lambda$load$13(CoreContainer.java:765)
	at com.codahale.metrics.InstrumentedExecutorService$InstrumentedCallable.call(InstrumentedExecutorService.java:202)
	at java.util.concurrent.FutureTask.run(FutureTask.java:266)
	at org.apache.solr.common.util.ExecutorUtil$MDCAwareThreadPoolExecutor.lambda$execute$0(ExecutorUtil.java:210)
	at java.util.concurrent.ThreadPoolExecutor.runWorker(ThreadPoolExecutor.java:1149)
	at java.util.concurrent.ThreadPoolExecutor$Worker.run(ThreadPoolExecutor.java:624)
	at java.lang.Thread.run(Thread.java:748)

org.apache.solr.common.util.ObjectReleaseTracker$ObjectTrackerException: org.apache.lucene.store.MockDirectoryWrapper
	at org.apache.solr.common.util.ObjectReleaseTracker.track(ObjectReleaseTracker.java:42)
	at org.apache.solr.core.CachingDirectoryFactory.get(CachingDirectoryFactory.java:348)
	at org.apache.solr.core.SolrCore.initSnapshotMetaDataManager(SolrCore.java:516)
	at org.apache.solr.core.SolrCore.<init>(SolrCore.java:961)
	at org.apache.solr.core.SolrCore.<init>(SolrCore.java:881)
	at org.apache.solr.core.CoreContainer.createFromDescriptor(CoreContainer.java:1251)
	at org.apache.solr.core.CoreContainer.lambda$load$13(CoreContainer.java:765)
	at com.codahale.metrics.InstrumentedExecutorService$InstrumentedCallable.call(InstrumentedExecutorService.java:202)
	at java.util.concurrent.FutureTask.run(FutureTask.java:266)
	at org.apache.solr.common.util.ExecutorUtil$MDCAwareThreadPoolExecutor.lambda$execute$0(ExecutorUtil.java:210)
	at java.util.concurrent.ThreadPoolExecutor.runWorker(ThreadPoolExecutor.java:1149)
	at java.util.concurrent.ThreadPoolExecutor$Worker.run(ThreadPoolExecutor.java:624)
	at java.lang.Thread.run(Thread.java:748)

org.apache.solr.common.util.ObjectReleaseTracker$ObjectTrackerException: org.apache.lucene.store.MockDirectoryWrapper
	at org.apache.solr.common.util.ObjectReleaseTracker.track(ObjectReleaseTracker.java:42)
	at org.apache.solr.core.CachingDirectoryFactory.get(CachingDirectoryFactory.java:348)
	at org.apache.solr.update.SolrIndexWriter.create(SolrIndexWriter.java:98)
	at org.apache.solr.core.SolrCore.initIndex(SolrCore.java:777)
	at org.apache.solr.core.SolrCore.<init>(SolrCore.java:969)
	at org.apache.solr.core.SolrCore.<init>(SolrCore.java:881)
	at org.apache.solr.core.CoreContainer.createFromDescriptor(CoreContainer.java:1251)
	at org.apache.solr.core.CoreContainer.lambda$load$13(CoreContainer.java:765)
	at com.codahale.metrics.InstrumentedExecutorService$InstrumentedCallable.call(InstrumentedExecutorService.java:202)
	at java.util.concurrent.FutureTask.run(FutureTask.java:266)
	at org.apache.solr.common.util.ExecutorUtil$MDCAwareThreadPoolExecutor.lambda$execute$0(ExecutorUtil.java:210)
	at java.util.concurrent.ThreadPoolExecutor.runWorker(ThreadPoolExecutor.java:1149)
	at java.util.concurrent.ThreadPoolExecutor$Worker.run(ThreadPoolExecutor.java:624)
	at java.lang.Thread.run(Thread.java:748)

>
	at __randomizedtesting.SeedInfo.seed([12CE71474BA64A5E]:0)
	at org.junit.Assert.fail(Assert.java:88)
	at org.junit.Assert.failNotNull(Assert.java:755)
	at org.junit.Assert.assertNull(Assert.java:737)
	at org.apache.solr.SolrTestCaseJ4.teardownTestCases(SolrTestCaseJ4.java:342)
	at sun.reflect.GeneratedMethodAccessor41.invoke(Unknown Source)
	at sun.reflect.DelegatingMethodAccessorImpl.invoke(DelegatingMethodAccessorImpl.java:43)
	at java.lang.reflect.Method.invoke(Method.java:498)
	at com.carrotsearch.randomizedtesting.RandomizedRunner.invoke(RandomizedRunner.java:1750)
	at com.carrotsearch.randomizedtesting.RandomizedRunner$7.evaluate(RandomizedRunner.java:901)
	at com.carrotsearch.randomizedtesting.rules.StatementAdapter.evaluate(StatementAdapter.java:36)
	at com.carrotsearch.randomizedtesting.rules.SystemPropertiesRestoreRule$1.evaluate(SystemPropertiesRestoreRule.java:57)
	at org.apache.lucene.util.AbstractBeforeAfterRule$1.evaluate(AbstractBeforeAfterRule.java:45)
	at com.carrotsearch.randomizedtesting.rules.StatementAdapter.evaluate(StatementAdapter.java:36)
	at org.apache.lucene.util.TestRuleStoreClassName$1.evaluate(TestRuleStoreClassName.java:41)
	at com.carrotsearch.randomizedtesting.rules.NoShadowingOrOverridesOnMethodsRule$1.evaluate(NoShadowingOrOverridesOnMethodsRule.java:40)
	at com.carrotsearch.randomizedtesting.rules.NoShadowingOrOverridesOnMethodsRule$1.evaluate(NoShadowingOrOverridesOnMethodsRule.java:40)
	at com.carrotsearch.randomizedtesting.rules.StatementAdapter.evaluate(StatementAdapter.java:36)
	at com.carrotsearch.randomizedtesting.rules.StatementAdapter.evaluate(StatementAdapter.java:36)
	at com.carrotsearch.randomizedtesting.rules.StatementAdapter.evaluate(StatementAdapter.java:36)
	at org.apache.lucene.util.TestRuleAssertionsRequired$1.evaluate(TestRuleAssertionsRequired.java:53)
	at org.apache.lucene.util.TestRuleMarkFailure$1.evaluate(TestRuleMarkFailure.java:47)
	at org.apache.lucene.util.TestRuleIgnoreAfterMaxFailures$1.evaluate(TestRuleIgnoreAfterMaxFailures.java:64)
	at org.apache.lucene.util.TestRuleIgnoreTestSuites$1.evaluate(TestRuleIgnoreTestSuites.java:54)
	at com.carrotsearch.randomizedtesting.rules.StatementAdapter.evaluate(StatementAdapter.java:36)
	at com.carrotsearch.randomizedtesting.ThreadLeakControl$StatementRunner.run(ThreadLeakControl.java:368)
	at java.lang.Thread.run(Thread.java:748)




Build Log:
[...truncated 15769 lines...]
   [junit4] Suite: org.apache.solr.handler.TestReplicationHandler
   [junit4]   2> 4527954 INFO  (SUITE-TestReplicationHandler-seed#[12CE71474BA64A5E]-worker) [     ] o.a.s.SolrTestCaseJ4 Created dataDir: /home/jenkins/jenkins-slave/workspace/Lucene-Solr-NightlyTests-8.3/checkout/solr/build/solr-core/test/J1/temp/solr.handler.TestReplicationHandler_12CE71474BA64A5E-001/data-dir-294-001
   [junit4]   2> 4527954 WARN  (SUITE-TestReplicationHandler-seed#[12CE71474BA64A5E]-worker) [     ] o.a.s.SolrTestCaseJ4 startTrackingSearchers: numOpens=15 numCloses=15
   [junit4]   2> 4527954 INFO  (SUITE-TestReplicationHandler-seed#[12CE71474BA64A5E]-worker) [     ] o.a.s.SolrTestCaseJ4 Using PointFields (NUMERIC_POINTS_SYSPROP=true) w/NUMERIC_DOCVALUES_SYSPROP=false
   [junit4]   2> 4527955 INFO  (SUITE-TestReplicationHandler-seed#[12CE71474BA64A5E]-worker) [     ] o.a.s.SolrTestCaseJ4 Randomized ssl (false) and clientAuth (false) via: @org.apache.solr.SolrTestCaseJ4$SuppressSSL(bugUrl=None)
   [junit4]   2> 4527955 INFO  (SUITE-TestReplicationHandler-seed#[12CE71474BA64A5E]-worker) [     ] o.a.s.SolrTestCaseJ4 SecureRandom sanity checks: test.solr.allowed.securerandom=null & java.security.egd=file:/dev/./urandom
   [junit4]   2> 4527963 INFO  (TEST-TestReplicationHandler.doTestRepeater-seed#[12CE71474BA64A5E]) [     ] o.a.s.SolrTestCaseJ4 ###Starting doTestRepeater
   [junit4]   2> 4527963 INFO  (TEST-TestReplicationHandler.doTestRepeater-seed#[12CE71474BA64A5E]) [     ] o.a.s.SolrTestCaseJ4 Writing core.properties file to /home/jenkins/jenkins-slave/workspace/Lucene-Solr-NightlyTests-8.3/checkout/solr/build/solr-core/test/J1/temp/solr.handler.TestReplicationHandler_12CE71474BA64A5E-001/solr-instance-001/collection1
   [junit4]   2> 4527966 WARN  (TEST-TestReplicationHandler.doTestRepeater-seed#[12CE71474BA64A5E]) [     ] o.e.j.s.AbstractConnector Ignoring deprecated socket close linger time
   [junit4]   2> 4527966 INFO  (TEST-TestReplicationHandler.doTestRepeater-seed#[12CE71474BA64A5E]) [     ] o.a.s.c.s.e.JettySolrRunner Start Jetty (configured port=0, binding port=0)
   [junit4]   2> 4527966 INFO  (TEST-TestReplicationHandler.doTestRepeater-seed#[12CE71474BA64A5E]) [     ] o.a.s.c.s.e.JettySolrRunner Trying to start Jetty on port 0 try number 1 ...
   [junit4]   2> 4527966 INFO  (TEST-TestReplicationHandler.doTestRepeater-seed#[12CE71474BA64A5E]) [     ] o.e.j.s.Server jetty-9.4.19.v20190610; built: 2019-06-10T16:30:51.723Z; git: afcf563148970e98786327af5e07c261fda175d3; jvm 1.8.0_191-b12
   [junit4]   2> 4527967 INFO  (TEST-TestReplicationHandler.doTestRepeater-seed#[12CE71474BA64A5E]) [     ] o.e.j.s.session DefaultSessionIdManager workerName=node0
   [junit4]   2> 4527967 INFO  (TEST-TestReplicationHandler.doTestRepeater-seed#[12CE71474BA64A5E]) [     ] o.e.j.s.session No SessionScavenger set, using defaults
   [junit4]   2> 4527967 INFO  (TEST-TestReplicationHandler.doTestRepeater-seed#[12CE71474BA64A5E]) [     ] o.e.j.s.session node0 Scavenging every 600000ms
   [junit4]   2> 4527967 INFO  (TEST-TestReplicationHandler.doTestRepeater-seed#[12CE71474BA64A5E]) [     ] o.e.j.s.h.ContextHandler Started o.e.j.s.ServletContextHandler@194f4091{/solr,null,AVAILABLE}
   [junit4]   2> 4527967 INFO  (TEST-TestReplicationHandler.doTestRepeater-seed#[12CE71474BA64A5E]) [     ] o.e.j.s.AbstractConnector Started ServerConnector@19b400d8{HTTP/1.1,[http/1.1, h2c]}{127.0.0.1:36667}
   [junit4]   2> 4527967 INFO  (TEST-TestReplicationHandler.doTestRepeater-seed#[12CE71474BA64A5E]) [     ] o.e.j.s.Server Started @4528037ms
   [junit4]   2> 4527967 INFO  (TEST-TestReplicationHandler.doTestRepeater-seed#[12CE71474BA64A5E]) [     ] o.a.s.c.s.e.JettySolrRunner Jetty properties: {solr.data.dir=/home/jenkins/jenkins-slave/workspace/Lucene-Solr-NightlyTests-8.3/checkout/solr/build/solr-core/test/J1/temp/solr.handler.TestReplicationHandler_12CE71474BA64A5E-001/solr-instance-001/collection1/data, hostContext=/solr, hostPort=36667}
   [junit4]   2> 4527972 ERROR (TEST-TestReplicationHandler.doTestRepeater-seed#[12CE71474BA64A5E]) [     ] o.a.s.u.StartupLoggingUtils Missing Java Option solr.log.dir. Logging may be missing or incomplete.
   [junit4]   2> 4527972 INFO  (TEST-TestReplicationHandler.doTestRepeater-seed#[12CE71474BA64A5E]) [     ] o.a.s.s.SolrDispatchFilter Using logger factory org.apache.logging.slf4j.Log4jLoggerFactory
   [junit4]   2> 4527972 INFO  (TEST-TestReplicationHandler.doTestRepeater-seed#[12CE71474BA64A5E]) [     ] o.a.s.s.SolrDispatchFilter  ___      _       Welcome to Apache Solr? version 8.3.1
   [junit4]   2> 4527972 INFO  (TEST-TestReplicationHandler.doTestRepeater-seed#[12CE71474BA64A5E]) [     ] o.a.s.s.SolrDispatchFilter / __| ___| |_ _   Starting in standalone mode on port null
   [junit4]   2> 4527972 INFO  (TEST-TestReplicationHandler.doTestRepeater-seed#[12CE71474BA64A5E]) [     ] o.a.s.s.SolrDispatchFilter \__ \/ _ \ | '_|  Install dir: null
   [junit4]   2> 4527972 INFO  (TEST-TestReplicationHandler.doTestRepeater-seed#[12CE71474BA64A5E]) [     ] o.a.s.s.SolrDispatchFilter |___/\___/_|_|    Start time: 2019-12-04T01:40:54.064Z
   [junit4]   2> 4527973 INFO  (TEST-TestReplicationHandler.doTestRepeater-seed#[12CE71474BA64A5E]) [     ] o.a.s.c.SolrXmlConfig Loading container configuration from /home/jenkins/jenkins-slave/workspace/Lucene-Solr-NightlyTests-8.3/checkout/solr/build/solr-core/test/J1/temp/solr.handler.TestReplicationHandler_12CE71474BA64A5E-001/solr-instance-001/solr.xml
   [junit4]   2> 4527976 INFO  (TEST-TestReplicationHandler.doTestRepeater-seed#[12CE71474BA64A5E]) [     ] o.a.s.c.SolrXmlConfig Configuration parameter autoReplicaFailoverWorkLoopDelay is ignored
   [junit4]   2> 4527976 INFO  (TEST-TestReplicationHandler.doTestRepeater-seed#[12CE71474BA64A5E]) [     ] o.a.s.c.SolrXmlConfig Configuration parameter autoReplicaFailoverBadNodeExpiration is ignored
   [junit4]   2> 4527977 INFO  (TEST-TestReplicationHandler.doTestRepeater-seed#[12CE71474BA64A5E]) [     ] o.a.s.c.SolrXmlConfig MBean server found: com.sun.jmx.mbeanserver.JmxMBeanServer@25e283f1, but no JMX reporters were configured - adding default JMX reporter.
   [junit4]   2> 4528038 INFO  (TEST-TestReplicationHandler.doTestRepeater-seed#[12CE71474BA64A5E]) [     ] o.a.s.h.c.HttpShardHandlerFactory Host whitelist initialized: WhitelistHostChecker [whitelistHosts=null, whitelistHostCheckingEnabled=true]
   [junit4]   2> 4528039 WARN  (TEST-TestReplicationHandler.doTestRepeater-seed#[12CE71474BA64A5E]) [     ] o.e.j.u.s.S.config Trusting all certificates configured for Client@4f083fb[provider=null,keyStore=null,trustStore=null]
   [junit4]   2> 4528039 WARN  (TEST-TestReplicationHandler.doTestRepeater-seed#[12CE71474BA64A5E]) [     ] o.e.j.u.s.S.config No Client EndPointIdentificationAlgorithm configured for Client@4f083fb[provider=null,keyStore=null,trustStore=null]
   [junit4]   2> 4528045 WARN  (TEST-TestReplicationHandler.doTestRepeater-seed#[12CE71474BA64A5E]) [     ] o.e.j.u.s.S.config Trusting all certificates configured for Client@3ab7b8f6[provider=null,keyStore=null,trustStore=null]
   [junit4]   2> 4528045 WARN  (TEST-TestReplicationHandler.doTestRepeater-seed#[12CE71474BA64A5E]) [     ] o.e.j.u.s.S.config No Client EndPointIdentificationAlgorithm configured for Client@3ab7b8f6[provider=null,keyStore=null,trustStore=null]
   [junit4]   2> 4528058 INFO  (TEST-TestReplicationHandler.doTestRepeater-seed#[12CE71474BA64A5E]) [     ] o.a.s.c.TransientSolrCoreCacheDefault Allocating transient cache for 4 transient cores
   [junit4]   2> 4528058 INFO  (TEST-TestReplicationHandler.doTestRepeater-seed#[12CE71474BA64A5E]) [     ] o.a.s.h.a.MetricsHistoryHandler No .system collection, keeping metrics history in memory.
   [junit4]   2> 4528069 INFO  (TEST-TestReplicationHandler.doTestRepeater-seed#[12CE71474BA64A5E]) [     ] o.a.s.m.r.SolrJmxReporter JMX monitoring for 'solr.node' (registry 'solr.node') enabled at server: com.sun.jmx.mbeanserver.JmxMBeanServer@25e283f1
   [junit4]   2> 4528075 INFO  (TEST-TestReplicationHandler.doTestRepeater-seed#[12CE71474BA64A5E]) [     ] o.a.s.m.r.SolrJmxReporter JMX monitoring for 'solr.jvm' (registry 'solr.jvm') enabled at server: com.sun.jmx.mbeanserver.JmxMBeanServer@25e283f1
   [junit4]   2> 4528075 INFO  (TEST-TestReplicationHandler.doTestRepeater-seed#[12CE71474BA64A5E]) [     ] o.a.s.m.r.SolrJmxReporter JMX monitoring for 'solr.jetty' (registry 'solr.jetty') enabled at server: com.sun.jmx.mbeanserver.JmxMBeanServer@25e283f1
   [junit4]   2> 4528076 INFO  (TEST-TestReplicationHandler.doTestRepeater-seed#[12CE71474BA64A5E]) [     ] o.a.s.c.CorePropertiesLocator Found 1 core definitions underneath /home/jenkins/jenkins-slave/workspace/Lucene-Solr-NightlyTests-8.3/checkout/solr/build/solr-core/test/J1/temp/solr.handler.TestReplicationHandler_12CE71474BA64A5E-001/solr-instance-001/.
   [junit4]   2> 4528076 INFO  (TEST-TestReplicationHandler.doTestRepeater-seed#[12CE71474BA64A5E]) [     ] o.a.s.c.CorePropertiesLocator Cores are: [collection1]
   [junit4]   2> 4528082 INFO  (coreLoadExecutor-20451-thread-1) [    x:collection1 ] o.a.s.c.SolrConfig Using Lucene MatchVersion: 8.3.1
   [junit4]   2> 4528104 INFO  (coreLoadExecutor-20451-thread-1) [    x:collection1 ] o.a.s.s.IndexSchema [collection1] Schema name=test
   [junit4]   2> 4528105 INFO  (coreLoadExecutor-20451-thread-1) [    x:collection1 ] o.a.s.s.IndexSchema Loaded schema test/1.2 with uniqueid field id
   [junit4]   2> 4528106 INFO  (coreLoadExecutor-20451-thread-1) [    x:collection1 ] o.a.s.c.CoreContainer Creating SolrCore 'collection1' using configuration from instancedir /home/jenkins/jenkins-slave/workspace/Lucene-Solr-NightlyTests-8.3/checkout/solr/build/solr-core/test/J1/temp/solr.handler.TestReplicationHandler_12CE71474BA64A5E-001/solr-instance-001/./collection1, trusted=true
   [junit4]   2> 4528106 INFO  (coreLoadExecutor-20451-thread-1) [    x:collection1 ] o.a.s.m.r.SolrJmxReporter JMX monitoring for 'solr.core.collection1' (registry 'solr.core.collection1') enabled at server: com.sun.jmx.mbeanserver.JmxMBeanServer@25e283f1
   [junit4]   2> 4528106 INFO  (coreLoadExecutor-20451-thread-1) [    x:collection1 ] o.a.s.c.SolrCore [[collection1] ] Opening new SolrCore at [/home/jenkins/jenkins-slave/workspace/Lucene-Solr-NightlyTests-8.3/checkout/solr/build/solr-core/test/J1/temp/solr.handler.TestReplicationHandler_12CE71474BA64A5E-001/solr-instance-001/collection1], dataDir=[/home/jenkins/jenkins-slave/workspace/Lucene-Solr-NightlyTests-8.3/checkout/solr/build/solr-core/test/J1/temp/solr.handler.TestReplicationHandler_12CE71474BA64A5E-001/solr-instance-001/./collection1/data/]
   [junit4]   2> 4528107 INFO  (coreLoadExecutor-20451-thread-1) [    x:collection1 ] o.a.s.u.RandomMergePolicy RandomMergePolicy wrapping class org.apache.lucene.index.LogByteSizeMergePolicy: [LogByteSizeMergePolicy: minMergeSize=1677721, mergeFactor=11, maxMergeSize=2147483648, maxMergeSizeForForcedMerge=9223372036854775807, calibrateSizeByDeletes=true, maxMergeDocs=2147483647, maxCFSSegmentSizeMB=8.796093022207999E12, noCFSRatio=0.524972096965401]
   [junit4]   2> 4528131 INFO  (coreLoadExecutor-20451-thread-1) [    x:collection1 ] o.a.s.u.CommitTracker Hard AutoCommit: disabled
   [junit4]   2> 4528131 INFO  (coreLoadExecutor-20451-thread-1) [    x:collection1 ] o.a.s.u.CommitTracker Soft AutoCommit: disabled
   [junit4]   2> 4528131 INFO  (coreLoadExecutor-20451-thread-1) [    x:collection1 ] o.a.s.u.RandomMergePolicy RandomMergePolicy wrapping class org.apache.lucene.index.TieredMergePolicy: [TieredMergePolicy: maxMergeAtOnce=49, maxMergeAtOnceExplicit=33, maxMergedSegmentMB=48.2138671875, floorSegmentMB=1.7509765625, forceMergeDeletesPctAllowed=17.633556409194693, segmentsPerTier=39.0, maxCFSSegmentSizeMB=8.796093022207999E12, noCFSRatio=0.12422583087255382, deletesPctAllowed=33.10301524403387
   [junit4]   2> 4528132 INFO  (coreLoadExecutor-20451-thread-1) [    x:collection1 ] o.a.s.s.SolrIndexSearcher Opening [Searcher@69ccca5[collection1] main]
   [junit4]   2> 4528132 INFO  (coreLoadExecutor-20451-thread-1) [    x:collection1 ] o.a.s.r.ManagedResourceStorage File-based storage initialized to use dir: /home/jenkins/jenkins-slave/workspace/Lucene-Solr-NightlyTests-8.3/checkout/solr/build/solr-core/test/J1/temp/solr.handler.TestReplicationHandler_12CE71474BA64A5E-001/solr-instance-001/collection1/conf
   [junit4]   2> 4528132 INFO  (coreLoadExecutor-20451-thread-1) [    x:collection1 ] o.a.s.h.ReplicationHandler Replication enabled for following config files: schema.xml,xslt/dummy.xsl
   [junit4]   2> 4528132 INFO  (coreLoadExecutor-20451-thread-1) [    x:collection1 ] o.a.s.h.ReplicationHandler Commits will be reserved for 10000ms.
   [junit4]   2> 4528132 INFO  (searcherExecutor-20452-thread-1-processing-x:collection1) [    x:collection1 ] o.a.s.c.SolrCore [collection1] Registered new searcher Searcher@69ccca5[collection1] main{ExitableDirectoryReader(UninvertingDirectoryReader())}
   [junit4]   2> 4528133 INFO  (TEST-TestReplicationHandler.doTestRepeater-seed#[12CE71474BA64A5E]) [     ] o.a.s.SolrTestCaseJ4 Writing core.properties file to /home/jenkins/jenkins-slave/workspace/Lucene-Solr-NightlyTests-8.3/checkout/solr/build/solr-core/test/J1/temp/solr.handler.TestReplicationHandler_12CE71474BA64A5E-001/solr-instance-002/collection1
   [junit4]   2> 4528135 WARN  (TEST-TestReplicationHandler.doTestRepeater-seed#[12CE71474BA64A5E]) [     ] o.e.j.s.AbstractConnector Ignoring deprecated socket close linger time
   [junit4]   2> 4528135 INFO  (TEST-TestReplicationHandler.doTestRepeater-seed#[12CE71474BA64A5E]) [     ] o.a.s.c.s.e.JettySolrRunner Start Jetty (configured port=0, binding port=0)
   [junit4]   2> 4528135 INFO  (TEST-TestReplicationHandler.doTestRepeater-seed#[12CE71474BA64A5E]) [     ] o.a.s.c.s.e.JettySolrRunner Trying to start Jetty on port 0 try number 1 ...
   [junit4]   2> 4528135 INFO  (TEST-TestReplicationHandler.doTestRepeater-seed#[12CE71474BA64A5E]) [     ] o.e.j.s.Server jetty-9.4.19.v20190610; built: 2019-06-10T16:30:51.723Z; git: afcf563148970e98786327af5e07c261fda175d3; jvm 1.8.0_191-b12
   [junit4]   2> 4528136 INFO  (TEST-TestReplicationHandler.doTestRepeater-seed#[12CE71474BA64A5E]) [     ] o.e.j.s.session DefaultSessionIdManager workerName=node0
   [junit4]   2> 4528136 INFO  (TEST-TestReplicationHandler.doTestRepeater-seed#[12CE71474BA64A5E]) [     ] o.e.j.s.session No SessionScavenger set, using defaults
   [junit4]   2> 4528136 INFO  (TEST-TestReplicationHandler.doTestRepeater-seed#[12CE71474BA64A5E]) [     ] o.e.j.s.session node0 Scavenging every 660000ms
   [junit4]   2> 4528136 INFO  (TEST-TestReplicationHandler.doTestRepeater-seed#[12CE71474BA64A5E]) [     ] o.e.j.s.h.ContextHandler Started o.e.j.s.ServletContextHandler@666a8d38{/solr,null,AVAILABLE}
   [junit4]   2> 4528136 INFO  (TEST-TestReplicationHandler.doTestRepeater-seed#[12CE71474BA64A5E]) [     ] o.e.j.s.AbstractConnector Started ServerConnector@47a3f3ad{HTTP/1.1,[http/1.1, h2c]}{127.0.0.1:34685}
   [junit4]   2> 4528136 INFO  (TEST-TestReplicationHandler.doTestRepeater-seed#[12CE71474BA64A5E]) [     ] o.e.j.s.Server Started @4528206ms
   [junit4]   2> 4528136 INFO  (TEST-TestReplicationHandler.doTestRepeater-seed#[12CE71474BA64A5E]) [     ] o.a.s.c.s.e.JettySolrRunner Jetty properties: {solr.data.dir=/home/jenkins/jenkins-slave/workspace/Lucene-Solr-NightlyTests-8.3/checkout/solr/build/solr-core/test/J1/temp/solr.handler.TestReplicationHandler_12CE71474BA64A5E-001/solr-instance-002/collection1/data, hostContext=/solr, hostPort=34685}
   [junit4]   2> 4528136 ERROR (TEST-TestReplicationHandler.doTestRepeater-seed#[12CE71474BA64A5E]) [     ] o.a.s.u.StartupLoggingUtils Missing Java Option solr.log.dir. Logging may be missing or incomplete.
   [junit4]   2> 4528136 INFO  (TEST-TestReplicationHandler.doTestRepeater-seed#[12CE71474BA64A5E]) [     ] o.a.s.s.SolrDispatchFilter Using logger factory org.apache.logging.slf4j.Log4jLoggerFactory
   [junit4]   2> 4528137 INFO  (TEST-TestReplicationHandler.doTestRepeater-seed#[12CE71474BA64A5E]) [     ] o.a.s.s.SolrDispatchFilter  ___      _       Welcome to Apache Solr? version 8.3.1
   [junit4]   2> 4528137 INFO  (TEST-TestReplicationHandler.doTestRepeater-seed#[12CE71474BA64A5E]) [     ] o.a.s.s.SolrDispatchFilter / __| ___| |_ _   Starting in standalone mode on port null
   [junit4]   2> 4528137 INFO  (TEST-TestReplicationHandler.doTestRepeater-seed#[12CE71474BA64A5E]) [     ] o.a.s.s.SolrDispatchFilter \__ \/ _ \ | '_|  Install dir: null
   [junit4]   2> 4528137 INFO  (TEST-TestReplicationHandler.doTestRepeater-seed#[12CE71474BA64A5E]) [     ] o.a.s.s.SolrDispatchFilter |___/\___/_|_|    Start time: 2019-12-04T01:40:54.229Z
   [junit4]   2> 4528137 INFO  (TEST-TestReplicationHandler.doTestRepeater-seed#[12CE71474BA64A5E]) [     ] o.a.s.c.SolrXmlConfig Loading container configuration from /home/jenkins/jenkins-slave/workspace/Lucene-Solr-NightlyTests-8.3/checkout/solr/build/solr-core/test/J1/temp/solr.handler.TestReplicationHandler_12CE71474BA64A5E-001/solr-instance-002/solr.xml
   [junit4]   2> 4528139 INFO  (TEST-TestReplicationHandler.doTestRepeater-seed#[12CE71474BA64A5E]) [     ] o.a.s.c.SolrXmlConfig Configuration parameter autoReplicaFailoverWorkLoopDelay is ignored
   [junit4]   2> 4528139 INFO  (TEST-TestReplicationHandler.doTestRepeater-seed#[12CE71474BA64A5E]) [     ] o.a.s.c.SolrXmlConfig Configuration parameter autoReplicaFailoverBadNodeExpiration is ignored
   [junit4]   2> 4528140 INFO  (TEST-TestReplicationHandler.doTestRepeater-seed#[12CE71474BA64A5E]) [     ] o.a.s.c.SolrXmlConfig MBean server found: com.sun.jmx.mbeanserver.JmxMBeanServer@25e283f1, but no JMX reporters were configured - adding default JMX reporter.
   [junit4]   2> 4528180 INFO  (TEST-TestReplicationHandler.doTestRepeater-seed#[12CE71474BA64A5E]) [     ] o.a.s.h.c.HttpShardHandlerFactory Host whitelist initialized: WhitelistHostChecker [whitelistHosts=null, whitelistHostCheckingEnabled=true]
   [junit4]   2> 4528181 WARN  (TEST-TestReplicationHandler.doTestRepeater-seed#[12CE71474BA64A5E]) [     ] o.e.j.u.s.S.config Trusting all certificates configured for Client@60808f83[provider=null,keyStore=null,trustStore=null]
   [junit4]   2> 4528181 WARN  (TEST-TestReplicationHandler.doTestRepeater-seed#[12CE71474BA64A5E]) [     ] o.e.j.u.s.S.config No Client EndPointIdentificationAlgorithm configured for Client@60808f83[provider=null,keyStore=null,trustStore=null]
   [junit4]   2> 4528183 WARN  (TEST-TestReplicationHandler.doTestRepeater-seed#[12CE71474BA64A5E]) [     ] o.e.j.u.s.S.config Trusting all certificates configured for Client@4c9314ee[provider=null,keyStore=null,trustStore=null]
   [junit4]   2> 4528183 WARN  (TEST-TestReplicationHandler.doTestRepeater-seed#[12CE71474BA64A5E]) [     ] o.e.j.u.s.S.config No Client EndPointIdentificationAlgorithm configured for Client@4c9314ee[provider=null,keyStore=null,trustStore=null]
   [junit4]   2> 4528194 INFO  (TEST-TestReplicationHandler.doTestRepeater-seed#[12CE71474BA64A5E]) [     ] o.a.s.c.TransientSolrCoreCacheDefault Allocating transient cache for 4 transient cores
   [junit4]   2> 4528194 INFO  (TEST-TestReplicationHandler.doTestRepeater-seed#[12CE71474BA64A5E]) [     ] o.a.s.h.a.MetricsHistoryHandler No .system collection, keeping metrics history in memory.
   [junit4]   2> 4528206 INFO  (TEST-TestReplicationHandler.doTestRepeater-seed#[12CE71474BA64A5E]) [     ] o.a.s.m.r.SolrJmxReporter JMX monitoring for 'solr.node' (registry 'solr.node') enabled at server: com.sun.jmx.mbeanserver.JmxMBeanServer@25e283f1
   [junit4]   2> 4528214 INFO  (TEST-TestReplicationHandler.doTestRepeater-seed#[12CE71474BA64A5E]) [     ] o.a.s.m.r.SolrJmxReporter JMX monitoring for 'solr.jvm' (registry 'solr.jvm') enabled at server: com.sun.jmx.mbeanserver.JmxMBeanServer@25e283f1
   [junit4]   2> 4528214 INFO  (TEST-TestReplicationHandler.doTestRepeater-seed#[12CE71474BA64A5E]) [     ] o.a.s.m.r.SolrJmxReporter JMX monitoring for 'solr.jetty' (registry 'solr.jetty') enabled at server: com.sun.jmx.mbeanserver.JmxMBeanServer@25e283f1
   [junit4]   2> 4528215 INFO  (TEST-TestReplicationHandler.doTestRepeater-seed#[12CE71474BA64A5E]) [     ] o.a.s.c.CorePropertiesLocator Found 1 core definitions underneath /home/jenkins/jenkins-slave/workspace/Lucene-Solr-NightlyTests-8.3/checkout/solr/build/solr-core/test/J1/temp/solr.handler.TestReplicationHandler_12CE71474BA64A5E-001/solr-instance-002/.
   [junit4]   2> 4528215 INFO  (TEST-TestReplicationHandler.doTestRepeater-seed#[12CE71474BA64A5E]) [     ] o.a.s.c.CorePropertiesLocator Cores are: [collection1]
   [junit4]   2> 4528221 INFO  (coreLoadExecutor-20464-thread-1) [    x:collection1 ] o.a.s.c.SolrConfig Using Lucene MatchVersion: 8.3.1
   [junit4]   2> 4528229 INFO  (coreLoadExecutor-20464-thread-1) [    x:collection1 ] o.a.s.s.IndexSchema [collection1] Schema name=test
   [junit4]   2> 4528230 INFO  (coreLoadExecutor-20464-thread-1) [    x:collection1 ] o.a.s.s.IndexSchema Loaded schema test/1.2 with uniqueid field id
   [junit4]   2> 4528230 INFO  (coreLoadExecutor-20464-thread-1) [    x:collection1 ] o.a.s.c.CoreContainer Creating SolrCore 'collection1' using configuration from instancedir /home/jenkins/jenkins-slave/workspace/Lucene-Solr-NightlyTests-8.3/checkout/solr/build/solr-core/test/J1/temp/solr.handler.TestReplicationHandler_12CE71474BA64A5E-001/solr-instance-002/./collection1, trusted=true
   [junit4]   2> 4528230 INFO  (coreLoadExecutor-20464-thread-1) [    x:collection1 ] o.a.s.m.r.SolrJmxReporter JMX monitoring for 'solr.core.collection1' (registry 'solr.core.collection1') enabled at server: com.sun.jmx.mbeanserver.JmxMBeanServer@25e283f1
   [junit4]   2> 4528230 INFO  (coreLoadExecutor-20464-thread-1) [    x:collection1 ] o.a.s.c.SolrCore [[collection1] ] Opening new SolrCore at [/home/jenkins/jenkins-slave/workspace/Lucene-Solr-NightlyTests-8.3/checkout/solr/build/solr-core/test/J1/temp/solr.handler.TestReplicationHandler_12CE71474BA64A5E-001/solr-instance-002/collection1], dataDir=[/home/jenkins/jenkins-slave/workspace/Lucene-Solr-NightlyTests-8.3/checkout/solr/build/solr-core/test/J1/temp/solr.handler.TestReplicationHandler_12CE71474BA64A5E-001/solr-instance-002/./collection1/data/]
   [junit4]   2> 4528237 INFO  (coreLoadExecutor-20464-thread-1) [    x:collection1 ] o.a.s.u.RandomMergePolicy RandomMergePolicy wrapping class org.apache.lucene.index.LogByteSizeMergePolicy: [LogByteSizeMergePolicy: minMergeSize=1677721, mergeFactor=11, maxMergeSize=2147483648, maxMergeSizeForForcedMerge=9223372036854775807, calibrateSizeByDeletes=true, maxMergeDocs=2147483647, maxCFSSegmentSizeMB=8.796093022207999E12, noCFSRatio=0.524972096965401]
   [junit4]   2> 4528284 INFO  (coreLoadExecutor-20464-thread-1) [    x:collection1 ] o.a.s.u.CommitTracker Hard AutoCommit: disabled
   [junit4]   2> 4528284 INFO  (coreLoadExecutor-20464-thread-1) [    x:collection1 ] o.a.s.u.CommitTracker Soft AutoCommit: disabled
   [junit4]   2> 4528284 INFO  (coreLoadExecutor-20464-thread-1) [    x:collection1 ] o.a.s.u.RandomMergePolicy RandomMergePolicy wrapping class org.apache.lucene.index.TieredMergePolicy: [TieredMergePolicy: maxMergeAtOnce=49, maxMergeAtOnceExplicit=33, maxMergedSegmentMB=48.2138671875, floorSegmentMB=1.7509765625, forceMergeDeletesPctAllowed=17.633556409194693, segmentsPerTier=39.0, maxCFSSegmentSizeMB=8.796093022207999E12, noCFSRatio=0.12422583087255382, deletesPctAllowed=33.10301524403387
   [junit4]   2> 4528284 INFO  (coreLoadExecutor-20464-thread-1) [    x:collection1 ] o.a.s.s.SolrIndexSearcher Opening [Searcher@167b4612[collection1] main]
   [junit4]   2> 4528284 INFO  (coreLoadExecutor-20464-thread-1) [    x:collection1 ] o.a.s.r.ManagedResourceStorage File-based storage initialized to use dir: /home/jenkins/jenkins-slave/workspace/Lucene-Solr-NightlyTests-8.3/checkout/solr/build/solr-core/test/J1/temp/solr.handler.TestReplicationHandler_12CE71474BA64A5E-001/solr-instance-002/collection1/conf
   [junit4]   2> 4528286 INFO  (coreLoadExecutor-20464-thread-1) [    x:collection1 ] o.a.s.h.ReplicationHandler Poll scheduled at an interval of 1000ms
   [junit4]   2> 4528286 INFO  (coreLoadExecutor-20464-thread-1) [    x:collection1 ] o.a.s.h.ReplicationHandler Commits will be reserved for 10000ms.
   [junit4]   2> 4528286 INFO  (searcherExecutor-20465-thread-1-processing-x:collection1) [    x:collection1 ] o.a.s.c.SolrCore [collection1] Registered new searcher Searcher@167b4612[collection1] main{ExitableDirectoryReader(UninvertingDirectoryReader())}
   [junit4]   2> 4528289 INFO  (TEST-TestReplicationHandler.doTestRepeater-seed#[12CE71474BA64A5E]) [     ] o.a.s.c.CoreContainer Shutting down CoreContainer instance=1385425288
   [junit4]   2> 4528289 INFO  (coreCloseExecutor-20470-thread-1) [    x:collection1 ] o.a.s.c.SolrCore [collection1]  CLOSING SolrCore org.apache.solr.core.SolrCore@7347069
   [junit4]   2> 4528289 INFO  (coreCloseExecutor-20470-thread-1) [    x:collection1 ] o.a.s.m.SolrMetricManager Closing metric reporters for registry=solr.core.collection1, tag=SolrCore@7347069
   [junit4]   2> 4528289 INFO  (coreCloseExecutor-20470-thread-1) [    x:collection1 ] o.a.s.m.r.SolrJmxReporter Closing reporter [org.apache.solr.metrics.reporters.SolrJmxReporter@53165f03: rootName = null, domain = solr.core.collection1, service url = null, agent id = null] for registry solr.core.collection1 / com.codahale.metrics.MetricRegistry@6f384fe6
   [junit4]   2> 4528296 INFO  (TEST-TestReplicationHandler.doTestRepeater-seed#[12CE71474BA64A5E]) [     ] o.a.s.m.SolrMetricManager Closing metric reporters for registry=solr.node, tag=null
   [junit4]   2> 4528296 INFO  (TEST-TestReplicationHandler.doTestRepeater-seed#[12CE71474BA64A5E]) [     ] o.a.s.m.r.SolrJmxReporter Closing reporter [org.apache.solr.metrics.reporters.SolrJmxReporter@23303c28: rootName = null, domain = solr.node, service url = null, agent id = null] for registry solr.node / com.codahale.metrics.MetricRegistry@2e3bb79c
   [junit4]   2> 4528299 INFO  (TEST-TestReplicationHandler.doTestRepeater-seed#[12CE71474BA64A5E]) [     ] o.a.s.m.SolrMetricManager Closing metric reporters for registry=solr.jvm, tag=null
   [junit4]   2> 4528299 INFO  (TEST-TestReplicationHandler.doTestRepeater-seed#[12CE71474BA64A5E]) [     ] o.a.s.m.r.SolrJmxReporter Closing reporter [org.apache.solr.metrics.reporters.SolrJmxReporter@7a4ef9d5: rootName = null, domain = solr.jvm, service url = null, agent id = null] for registry solr.jvm / com.codahale.metrics.MetricRegistry@38d3b60b
   [junit4]   2> 4528301 INFO  (TEST-TestReplicationHandler.doTestRepeater-seed#[12CE71474BA64A5E]) [     ] o.a.s.m.SolrMetricManager Closing metric reporters for registry=solr.jetty, tag=null
   [junit4]   2> 4528301 INFO  (TEST-TestReplicationHandler.doTestRepeater-seed#[12CE71474BA64A5E]) [     ] o.a.s.m.r.SolrJmxReporter Closing reporter [org.apache.solr.metrics.reporters.SolrJmxReporter@7a40f31d: rootName = null, domain = solr.jetty, service url = null, agent id = null] for registry solr.jetty / com.codahale.metrics.MetricRegistry@7dc7041d
   [junit4]   2> 4528303 INFO  (TEST-TestReplicationHandler.doTestRepeater-seed#[12CE71474BA64A5E]) [     ] o.e.j.s.AbstractConnector Stopped ServerConnector@47a3f3ad{HTTP/1.1,[http/1.1, h2c]}{127.0.0.1:0}
   [junit4]   2> 4528303 INFO  (TEST-TestReplicationHandler.doTestRepeater-seed#[12CE71474BA64A5E]) [     ] o.e.j.s.h.ContextHandler Stopped o.e.j.s.ServletContextHandler@666a8d38{/solr,null,UNAVAILABLE}
   [junit4]   2> 4528303 INFO  (TEST-TestReplicationHandler.doTestRepeater-seed#[12CE71474BA64A5E]) [     ] o.e.j.s.session node0 Stopped scavenging
   [junit4]   2> 4528303 WARN  (TEST-TestReplicationHandler.doTestRepeater-seed#[12CE71474BA64A5E]) [     ] o.e.j.s.AbstractConnector Ignoring deprecated socket close linger time
   [junit4]   2> 4528304 INFO  (TEST-TestReplicationHandler.doTestRepeater-seed#[12CE71474BA64A5E]) [     ] o.a.s.c.s.e.JettySolrRunner Start Jetty (configured port=0, binding port=0)
   [junit4]   2> 4528304 INFO  (TEST-TestReplicationHandler.doTestRepeater-seed#[12CE71474BA64A5E]) [     ] o.a.s.c.s.e.JettySolrRunner Trying to start Jetty on port 0 try number 1 ...
   [junit4]   2> 4528304 INFO  (TEST-TestReplicationHandler.doTestRepeater-seed#[12CE71474BA64A5E]) [     ] o.e.j.s.Server jetty-9.4.19.v20190610; built: 2019-06-10T16:30:51.723Z; git: afcf563148970e98786327af5e07c261fda175d3; jvm 1.8.0_191-b12
   [junit4]   2> 4528310 INFO  (TEST-TestReplicationHandler.doTestRepeater-seed#[12CE71474BA64A5E]) [     ] o.e.j.s.session DefaultSessionIdManager workerName=node0
   [junit4]   2> 4528310 INFO  (TEST-TestReplicationHandler.doTestRepeater-seed#[12CE71474BA64A5E]) [     ] o.e.j.s.session No SessionScavenger set, using defaults
   [junit4]   2> 4528310 INFO  (TEST-TestReplicationHandler.doTestRepeater-seed#[12CE71474BA64A5E]) [     ] o.e.j.s.session node0 Scavenging every 660000ms
   [junit4]   2> 4528310 INFO  (TEST-TestReplicationHandler.doTestRepeater-seed#[12CE71474BA64A5E]) [     ] o.e.j.s.h.ContextHandler Started o.e.j.s.ServletContextHandler@5d18c269{/solr,null,AVAILABLE}
   [junit4]   2> 4528310 INFO  (TEST-TestReplicationHandler.doTestRepeater-seed#[12CE71474BA64A5E]) [     ] o.e.j.s.AbstractConnector Started ServerConnector@3cfc767c{HTTP/1.1,[http/1.1, h2c]}{127.0.0.1:44025}
   [junit4]   2> 4528310 INFO  (TEST-TestReplicationHandler.doTestRepeater-seed#[12CE71474BA64A5E]) [     ] o.e.j.s.Server Started @4528379ms
   [junit4]   2> 4528310 INFO  (TEST-TestReplicationHandler.doTestRepeater-seed#[12CE71474BA64A5E]) [     ] o.a.s.c.s.e.JettySolrRunner Jetty properties: {solr.data.dir=/home/jenkins/jenkins-slave/workspace/Lucene-Solr-NightlyTests-8.3/checkout/solr/build/solr-core/test/J1/temp/solr.handler.TestReplicationHandler_12CE71474BA64A5E-001/solr-instance-002/collection1/data, hostContext=/solr, hostPort=44025}
   [junit4]   2> 4528310 ERROR (TEST-TestReplicationHandler.doTestRepeater-seed#[12CE71474BA64A5E]) [     ] o.a.s.u.StartupLoggingUtils Missing Java Option solr.log.dir. Logging may be missing or incomplete.
   [junit4]   2> 4528310 INFO  (TEST-TestReplicationHandler.doTestRepeater-seed#[12CE71474BA64A5E]) [     ] o.a.s.s.SolrDispatchFilter Using logger factory org.apache.logging.slf4j.Log4jLoggerFactory
   [junit4]   2> 4528310 INFO  (TEST-TestReplicationHandler.doTestRepeater-seed#[12CE71474BA64A5E]) [     ] o.a.s.s.SolrDispatchFilter  ___      _       Welcome to Apache Solr? version 8.3.1
   [junit4]   2> 4528310 INFO  (TEST-TestReplicationHandler.doTestRepeater-seed#[12CE71474BA64A5E]) [     ] o.a.s.s.SolrDispatchFilter / __| ___| |_ _   Starting in standalone mode on port null
   [junit4]   2> 4528310 INFO  (TEST-TestReplicationHandler.doTestRepeater-seed#[12CE71474BA64A5E]) [     ] o.a.s.s.SolrDispatchFilter \__ \/ _ \ | '_|  Install dir: null
   [junit4]   2> 4528310 INFO  (TEST-TestReplicationHandler.doTestRepeater-seed#[12CE71474BA64A5E]) [     ] o.a.s.s.SolrDispatchFilter |___/\___/_|_|    Start time: 2019-12-04T01:40:54.402Z
   [junit4]   2> 4528311 INFO  (TEST-TestReplicationHandler.doTestRepeater-seed#[12CE71474BA64A5E]) [     ] o.a.s.c.SolrXmlConfig Loading container configuration from /home/jenkins/jenkins-slave/workspace/Lucene-Solr-NightlyTests-8.3/checkout/solr/build/solr-core/test/J1/temp/solr.handler.TestReplicationHandler_12CE71474BA64A5E-001/solr-instance-002/solr.xml
   [junit4]   2> 4528313 INFO  (TEST-TestReplicationHandler.doTestRepeater-seed#[12CE71474BA64A5E]) [     ] o.a.s.c.SolrXmlConfig Configuration parameter autoReplicaFailoverWorkLoopDelay is ignored
   [junit4]   2> 4528313 INFO  (TEST-TestReplicationHandler.doTestRepeater-seed#[12CE71474BA64A5E]) [     ] o.a.s.c.SolrXmlConfig Configuration parameter autoReplicaFailoverBadNodeExpiration is ignored
   [junit4]   2> 4528314 INFO  (TEST-TestReplicationHandler.doTestRepeater-seed#[12CE71474BA64A5E]) [     ] o.a.s.c.SolrXmlConfig MBean server found: com.sun.jmx.mbeanserver.JmxMBeanServer@25e283f1, but no JMX reporters were configured - adding default JMX reporter.
   [junit4]   2> 4528367 INFO  (TEST-TestReplicationHandler.doTestRepeater-seed#[12CE71474BA64A5E]) [     ] o.a.s.h.c.HttpShardHandlerFactory Host whitelist initialized: WhitelistHostChecker [whitelistHosts=null, whitelistHostCheckingEnabled=true]
   [junit4]   2> 4528367 WARN  (TEST-TestReplicationHandler.doTestRepeater-seed#[12CE71474BA64A5E]) [     ] o.e.j.u.s.S.config Trusting all certificates configured for Client@393bf4c6[provider=null,keyStore=null,trustStore=null]
   [junit4]   2> 4528367 WARN  (TEST-TestReplicationHandler.doTestRepeater-seed#[12CE71474BA64A5E]) [     ] o.e.j.u.s.S.config No Client EndPointIdentificationAlgorithm configured for Client@393bf4c6[provider=null,keyStore=null,trustStore=null]
   [junit4]   2> 4528375 WARN  (TEST-TestReplicationHandler.doTestRepeater-seed#[12CE71474BA64A5E]) [     ] o.e.j.u.s.S.config Trusting all certificates configured for Client@3fc4933[provider=null,keyStore=null,trustStore=null]
   [junit4]   2> 4528375 WARN  (TEST-TestReplicationHandler.doTestRepeater-seed#[12CE71474BA64A5E]) [     ] o.e.j.u.s.S.config No Client EndPointIdentificationAlgorithm configured for Client@3fc4933[provider=null,keyStore=null,trustStore=null]
   [junit4]   2> 4528387 INFO  (TEST-TestReplicationHandler.doTestRepeater-seed#[12CE71474BA64A5E]) [     ] o.a.s.c.TransientSolrCoreCacheDefault Allocating transient cache for 4 transient cores
   [junit4]   2> 4528387 INFO  (TEST-TestReplicationHandler.doTestRepeater-seed#[12CE71474BA64A5E]) [     ] o.a.s.h.a.MetricsHistoryHandler No .system collection, keeping metrics history in memory.
   [junit4]   2> 4528398 INFO  (TEST-TestReplicationHandler.doTestRepeater-seed#[12CE71474BA64A5E]) [     ] o.a.s.m.r.SolrJmxReporter JMX monitoring for 'solr.node' (registry 'solr.node') enabled at server: com.sun.jmx.mbeanserver.JmxMBeanServer@25e283f1
   [junit4]   2> 4528403 INFO  (TEST-TestReplicationHandler.doTestRepeater-seed#[12CE71474BA64A5E]) [     ] o.a.s.m.r.SolrJmxReporter JMX monitoring for 'solr.jvm' (registry 'solr.jvm') enabled at server: com.sun.jmx.mbeanserver.JmxMBeanServer@25e283f1
   [junit4]   2> 4528403 INFO  (TEST-TestReplicationHandler.doTestRepeater-seed#[12CE71474BA64A5E]) [     ] o.a.s.m.r.SolrJmxReporter JMX monitoring for 'solr.jetty' (registry 'solr.jetty') enabled at server: com.sun.jmx.mbeanserver.JmxMBeanServer@25e283f1
   [junit4]   2> 4528404 INFO  (TEST-TestReplicationHandler.doTestRepeater-seed#[12CE71474BA64A5E]) [     ] o.a.s.c.CorePropertiesLocator Found 1 core definitions underneath /home/jenkins/jenkins-slave/workspace/Lucene-Solr-NightlyTests-8.3/checkout/solr/build/solr-core/test/J1/temp/solr.handler.TestReplicationHandler_12CE71474BA64A5E-001/solr-instance-002/.
   [junit4]   2> 4528404 INFO  (TEST-TestReplicationHandler.doTestRepeater-seed#[12CE71474BA64A5E]) [     ] o.a.s.c.CorePropertiesLocator Cores are: [collection1]
   [junit4]   2> 4528410 INFO  (coreLoadExecutor-20480-thread-1) [    x:collection1 ] o.a.s.c.SolrConfig Using Lucene MatchVersion: 8.3.1
   [junit4]   2> 4528417 INFO  (coreLoadExecutor-20480-thread-1) [    x:collection1 ] o.a.s.s.IndexSchema [collection1] Schema name=test
   [junit4]   2> 4528419 INFO  (coreLoadExecutor-20480-thread-1) [    x:collection1 ] o.a.s.s.IndexSchema Loaded schema test/1.2 with uniqueid field id
   [junit4]   2> 4528419 INFO  (coreLoadExecutor-20480-thread-1) [    x:collection1 ] o.a.s.c.CoreContainer Creating SolrCore 'collection1' using configuration from instancedir /home/jenkins/jenkins-slave/workspace/Lucene-Solr-NightlyTests-8.3/checkout/solr/build/solr-core/test/J1/temp/solr.handler.TestReplicationHandler_12CE71474BA64A5E-001/solr-instance-002/./collection1, trusted=true
   [junit4]   2> 4528419 INFO  (coreLoadExecutor-20480-thread-1) [    x:collection1 ] o.a.s.m.r.SolrJmxReporter JMX monitoring for 'solr.core.collection1' (registry 'solr.core.collection1') enabled at server: com.sun.jmx.mbeanserver.JmxMBeanServer@25e283f1
   [junit4]   2> 4528419 INFO  (coreLoadExecutor-20480-thread-1) [    x:collection1 ] o.a.s.c.SolrCore [[collection1] ] Opening new SolrCore at [/home/jenkins/jenkins-slave/workspace/Lucene-Solr-NightlyTests-8.3/checkout/solr/build/solr-core/test/J1/temp/solr.handler.TestReplicationHandler_12CE71474BA64A5E-001/solr-instance-002/collection1], dataDir=[/home/jenkins/jenkins-slave/workspace/Lucene-Solr-NightlyTests-8.3/checkout/solr/build/solr-core/test/J1/temp/solr.handler.TestReplicationHandler_12CE71474BA64A5E-001/solr-instance-002/./collection1/data/]
   [junit4]   2> 4528420 INFO  (coreLoadExecutor-20480-thread-1) [    x:collection1 ] o.a.s.u.RandomMergePolicy RandomMergePolicy wrapping class org.apache.lucene.index.LogByteSizeMergePolicy: [LogByteSizeMergePolicy: minMergeSize=1677721, mergeFactor=11, maxMergeSize=2147483648, maxMergeSizeForForcedMerge=9223372036854775807, calibrateSizeByDeletes=true, maxMergeDocs=2147483647, maxCFSSegmentSizeMB=8.796093022207999E12, noCFSRatio=0.524972096965401]
   [junit4]   2> 4528444 INFO  (coreLoadExecutor-20480-thread-1) [    x:collection1 ] o.a.s.u.CommitTracker Hard AutoCommit: disabled
   [junit4]   2> 4528444 INFO  (coreLoadExecutor-20480-thread-1) [    x:collection1 ] o.a.s.u.CommitTracker Soft AutoCommit: disabled
   [junit4]   2> 4528444 INFO  (coreLoadExecutor-20480-thread-1) [    x:collection1 ] o.a.s.u.RandomMergePolicy RandomMergePolicy wrapping class org.apache.lucene.index.TieredMergePolicy: [TieredMergePolicy: maxMergeAtOnce=49, maxMergeAtOnceExplicit=33, maxMergedSegmentMB=48.2138671875, floorSegmentMB=1.7509765625, forceMergeDeletesPctAllowed=17.633556409194693, segmentsPerTier=39.0, maxCFSSegmentSizeMB=8.796093022207999E12, noCFSRatio=0.12422583087255382, deletesPctAllowed=33.10301524403387
   [junit4]   2> 4528444 INFO  (coreLoadExecutor-20480-thread-1) [    x:collection1 ] o.a.s.s.SolrIndexSearcher Opening [Searcher@744fae40[collection1] main]
   [junit4]   2> 4528444 INFO  (coreLoadExecutor-20480-thread-1) [    x:collection1 ] o.a.s.r.ManagedResourceStorage File-based storage initialized to use dir: /home/jenkins/jenkins-slave/workspace/Lucene-Solr-NightlyTests-8.3/checkout/solr/build/solr-core/test/J1/temp/solr.handler.TestReplicationHandler_12CE71474BA64A5E-001/solr-instance-002/collection1/conf
   [junit4]   2> 4528445 INFO  (coreLoadExecutor-20480-thread-1) [    x:collection1 ] o.a.s.h.ReplicationHandler Commits will be reserved for 10000ms.
   [junit4]   2> 4528445 INFO  (searcherExecutor-20481-thread-1-processing-x:collection1) [    x:collection1 ] o.a.s.c.SolrCore [collection1] Registered new searcher Searcher@744fae40[collection1] main{ExitableDirectoryReader(UninvertingDirectoryReader())}
   [junit4]   2> 4528946 INFO  (TEST-TestReplicationHandler.doTestRepeater-seed#[12CE71474BA64A5E]) [     ] o.a.s.SolrTestCaseJ4 Writing core.properties file to /home/jenkins/jenkins-slave/workspace/Lucene-Solr-NightlyTests-8.3/checkout/solr/build/solr-core/test/J1/temp/solr.handler.TestReplicationHandler_12CE71474BA64A5E-001/solr-instance-003/collection1
   [junit4]   2> 4528950 WARN  (TEST-TestReplicationHandler.doTestRepeater-seed#[12CE71474BA64A5E]) [     ] o.e.j.s.AbstractConnector Ignoring deprecated socket close linger time
   [junit4]   2> 4528950 INFO  (TEST-TestReplicationHandler.doTestRepeater-seed#[12CE71474BA64A5E]) [     ] o.a.s.c.s.e.JettySolrRunner Start Jetty (configured port=0, binding port=0)
   [junit4]   2> 4528950 INFO  (TEST-TestReplicationHandler.doTestRepeater-seed#[12CE71474BA64A5E]) [     ] o.a.s.c.s.e.JettySolrRunner Trying to start Jetty on port 0 try number 1 ...
   [junit4]   2> 4528950 INFO  (TEST-TestReplicationHandler.doTestRepeater-seed#[12CE71474BA64A5E]) [     ] o.e.j.s.Server jetty-9.4.19.v20190610; built: 2019-06-10T16:30:51.723Z; git: afcf563148970e98786327af5e07c261fda175d3; jvm 1.8.0_191-b12
   [junit4]   2> 4528951 INFO  (TEST-TestReplicationHandler.doTestRepeater-seed#[12CE71474BA64A5E]) [     ] o.e.j.s.session DefaultSessionIdManager workerName=node0
   [junit4]   2> 4528951 INFO  (TEST-TestReplicationHandler.doTestRepeater-seed#[12CE71474BA64A5E]) [     ] o.e.j.s.session No SessionScavenger set, using defaults
   [junit4]   2> 4528951 INFO  (TEST-TestReplicationHandler.doTestRepeater-seed#[12CE71474BA64A5E]) [     ] o.e.j.s.session node0 Scavenging every 600000ms
   [junit4]   2> 4528951 INFO  (TEST-TestReplicationHandler.doTestRepeater-seed#[12CE71474BA64A5E]) [     ] o.e.j.s.h.ContextHandler Started o.e.j.s.ServletContextHandler@24abbfb2{/solr,null,AVAILABLE}
   [junit4]   2> 4528951 INFO  (TEST-TestReplicationHandler.doTestRepeater-seed#[12CE71474BA64A5E]) [     ] o.e.j.s.AbstractConnector Started ServerConnector@8a65b17{HTTP/1.1,[http/1.1, h2c]}{127.0.0.1:46715}
   [junit4]   2> 4528951 INFO  (TEST-TestReplicationHandler.doTestRepeater-seed#[12CE71474BA64A5E]) [     ] o.e.j.s.Server Started @4529021ms
   [junit4]   2> 4528951 INFO  (TEST-TestReplicationHandler.doTestRepeater-seed#[12CE71474BA64A5E]) [     ] o.a.s.c.s.e.JettySolrRunner Jetty properties: {solr.data.dir=/home/jenkins/jenkins-slave/workspace/Lucene-Solr-NightlyTests-8.3/checkout/solr/build/solr-core/test/J1/temp/solr.handler.TestReplicationHandler_12CE71474BA64A5E-001/solr-instance-003/collection1/data, hostContext=/solr, hostPort=46715}
   [junit4]   2> 4528951 ERROR (TEST-TestReplicationHandler.doTestRepeater-seed#[12CE71474BA64A5E]) [     ] o.a.s.u.StartupLoggingUtils Missing Java Option solr.log.dir. Logging may be missing or incomplete.
   [junit4]   2> 4528951 INFO  (TEST-TestReplicationHandler.doTestRepeater-seed#[12CE71474BA64A5E]) [     ] o.a.s.s.SolrDispatchFilter Using logger factory org.apache.logging.slf4j.Log4jLoggerFactory
   [junit4]   2> 4528952 INFO  (TEST-TestReplicationHandler.doTestRepeater-seed#[12CE71474BA64A5E]) [     ] o.a.s.s.SolrDispatchFilter  ___      _       Welcome to Apache Solr? version 8.3.1
   [junit4]   2> 4528952 INFO  (TEST-TestReplicationHandler.doTestRepeater-seed#[12CE71474BA64A5E]) [     ] o.a.s.s.SolrDispatchFilter / __| ___| |_ _   Starting in standalone mode on port null
   [junit4]   2> 4528952 INFO  (TEST-TestReplicationHandler.doTestRepeater-seed#[12CE71474BA64A5E]) [     ] o.a.s.s.SolrDispatchFilter \__ \/ _ \ | '_|  Install dir: null
   [junit4]   2> 4528952 INFO  (TEST-TestReplicationHandler.doTestRepeater-seed#[12CE71474BA64A5E]) [     ] o.a.s.s.SolrDispatchFilter |___/\___/_|_|    Start time: 2019-12-04T01:40:55.044Z
   [junit4]   2> 4528952 INFO  (TEST-TestReplicationHandler.doTestRepeater-seed#[12CE71474BA64A5E]) [     ] o.a.s.c.SolrXmlConfig Loading container configuration from /home/jenkins/jenkins-slave/workspace/Lucene-Solr-NightlyTests-8.3/checkout/solr/build/solr-core/test/J1/temp/solr.handler.TestReplicationHandler_12CE71474BA64A5E-001/solr-instance-003/solr.xml
   [junit4]   2> 4528955 INFO  (TEST-TestReplicationHandler.doTestRepeater-seed#[12CE71474BA64A5E]) [     ] o.a.s.c.SolrXmlConfig Configuration parameter autoReplicaFailoverWorkLoopDelay is ignored
   [junit4]   2> 4528955 INFO  (TEST-TestReplicationHandler.doTestRepeater-seed#[12CE71474BA64A5E]) [     ] o.a.s.c.SolrXmlConfig Configuration parameter autoReplicaFailoverBadNodeExpiration is ignored
   [junit4]   2> 4528956 INFO  (TEST-TestReplicationHandler.doTestRepeater-seed#[12CE71474BA64A5E]) [     ] o.a.s.c.SolrXmlConfig MBean server found: com.sun.jmx.mbeanserver.JmxMBeanServer@25e283f1, but no JMX reporters were configured - adding default JMX reporter.
   [junit4]   2> 4529005 INFO  (TEST-TestReplicationHandler.doTestRepeater-seed#[12CE71474BA64A5E]) [     ] o.a.s.h.c.HttpShardHandlerFactory Host whitelist initialized: WhitelistHostChecker [whitelistHosts=null, whitelistHostCheckingEnabled=true]
   [junit4]   2> 4529005 WARN  (TEST-TestReplicationHandler.doTestRepeater-seed#[12CE71474BA64A5E]) [     ] o.e.j.u.s.S.config Trusting all certificates configured for Client@321648e5[provider=null,keyStore=null,trustStore=null]
   [junit4]   2> 4529005 WARN  (TEST-TestReplicationHandler.doTestRepeater-seed#[12CE71474BA64A5E]) [     ] o.e.j.u.s.S.config No Client EndPointIdentificationAlgorithm configured for Client@321648e5[provider=null,keyStore=null,trustStore=null]
   [junit4]   2> 4529007 WARN  (TEST-TestReplicationHandler.doTestRepeater-seed#[12CE71474BA64A5E]) [     ] o.e.j.u.s.S.config Trusting all certificates configured for Client@36977526[provider=null,keyStore=null,trustStore=null]
   [junit4]   2> 4529007 WARN  (TEST-TestReplicationHandler.doTestRepeater-seed#[12CE71474BA64A5E]) [     ] o.e.j.u.s.S.config No Client EndPointIdentificationAlgorithm configured for Client@36977526[provider=null,keyStore=null,trustStore=null]
   [junit4]   2> 4529020 INFO  (TEST-TestReplicationHandler.doTestRepeater-seed#[12CE71474BA64A5E]) [     ] o.a.s.c.TransientSolrCoreCacheDefault Allocating transient cache for 4 transient cores
   [junit4]   2> 4529020 INFO  (TEST-TestReplicationHandler.doTestRepeater-seed#[12CE71474BA64A5E]) [     ] o.a.s.h.a.MetricsHistoryHandler No .system collection, keeping metrics history in memory.
   [junit4]   2> 4529032 INFO  (TEST-TestReplicationHandler.doTestRepeater-seed#[12CE71474BA64A5E]) [     ] o.a.s.m.r.SolrJmxReporter JMX monitoring for 'solr.node' (registry 'solr.node') enabled at server: com.sun.jmx.mbeanserver.JmxMBeanServer@25e283f1
   [junit4]   2> 4529051 INFO  (TEST-TestReplicationHandler.doTestRepeater-seed#[12CE71474BA64A5E]) [     ] o.a.s.m.r.SolrJmxReporter JMX monitoring for 'solr.jvm' (registry 'solr.jvm') enabled at server: com.sun.jmx.mbeanserver.JmxMBeanServer@25e283f1
   [junit4]   2> 4529051 INFO  (TEST-TestReplicationHandler.doTestRepeater-seed#[12CE71474BA64A5E]) [     ] o.a.s.m.r.SolrJmxReporter JMX monitoring for 'solr.jetty' (registry 'solr.jetty') enabled at server: com.sun.jmx.mbeanserver.JmxMBeanServer@25e283f1
   [junit4]   2> 4529052 INFO  (TEST-TestReplicationHandler.doTestRepeater-seed#[12CE71474BA64A5E]) [     ] o.a.s.c.CorePropertiesLocator Found 1 core definitions underneath /home/jenkins/jenkins-slave/workspace/Lucene-Solr-NightlyTests-8.3/checkout/solr/build/solr-core/test/J1/temp/solr.handler.TestReplicationHandler_12CE71474BA64A5E-001/solr-instance-003/.
   [junit4]   2> 4529052 INFO  (TEST-TestReplicationHandler.doTestRepeater-seed#[12CE71474BA64A5E]) [     ] o.a.s.c.CorePropertiesLocator Cores are: [collection1]
   [junit4]   2> 4529059 INFO  (coreLoadExecutor-20493-thread-1) [    x:collection1 ] o.a.s.c.SolrConfig Using Lucene MatchVersion: 8.3.1
   [junit4]   2> 4529068 INFO  (coreLoadExecutor-20493-thread-1) [    x:collection1 ] o.a.s.s.IndexSchema [collection1] Schema name=test
   [junit4]   2> 4529069 INFO  (coreLoadExecutor-20493-thread-1) [    x:collection1 ] o.a.s.s.IndexSchema Loaded schema test/1.2 with uniqueid field id
   [junit4]   2> 4529069 INFO  (coreLoadExecutor-20493-thread-1) [    x:collection1 ] o.a.s.c.CoreContainer Creating SolrCore 'collection1' using configuration from instancedir /home/jenkins/jenkins-slave/workspace/Lucene-Solr-NightlyTests-8.3/checkout/solr/build/solr-core/test/J1/temp/solr.handler.TestReplicationHandler_12CE71474BA64A5E-001/solr-instance-003/./collection1, trusted=true
   [junit4]   2> 4529070 INFO  (coreLoadExecutor-20493-thread-1) [    x:collection1 ] o.a.s.m.r.SolrJmxReporter JMX monitoring for 'solr.core.collection1' (registry 'solr.core.collection1') enabled at server: com.sun.jmx.mbeanserver.JmxMBeanServer@25e283f1
   [junit4]   2> 4529070 INFO  (coreLoadExecutor-20493-thread-1) [    x:collection1 ] o.a.s.c.SolrCore [[collection1] ] Opening new SolrCore at [/home/jenkins/jenkins-slave/workspace/Lucene-Solr-NightlyTests-8.3/checkout/solr/build/solr-core/test/J1/temp/solr.handler.TestReplicationHandler_12CE71474BA64A5E-001/solr-instance-003/collection1], dataDir=[/home/jenkins/jenkins-slave/workspace/Lucene-Solr-NightlyTests-8.3/checkout/solr/build/solr-core/test/J1/temp/solr.handler.TestReplicationHandler_12CE71474BA64A5E-001/solr-instance-003/./collection1/data/]
   [junit4]   2> 4529071 INFO  (coreLoadExecutor-20493-thread-1) [    x:collection1 ] o.a.s.u.RandomMergePolicy RandomMergePolicy wrapping class org.apache.lucene.index.LogByteSizeMergePolicy: [LogByteSizeMergePolicy: minMergeSize=1677721, mergeFactor=11, maxMergeSize=2147483648, maxMergeSizeForForcedMerge=9223372036854775807, calibrateSizeByDeletes=true, maxMergeDocs=2147483647, maxCFSSegmentSizeMB=8.796093022207999E12, noCFSRatio=0.524972096965401]
   [junit4]   2> 4529103 INFO  (coreLoadExecutor-20493-thread-1) [    x:collection1 ] o.a.s.u.CommitTracker Hard AutoCommit: disabled
   [junit4]   2> 4529103 INFO  (coreLoadExecutor-20493-thread-1) [    x:collection1 ] o.a.s.u.CommitTracker Soft AutoCommit: disabled
   [junit4]   2> 4529103 INFO  (coreLoadExecutor-20493-thread-1) [    x:collection1 ] o.a.s.u.RandomMergePolicy RandomMergePolicy wrapping class org.apache.lucene.index.TieredMergePolicy: [TieredMergePolicy: maxMergeAtOnce=49, maxMergeAtOnceExplicit=33, maxMergedSegmentMB=48.2138671875, floorSegmentMB=1.7509765625, forceMergeDeletesPctAllowed=17.633556409194693, segmentsPerTier=39.0, maxCFSSegmentSizeMB=8.796093022207999E12, noCFSRatio=0.12422583087255382, deletesPctAllowed=33.10301524403387
   [junit4]   2> 4529103 INFO  (coreLoadExecutor-20493-thread-1) [    x:collection1 ] o.a.s.s.SolrIndexSearcher Opening [Searcher@6d2c7b32[collection1] main]
   [junit4]   2> 4529104 INFO  (coreLoadExecutor-20493-thread-1) [    x:collection1 ] o.a.s.r.ManagedResourceStorage File-based storage initialized to use dir: /home/jenkins/jenkins-slave/workspace/Lucene-Solr-NightlyTests-8.3/checkout/solr/build/solr-core/test/J1/temp/solr.handler.TestReplicationHandler_12CE71474BA64A5E-001/solr-instance-003/collection1/conf
   [junit4]   2> 4529104 WARN  (coreLoadExecutor-20493-thread-1) [    x:collection1 ] o.a.s.h.IndexFetcher 'masterUrl' must be specified without the /replication suffix
   [junit4]   2> 4529105 INFO  (coreLoadExecutor-20493-thread-1) [    x:collection1 ] o.a.s.h.ReplicationHandler  No value set for 'pollInterval'. Timer Task not started.
   [junit4]   2> 4529105 INFO  (coreLoadExecutor-20493-thread-1) [    x:collection1 ] o.a.s.h.ReplicationHandler Replication enabled for following config files: schema.xml
   [junit4]   2> 4529105 INFO  (coreLoadExecutor-20493-thread-1) [    x:collection1 ] o.a.s.h.ReplicationHandler Commits will be reserved for 10000ms.
   [junit4]   2> 4529105 INFO  (searcherExecutor-20494-thread-1-processing-x:collection1) [    x:collection1 ] o.a.s.c.SolrCore [collection1] Registered new searcher Searcher@6d2c7b32[collection1] main{ExitableDirectoryReader(UninvertingDirectoryReader())}
   [junit4]   2> 4529107 INFO  (qtp764098561-140360) [    x:collection1 ] o.a.s.u.p.LogUpdateProcessorFactory [collection1]  webapp=/solr path=/update params={wt=javabin&version=2}{add=[0]} 0 0
   [junit4]   2> 4529107 INFO  (qtp764098561-140359) [    x:collection1 ] o.a.s.u.p.LogUpdateProcessorFactory [collection1]  webapp=/solr path=/update params={wt=javabin&version=2}{add=[1]} 0 0
   [junit4]   2> 4529108 INFO  (qtp764098561-140355) [    x:collection1 ] o.a.s.u.p.LogUpdateProcessorFactory [collection1]  webapp=/solr path=/update params={wt=javabin&version=2}{add=[2]} 0 0
   [junit4]   2> 4529108 INFO  (qtp764098561-140361) [    x:collection1 ] o.a.s.u.DirectUpdateHandler2 start commit{,optimize=false,openSearcher=true,waitSearcher=true,expungeDeletes=false,softCommit=false,prepareCommit=false}
   [junit4]   2> 4529108 INFO  (qtp764098561-140361) [    x:collection1 ] o.a.s.u.SolrIndexWriter Calling setCommitData with IW:org.apache.solr.update.SolrIndexWriter@1081a233 commitCommandVersion:0
   [junit4]   2> 4529114 INFO  (qtp764098561-140361) [    x:collection1 ] o.a.s.s.SolrIndexSearcher Opening [Searcher@2e3f40e[collection1] main]
   [junit4]   2> 4529114 INFO  (qtp764098561-140361) [    x:collection1 ] o.a.s.u.DirectUpdateHandler2 end_commit_flush
   [junit4]   2> 4529115 INFO  (searcherExecutor-20452-thread-1-processing-x:collection1) [    x:collection1 ] o.a.s.c.SolrCore [collection1] Registered new searcher Searcher@2e3f40e[collection1] main{ExitableDirectoryReader(UninvertingDirectoryReader(Uninverting(_0(8.3.1):C3:[diagnostics={os=Linux, java.vendor=Oracle Corporation, java.version=1.8.0_191, java.vm.version=25.191-b12, lucene.version=8.3.1, os.arch=amd64, java.runtime.version=1.8.0_191-b12, source=flush, os.version=4.15.0-54-generic, timestamp=1575423655201}]:[attributes={Lucene50StoredFieldsFormat.mode=BEST_SPEED}])))}
   [junit4]   2> 4529115 INFO  (qtp764098561-140361) [    x:collection1 ] o.a.s.u.p.LogUpdateProcessorFactory [collection1]  webapp=/solr path=/update params={waitSearcher=true&commit=true&softCommit=false&wt=javabin&version=2}{commit=} 0 6
   [junit4]   2> 4529117 WARN  (explicit-fetchindex-cmd) [     ] o.a.s.h.IndexFetcher 'masterUrl' must be specified without the /replication suffix
   [junit4]   2> 4529117 INFO  (qtp764098561-140360) [    x:collection1 ] o.a.s.c.S.Request [collection1]  webapp=/solr path=/replication params={qt=/replication&wt=javabin&version=2&command=indexversion} status=0 QTime=0
   [junit4]   2> 4529118 INFO  (explicit-fetchindex-cmd) [     ] o.a.s.h.IndexFetcher Master's generation: 2
   [junit4]   2> 4529118 INFO  (explicit-fetchindex-cmd) [     ] o.a.s.h.IndexFetcher Master's version: 1575423655200
   [junit4]   2> 4529118 INFO  (explicit-fetchindex-cmd) [     ] o.a.s.h.IndexFetcher Slave's generation: 1
   [junit4]   2> 4529118 INFO  (explicit-fetchindex-cmd) [     ] o.a.s.h.IndexFetcher Slave's version: 0
   [junit4]   2> 4529118 INFO  (explicit-fetchindex-cmd) [     ] o.a.s.h.IndexFetcher Starting replication process
   [junit4]   2> 4529119 INFO  (qtp764098561-140359) [    x:collection1 ] o.a.s.c.S.Request [collection1]  webapp=/solr path=/replication params={generation=2&qt=/replication&tlogFiles=false&wt=javabin&version=2&command=filelist} status=0 QTime=1
   [junit4]   2> 4529120 INFO  (explicit-fetchindex-cmd) [     ] o.a.s.h.IndexFetcher Number of files in latest index in master: 10
   [junit4]   2> 4529120 INFO  (explicit-fetchindex-cmd) [     ] o.a.s.u.RandomMergePolicy RandomMergePolicy wrapping class org.apache.lucene.index.TieredMergePolicy: [TieredMergePolicy: maxMergeAtOnce=28, maxMergeAtOnceExplicit=10, maxMergedSegmentMB=73.0498046875, floorSegmentMB=1.24609375, forceMergeDeletesPctAllowed=4.8859432985723386, segmentsPerTier=34.0, maxCFSSegmentSizeMB=8.796093022207999E12, noCFSRatio=0.0, deletesPctAllowed=29.879853983953183
   [junit4]   2> 4529121 INFO  (explicit-fetchindex-cmd) [     ] o.a.s.u.DefaultSolrCoreState New IndexWriter is ready to be used.
   [junit4]   2> 4529121 INFO  (explicit-fetchindex-cmd) [     ] o.a.s.h.IndexFetcher Starting download (fullCopy=false) to MockDirectoryWrapper(RAMDirectory@768509aa lockFactory=org.apache.lucene.store.SingleInstanceLockFactory@3129287b)
   [junit4]   2> 4529121 INFO  (explicit-fetchindex-cmd) [     ] o.a.s.h.IndexFetcher tmpIndexDir_type  : class org.apache.lucene.store.MockDirectoryWrapper , RAMDirectory@768509aa lockFactory=org.apache.lucene.store.SingleInstanceLockFactory@3129287b
   [junit4]   2> 4529122 INFO  (qtp764098561-140355) [    x:collection1 ] o.a.s.c.S.Request [collection1]  webapp=/solr path=/replication params={generation=2&qt=/replication&file=_0.si&checksum=true&wt=filestream&command=filecontent} status=0 QTime=0
   [junit4]   2> 4529122 INFO  (qtp764098561-140361) [    x:collection1 ] o.a.s.c.S.Request [collection1]  webapp=/solr path=/replication params={generation=2&qt=/replication&file=_0_Lucene50_0.doc&checksum=true&wt=filestream&command=filecontent} status=0 QTime=0
   [junit4]   2> 4529123 INFO  (qtp764098561-140357) [    x:collection1 ] o.a.s.c.S.Request [collection1]  webapp=/solr path=/replication params={generation=2&qt=/replication&file=_0_Lucene50_0.tim&checksum=true&wt=filestream&command=filecontent} status=0 QTime=0
   [junit4]   2> 4529124 INFO  (qtp764098561-140360) [    x:collection1 ] o.a.s.c.S.Request [collection1]  webapp=/solr path=/replication params={generation=2&qt=/replication&file=_0.nvd&checksum=true&wt=filestream&command=filecontent} status=0 QTime=0
   [junit4]   2> 4529124 INFO  (qtp764098561-140359) [    x:collection1 ] o.a.s.c.S.Request [collection1]  webapp=/solr path=/replication params={generation=2&qt=/replication&file=_0.fdx&checksum=true&wt=filestream&command=filecontent} status=0 QTime=0
   [junit4]   2> 4529125 INFO  (qtp764098561-140355) [    x:collection1 ] o.a.s.c.S.Request [collection1]  webapp=/solr path=/replication params={generation=2&qt=/replication&file=_0_Lucene50_0.tip&checksum=true&wt=filestream&command=filecontent} status=0 QTime=0
   [junit4]   2> 4529125 INFO  (qtp764098561-140361) [    x:collection1 ] o.a.s.c.S.Request [collection1]  webapp=/solr path=/replication params={generation=2&qt=/replication&file=_0.fdt&checksum=true&wt=filestream&command=filecontent} status=0 QTime=0
   [junit4]   2> 4529126 INFO  (qtp764098561-140357) [    x:collection1 ] o.a.s.c.S.Request [collection1]  webapp=/solr path=/replication params={generation=2&qt=/replication&file=_0.fnm&checksum=true&wt=filestream&command=filecontent} status=0 QTime=0
   [junit4]   2> 4529126 INFO  (qtp764098561-140360) [    x:collection1 ] o.a.s.c.S.Request [collection1]  webapp=/solr path=/replication params={generation=2&qt=/replication&fi

[...truncated too long message...]

a$load$13(CoreContainer.java:765)
   [junit4]    > 	at com.codahale.metrics.InstrumentedExecutorService$InstrumentedCallable.call(InstrumentedExecutorService.java:202)
   [junit4]    > 	at java.util.concurrent.FutureTask.run(FutureTask.java:266)
   [junit4]    > 	at org.apache.solr.common.util.ExecutorUtil$MDCAwareThreadPoolExecutor.lambda$execute$0(ExecutorUtil.java:210)
   [junit4]    > 	at java.util.concurrent.ThreadPoolExecutor.runWorker(ThreadPoolExecutor.java:1149)
   [junit4]    > 	at java.util.concurrent.ThreadPoolExecutor$Worker.run(ThreadPoolExecutor.java:624)
   [junit4]    > 	at java.lang.Thread.run(Thread.java:748)
   [junit4]    >  expected null, but was:<ObjectTracker found 6 object(s) that were not released!!! [MockDirectoryWrapper, InternalHttpClient, MockDirectoryWrapper, SolrCore, MockDirectoryWrapper, MockDirectoryWrapper]
   [junit4]    > org.apache.solr.common.util.ObjectReleaseTracker$ObjectTrackerException: org.apache.lucene.store.MockDirectoryWrapper
   [junit4]    > 	at org.apache.solr.common.util.ObjectReleaseTracker.track(ObjectReleaseTracker.java:42)
   [junit4]    > 	at org.apache.solr.core.CachingDirectoryFactory.get(CachingDirectoryFactory.java:348)
   [junit4]    > 	at org.apache.solr.handler.IndexFetcher.fetchLatestIndex(IndexFetcher.java:509)
   [junit4]    > 	at org.apache.solr.handler.IndexFetcher.fetchLatestIndex(IndexFetcher.java:351)
   [junit4]    > 	at org.apache.solr.handler.ReplicationHandler.doFetch(ReplicationHandler.java:424)
   [junit4]    > 	at org.apache.solr.handler.ReplicationHandler.lambda$setupPolling$13(ReplicationHandler.java:1192)
   [junit4]    > 	at java.util.concurrent.Executors$RunnableAdapter.call(Executors.java:511)
   [junit4]    > 	at java.util.concurrent.FutureTask.runAndReset(FutureTask.java:308)
   [junit4]    > 	at java.util.concurrent.ScheduledThreadPoolExecutor$ScheduledFutureTask.access$301(ScheduledThreadPoolExecutor.java:180)
   [junit4]    > 	at java.util.concurrent.ScheduledThreadPoolExecutor$ScheduledFutureTask.run(ScheduledThreadPoolExecutor.java:294)
   [junit4]    > 	at java.util.concurrent.ThreadPoolExecutor.runWorker(ThreadPoolExecutor.java:1149)
   [junit4]    > 	at java.util.concurrent.ThreadPoolExecutor$Worker.run(ThreadPoolExecutor.java:624)
   [junit4]    > 	at java.lang.Thread.run(Thread.java:748)
   [junit4]    > org.apache.solr.common.util.ObjectReleaseTracker$ObjectTrackerException: org.apache.http.impl.client.InternalHttpClient
   [junit4]    > 	at org.apache.solr.common.util.ObjectReleaseTracker.track(ObjectReleaseTracker.java:42)
   [junit4]    > 	at org.apache.solr.client.solrj.impl.HttpClientUtil.createClient(HttpClientUtil.java:321)
   [junit4]    > 	at org.apache.solr.client.solrj.impl.HttpClientUtil.createClient(HttpClientUtil.java:330)
   [junit4]    > 	at org.apache.solr.handler.IndexFetcher.createHttpClient(IndexFetcher.java:230)
   [junit4]    > 	at org.apache.solr.handler.IndexFetcher.<init>(IndexFetcher.java:272)
   [junit4]    > 	at org.apache.solr.handler.ReplicationHandler.inform(ReplicationHandler.java:1223)
   [junit4]    > 	at org.apache.solr.core.SolrResourceLoader.inform(SolrResourceLoader.java:696)
   [junit4]    > 	at org.apache.solr.core.SolrCore.<init>(SolrCore.java:1003)
   [junit4]    > 	at org.apache.solr.core.SolrCore.<init>(SolrCore.java:881)
   [junit4]    > 	at org.apache.solr.core.CoreContainer.createFromDescriptor(CoreContainer.java:1251)
   [junit4]    > 	at org.apache.solr.core.CoreContainer.lambda$load$13(CoreContainer.java:765)
   [junit4]    > 	at com.codahale.metrics.InstrumentedExecutorService$InstrumentedCallable.call(InstrumentedExecutorService.java:202)
   [junit4]    > 	at java.util.concurrent.FutureTask.run(FutureTask.java:266)
   [junit4]    > 	at org.apache.solr.common.util.ExecutorUtil$MDCAwareThreadPoolExecutor.lambda$execute$0(ExecutorUtil.java:210)
   [junit4]    > 	at java.util.concurrent.ThreadPoolExecutor.runWorker(ThreadPoolExecutor.java:1149)
   [junit4]    > 	at java.util.concurrent.ThreadPoolExecutor$Worker.run(ThreadPoolExecutor.java:624)
   [junit4]    > 	at java.lang.Thread.run(Thread.java:748)
   [junit4]    > org.apache.solr.common.util.ObjectReleaseTracker$ObjectTrackerException: org.apache.lucene.store.MockDirectoryWrapper
   [junit4]    > 	at org.apache.solr.common.util.ObjectReleaseTracker.track(ObjectReleaseTracker.java:42)
   [junit4]    > 	at org.apache.solr.core.CachingDirectoryFactory.get(CachingDirectoryFactory.java:348)
   [junit4]    > 	at org.apache.solr.core.SolrCore.getNewIndexDir(SolrCore.java:368)
   [junit4]    > 	at org.apache.solr.core.SolrCore.initIndex(SolrCore.java:745)
   [junit4]    > 	at org.apache.solr.core.SolrCore.<init>(SolrCore.java:969)
   [junit4]    > 	at org.apache.solr.core.SolrCore.<init>(SolrCore.java:881)
   [junit4]    > 	at org.apache.solr.core.CoreContainer.createFromDescriptor(CoreContainer.java:1251)
   [junit4]    > 	at org.apache.solr.core.CoreContainer.lambda$load$13(CoreContainer.java:765)
   [junit4]    > 	at com.codahale.metrics.InstrumentedExecutorService$InstrumentedCallable.call(InstrumentedExecutorService.java:202)
   [junit4]    > 	at java.util.concurrent.FutureTask.run(FutureTask.java:266)
   [junit4]    > 	at org.apache.solr.common.util.ExecutorUtil$MDCAwareThreadPoolExecutor.lambda$execute$0(ExecutorUtil.java:210)
   [junit4]    > 	at java.util.concurrent.ThreadPoolExecutor.runWorker(ThreadPoolExecutor.java:1149)
   [junit4]    > 	at java.util.concurrent.ThreadPoolExecutor$Worker.run(ThreadPoolExecutor.java:624)
   [junit4]    > 	at java.lang.Thread.run(Thread.java:748)
   [junit4]    > org.apache.solr.common.util.ObjectReleaseTracker$ObjectTrackerException: org.apache.solr.core.SolrCore
   [junit4]    > 	at org.apache.solr.common.util.ObjectReleaseTracker.track(ObjectReleaseTracker.java:42)
   [junit4]    > 	at org.apache.solr.core.SolrCore.<init>(SolrCore.java:1058)
   [junit4]    > 	at org.apache.solr.core.SolrCore.<init>(SolrCore.java:881)
   [junit4]    > 	at org.apache.solr.core.CoreContainer.createFromDescriptor(CoreContainer.java:1251)
   [junit4]    > 	at org.apache.solr.core.CoreContainer.lambda$load$13(CoreContainer.java:765)
   [junit4]    > 	at com.codahale.metrics.InstrumentedExecutorService$InstrumentedCallable.call(InstrumentedExecutorService.java:202)
   [junit4]    > 	at java.util.concurrent.FutureTask.run(FutureTask.java:266)
   [junit4]    > 	at org.apache.solr.common.util.ExecutorUtil$MDCAwareThreadPoolExecutor.lambda$execute$0(ExecutorUtil.java:210)
   [junit4]    > 	at java.util.concurrent.ThreadPoolExecutor.runWorker(ThreadPoolExecutor.java:1149)
   [junit4]    > 	at java.util.concurrent.ThreadPoolExecutor$Worker.run(ThreadPoolExecutor.java:624)
   [junit4]    > 	at java.lang.Thread.run(Thread.java:748)
   [junit4]    > org.apache.solr.common.util.ObjectReleaseTracker$ObjectTrackerException: org.apache.lucene.store.MockDirectoryWrapper
   [junit4]    > 	at org.apache.solr.common.util.ObjectReleaseTracker.track(ObjectReleaseTracker.java:42)
   [junit4]    > 	at org.apache.solr.core.CachingDirectoryFactory.get(CachingDirectoryFactory.java:348)
   [junit4]    > 	at org.apache.solr.core.SolrCore.initSnapshotMetaDataManager(SolrCore.java:516)
   [junit4]    > 	at org.apache.solr.core.SolrCore.<init>(SolrCore.java:961)
   [junit4]    > 	at org.apache.solr.core.SolrCore.<init>(SolrCore.java:881)
   [junit4]    > 	at org.apache.solr.core.CoreContainer.createFromDescriptor(CoreContainer.java:1251)
   [junit4]    > 	at org.apache.solr.core.CoreContainer.lambda$load$13(CoreContainer.java:765)
   [junit4]    > 	at com.codahale.metrics.InstrumentedExecutorService$InstrumentedCallable.call(InstrumentedExecutorService.java:202)
   [junit4]    > 	at java.util.concurrent.FutureTask.run(FutureTask.java:266)
   [junit4]    > 	at org.apache.solr.common.util.ExecutorUtil$MDCAwareThreadPoolExecutor.lambda$execute$0(ExecutorUtil.java:210)
   [junit4]    > 	at java.util.concurrent.ThreadPoolExecutor.runWorker(ThreadPoolExecutor.java:1149)
   [junit4]    > 	at java.util.concurrent.ThreadPoolExecutor$Worker.run(ThreadPoolExecutor.java:624)
   [junit4]    > 	at java.lang.Thread.run(Thread.java:748)
   [junit4]    > org.apache.solr.common.util.ObjectReleaseTracker$ObjectTrackerException: org.apache.lucene.store.MockDirectoryWrapper
   [junit4]    > 	at org.apache.solr.common.util.ObjectReleaseTracker.track(ObjectReleaseTracker.java:42)
   [junit4]    > 	at org.apache.solr.core.CachingDirectoryFactory.get(CachingDirectoryFactory.java:348)
   [junit4]    > 	at org.apache.solr.update.SolrIndexWriter.create(SolrIndexWriter.java:98)
   [junit4]    > 	at org.apache.solr.core.SolrCore.initIndex(SolrCore.java:777)
   [junit4]    > 	at org.apache.solr.core.SolrCore.<init>(SolrCore.java:969)
   [junit4]    > 	at org.apache.solr.core.SolrCore.<init>(SolrCore.java:881)
   [junit4]    > 	at org.apache.solr.core.CoreContainer.createFromDescriptor(CoreContainer.java:1251)
   [junit4]    > 	at org.apache.solr.core.CoreContainer.lambda$load$13(CoreContainer.java:765)
   [junit4]    > 	at com.codahale.metrics.InstrumentedExecutorService$InstrumentedCallable.call(InstrumentedExecutorService.java:202)
   [junit4]    > 	at java.util.concurrent.FutureTask.run(FutureTask.java:266)
   [junit4]    > 	at org.apache.solr.common.util.ExecutorUtil$MDCAwareThreadPoolExecutor.lambda$execute$0(ExecutorUtil.java:210)
   [junit4]    > 	at java.util.concurrent.ThreadPoolExecutor.runWorker(ThreadPoolExecutor.java:1149)
   [junit4]    > 	at java.util.concurrent.ThreadPoolExecutor$Worker.run(ThreadPoolExecutor.java:624)
   [junit4]    > 	at java.lang.Thread.run(Thread.java:748)
   [junit4]    > >
   [junit4]    > 	at __randomizedtesting.SeedInfo.seed([12CE71474BA64A5E]:0)
   [junit4]    > 	at org.apache.solr.SolrTestCaseJ4.teardownTestCases(SolrTestCaseJ4.java:342)
   [junit4]    > 	at java.lang.Thread.run(Thread.java:748)
   [junit4] Completed [625/881 (1!)] on J1 in 238.29s, 20 tests, 1 failure <<< FAILURES!

[...truncated 53580 lines...]

Mime
View raw message