lucene-builds mailing list archives

Site index · List index
Message view « Date » · « Thread »
Top « Date » · « Thread »
From Apache Jenkins Server <jenk...@builds.apache.org>
Subject [JENKINS] Lucene-Solr-Tests-8.x - Build # 784 - Unstable
Date Tue, 03 Dec 2019 06:11:10 GMT
Build: https://builds.apache.org/job/Lucene-Solr-Tests-8.x/784/

42 tests failed.
FAILED:  junit.framework.TestSuite.org.apache.solr.analytics.ExpressionFactoryTest

Error Message:
Clean up static fields (in @AfterClass?) and null them, your test still has references to classes of which the sizes cannot be measured due to security restrictions or Java 9 module encapsulation:   - private static org.apache.solr.schema.IndexSchema org.apache.solr.analytics.ExpressionFactoryTest.indexSchema

Stack Trace:
junit.framework.AssertionFailedError: Clean up static fields (in @AfterClass?) and null them, your test still has references to classes of which the sizes cannot be measured due to security restrictions or Java 9 module encapsulation:
  - private static org.apache.solr.schema.IndexSchema org.apache.solr.analytics.ExpressionFactoryTest.indexSchema
	at __randomizedtesting.SeedInfo.seed([9A10D700C18FA1E5]:0)
	at com.carrotsearch.randomizedtesting.rules.StaticFieldsInvariantRule$1.afterAlways(StaticFieldsInvariantRule.java:146)
	at com.carrotsearch.randomizedtesting.rules.StatementAdapter.evaluate(StatementAdapter.java:43)
	at com.carrotsearch.randomizedtesting.rules.StatementAdapter.evaluate(StatementAdapter.java:36)
	at com.carrotsearch.randomizedtesting.rules.StatementAdapter.evaluate(StatementAdapter.java:36)
	at org.apache.lucene.util.TestRuleAssertionsRequired$1.evaluate(TestRuleAssertionsRequired.java:53)
	at org.apache.lucene.util.TestRuleMarkFailure$1.evaluate(TestRuleMarkFailure.java:47)
	at org.apache.lucene.util.TestRuleIgnoreAfterMaxFailures$1.evaluate(TestRuleIgnoreAfterMaxFailures.java:64)
	at org.apache.lucene.util.TestRuleIgnoreTestSuites$1.evaluate(TestRuleIgnoreTestSuites.java:54)
	at com.carrotsearch.randomizedtesting.rules.StatementAdapter.evaluate(StatementAdapter.java:36)
	at com.carrotsearch.randomizedtesting.ThreadLeakControl$StatementRunner.run(ThreadLeakControl.java:368)
	at java.lang.Thread.run(Thread.java:748)
Caused by: java.security.AccessControlException: access denied ("java.lang.RuntimePermission" "accessClassInPackage.sun.nio.fs")
	at java.security.AccessControlContext.checkPermission(AccessControlContext.java:472)
	at java.security.AccessController.checkPermission(AccessController.java:884)
	at java.lang.SecurityManager.checkPermission(SecurityManager.java:549)
	at java.lang.SecurityManager.checkPackageAccess(SecurityManager.java:1564)
	at java.lang.Class.checkPackageAccess(Class.java:2372)
	at java.lang.Class.checkMemberAccess(Class.java:2351)
	at java.lang.Class.getDeclaredFields(Class.java:1915)
	at com.carrotsearch.randomizedtesting.rules.RamUsageEstimator$2.run(RamUsageEstimator.java:585)
	at com.carrotsearch.randomizedtesting.rules.RamUsageEstimator$2.run(RamUsageEstimator.java:582)
	at java.security.AccessController.doPrivileged(Native Method)
	at com.carrotsearch.randomizedtesting.rules.RamUsageEstimator.createCacheEntry(RamUsageEstimator.java:582)
	at com.carrotsearch.randomizedtesting.rules.RamUsageEstimator.measureSizeOf(RamUsageEstimator.java:545)
	at com.carrotsearch.randomizedtesting.rules.RamUsageEstimator.sizeOfAll(RamUsageEstimator.java:387)
	at com.carrotsearch.randomizedtesting.rules.StaticFieldsInvariantRule$1.afterAlways(StaticFieldsInvariantRule.java:129)
	... 10 more


FAILED:  junit.framework.TestSuite.org.apache.solr.analytics.function.field.BooleanFieldsTest

Error Message:
Clean up static fields (in @AfterClass?) and null them, your test still has references to classes of which the sizes cannot be measured due to security restrictions or Java 9 module encapsulation:   - private static org.apache.solr.schema.IndexSchema org.apache.solr.analytics.function.field.AbstractAnalyticsFieldTest.indexSchema   - private static org.apache.solr.search.SolrIndexSearcher org.apache.solr.analytics.function.field.AbstractAnalyticsFieldTest.searcher

Stack Trace:
junit.framework.AssertionFailedError: Clean up static fields (in @AfterClass?) and null them, your test still has references to classes of which the sizes cannot be measured due to security restrictions or Java 9 module encapsulation:
  - private static org.apache.solr.schema.IndexSchema org.apache.solr.analytics.function.field.AbstractAnalyticsFieldTest.indexSchema
  - private static org.apache.solr.search.SolrIndexSearcher org.apache.solr.analytics.function.field.AbstractAnalyticsFieldTest.searcher
	at __randomizedtesting.SeedInfo.seed([9A10D700C18FA1E5]:0)
	at com.carrotsearch.randomizedtesting.rules.StaticFieldsInvariantRule$1.afterAlways(StaticFieldsInvariantRule.java:146)
	at com.carrotsearch.randomizedtesting.rules.StatementAdapter.evaluate(StatementAdapter.java:43)
	at com.carrotsearch.randomizedtesting.rules.StatementAdapter.evaluate(StatementAdapter.java:36)
	at com.carrotsearch.randomizedtesting.rules.StatementAdapter.evaluate(StatementAdapter.java:36)
	at org.apache.lucene.util.TestRuleAssertionsRequired$1.evaluate(TestRuleAssertionsRequired.java:53)
	at org.apache.lucene.util.TestRuleMarkFailure$1.evaluate(TestRuleMarkFailure.java:47)
	at org.apache.lucene.util.TestRuleIgnoreAfterMaxFailures$1.evaluate(TestRuleIgnoreAfterMaxFailures.java:64)
	at org.apache.lucene.util.TestRuleIgnoreTestSuites$1.evaluate(TestRuleIgnoreTestSuites.java:54)
	at com.carrotsearch.randomizedtesting.rules.StatementAdapter.evaluate(StatementAdapter.java:36)
	at com.carrotsearch.randomizedtesting.ThreadLeakControl$StatementRunner.run(ThreadLeakControl.java:368)
	at java.lang.Thread.run(Thread.java:748)
Caused by: java.security.AccessControlException: access denied ("java.lang.RuntimePermission" "accessClassInPackage.sun.nio.fs")
	at java.security.AccessControlContext.checkPermission(AccessControlContext.java:472)
	at java.security.AccessController.checkPermission(AccessController.java:884)
	at java.lang.SecurityManager.checkPermission(SecurityManager.java:549)
	at java.lang.SecurityManager.checkPackageAccess(SecurityManager.java:1564)
	at java.lang.Class.checkPackageAccess(Class.java:2372)
	at java.lang.Class.checkMemberAccess(Class.java:2351)
	at java.lang.Class.getDeclaredFields(Class.java:1915)
	at com.carrotsearch.randomizedtesting.rules.RamUsageEstimator$2.run(RamUsageEstimator.java:585)
	at com.carrotsearch.randomizedtesting.rules.RamUsageEstimator$2.run(RamUsageEstimator.java:582)
	at java.security.AccessController.doPrivileged(Native Method)
	at com.carrotsearch.randomizedtesting.rules.RamUsageEstimator.createCacheEntry(RamUsageEstimator.java:582)
	at com.carrotsearch.randomizedtesting.rules.RamUsageEstimator.measureSizeOf(RamUsageEstimator.java:545)
	at com.carrotsearch.randomizedtesting.rules.RamUsageEstimator.sizeOfAll(RamUsageEstimator.java:387)
	at com.carrotsearch.randomizedtesting.rules.StaticFieldsInvariantRule$1.afterAlways(StaticFieldsInvariantRule.java:129)
	... 10 more


FAILED:  junit.framework.TestSuite.org.apache.solr.analytics.function.field.DateFieldsTest

Error Message:
Clean up static fields (in @AfterClass?) and null them, your test still has references to classes of which the sizes cannot be measured due to security restrictions or Java 9 module encapsulation:   - private static org.apache.solr.schema.IndexSchema org.apache.solr.analytics.function.field.AbstractAnalyticsFieldTest.indexSchema   - private static org.apache.solr.search.SolrIndexSearcher org.apache.solr.analytics.function.field.AbstractAnalyticsFieldTest.searcher

Stack Trace:
junit.framework.AssertionFailedError: Clean up static fields (in @AfterClass?) and null them, your test still has references to classes of which the sizes cannot be measured due to security restrictions or Java 9 module encapsulation:
  - private static org.apache.solr.schema.IndexSchema org.apache.solr.analytics.function.field.AbstractAnalyticsFieldTest.indexSchema
  - private static org.apache.solr.search.SolrIndexSearcher org.apache.solr.analytics.function.field.AbstractAnalyticsFieldTest.searcher
	at __randomizedtesting.SeedInfo.seed([9A10D700C18FA1E5]:0)
	at com.carrotsearch.randomizedtesting.rules.StaticFieldsInvariantRule$1.afterAlways(StaticFieldsInvariantRule.java:146)
	at com.carrotsearch.randomizedtesting.rules.StatementAdapter.evaluate(StatementAdapter.java:43)
	at com.carrotsearch.randomizedtesting.rules.StatementAdapter.evaluate(StatementAdapter.java:36)
	at com.carrotsearch.randomizedtesting.rules.StatementAdapter.evaluate(StatementAdapter.java:36)
	at org.apache.lucene.util.TestRuleAssertionsRequired$1.evaluate(TestRuleAssertionsRequired.java:53)
	at org.apache.lucene.util.TestRuleMarkFailure$1.evaluate(TestRuleMarkFailure.java:47)
	at org.apache.lucene.util.TestRuleIgnoreAfterMaxFailures$1.evaluate(TestRuleIgnoreAfterMaxFailures.java:64)
	at org.apache.lucene.util.TestRuleIgnoreTestSuites$1.evaluate(TestRuleIgnoreTestSuites.java:54)
	at com.carrotsearch.randomizedtesting.rules.StatementAdapter.evaluate(StatementAdapter.java:36)
	at com.carrotsearch.randomizedtesting.ThreadLeakControl$StatementRunner.run(ThreadLeakControl.java:368)
	at java.lang.Thread.run(Thread.java:748)
Caused by: java.security.AccessControlException: access denied ("java.lang.RuntimePermission" "accessClassInPackage.sun.nio.fs")
	at java.security.AccessControlContext.checkPermission(AccessControlContext.java:472)
	at java.security.AccessController.checkPermission(AccessController.java:884)
	at java.lang.SecurityManager.checkPermission(SecurityManager.java:549)
	at java.lang.SecurityManager.checkPackageAccess(SecurityManager.java:1564)
	at java.lang.Class.checkPackageAccess(Class.java:2372)
	at java.lang.Class.checkMemberAccess(Class.java:2351)
	at java.lang.Class.getDeclaredFields(Class.java:1915)
	at com.carrotsearch.randomizedtesting.rules.RamUsageEstimator$2.run(RamUsageEstimator.java:585)
	at com.carrotsearch.randomizedtesting.rules.RamUsageEstimator$2.run(RamUsageEstimator.java:582)
	at java.security.AccessController.doPrivileged(Native Method)
	at com.carrotsearch.randomizedtesting.rules.RamUsageEstimator.createCacheEntry(RamUsageEstimator.java:582)
	at com.carrotsearch.randomizedtesting.rules.RamUsageEstimator.measureSizeOf(RamUsageEstimator.java:545)
	at com.carrotsearch.randomizedtesting.rules.RamUsageEstimator.sizeOfAll(RamUsageEstimator.java:387)
	at com.carrotsearch.randomizedtesting.rules.StaticFieldsInvariantRule$1.afterAlways(StaticFieldsInvariantRule.java:129)
	... 10 more


FAILED:  junit.framework.TestSuite.org.apache.solr.analytics.function.field.DoubleFieldsTest

Error Message:
Clean up static fields (in @AfterClass?) and null them, your test still has references to classes of which the sizes cannot be measured due to security restrictions or Java 9 module encapsulation:   - private static org.apache.solr.schema.IndexSchema org.apache.solr.analytics.function.field.AbstractAnalyticsFieldTest.indexSchema   - private static org.apache.solr.search.SolrIndexSearcher org.apache.solr.analytics.function.field.AbstractAnalyticsFieldTest.searcher

Stack Trace:
junit.framework.AssertionFailedError: Clean up static fields (in @AfterClass?) and null them, your test still has references to classes of which the sizes cannot be measured due to security restrictions or Java 9 module encapsulation:
  - private static org.apache.solr.schema.IndexSchema org.apache.solr.analytics.function.field.AbstractAnalyticsFieldTest.indexSchema
  - private static org.apache.solr.search.SolrIndexSearcher org.apache.solr.analytics.function.field.AbstractAnalyticsFieldTest.searcher
	at __randomizedtesting.SeedInfo.seed([9A10D700C18FA1E5]:0)
	at com.carrotsearch.randomizedtesting.rules.StaticFieldsInvariantRule$1.afterAlways(StaticFieldsInvariantRule.java:146)
	at com.carrotsearch.randomizedtesting.rules.StatementAdapter.evaluate(StatementAdapter.java:43)
	at com.carrotsearch.randomizedtesting.rules.StatementAdapter.evaluate(StatementAdapter.java:36)
	at com.carrotsearch.randomizedtesting.rules.StatementAdapter.evaluate(StatementAdapter.java:36)
	at org.apache.lucene.util.TestRuleAssertionsRequired$1.evaluate(TestRuleAssertionsRequired.java:53)
	at org.apache.lucene.util.TestRuleMarkFailure$1.evaluate(TestRuleMarkFailure.java:47)
	at org.apache.lucene.util.TestRuleIgnoreAfterMaxFailures$1.evaluate(TestRuleIgnoreAfterMaxFailures.java:64)
	at org.apache.lucene.util.TestRuleIgnoreTestSuites$1.evaluate(TestRuleIgnoreTestSuites.java:54)
	at com.carrotsearch.randomizedtesting.rules.StatementAdapter.evaluate(StatementAdapter.java:36)
	at com.carrotsearch.randomizedtesting.ThreadLeakControl$StatementRunner.run(ThreadLeakControl.java:368)
	at java.lang.Thread.run(Thread.java:748)
Caused by: java.security.AccessControlException: access denied ("java.lang.RuntimePermission" "accessClassInPackage.sun.nio.fs")
	at java.security.AccessControlContext.checkPermission(AccessControlContext.java:472)
	at java.security.AccessController.checkPermission(AccessController.java:884)
	at java.lang.SecurityManager.checkPermission(SecurityManager.java:549)
	at java.lang.SecurityManager.checkPackageAccess(SecurityManager.java:1564)
	at java.lang.Class.checkPackageAccess(Class.java:2372)
	at java.lang.Class.checkMemberAccess(Class.java:2351)
	at java.lang.Class.getDeclaredFields(Class.java:1915)
	at com.carrotsearch.randomizedtesting.rules.RamUsageEstimator$2.run(RamUsageEstimator.java:585)
	at com.carrotsearch.randomizedtesting.rules.RamUsageEstimator$2.run(RamUsageEstimator.java:582)
	at java.security.AccessController.doPrivileged(Native Method)
	at com.carrotsearch.randomizedtesting.rules.RamUsageEstimator.createCacheEntry(RamUsageEstimator.java:582)
	at com.carrotsearch.randomizedtesting.rules.RamUsageEstimator.measureSizeOf(RamUsageEstimator.java:545)
	at com.carrotsearch.randomizedtesting.rules.RamUsageEstimator.sizeOfAll(RamUsageEstimator.java:387)
	at com.carrotsearch.randomizedtesting.rules.StaticFieldsInvariantRule$1.afterAlways(StaticFieldsInvariantRule.java:129)
	... 10 more


FAILED:  junit.framework.TestSuite.org.apache.solr.analytics.function.field.FloatFieldsTest

Error Message:
Clean up static fields (in @AfterClass?) and null them, your test still has references to classes of which the sizes cannot be measured due to security restrictions or Java 9 module encapsulation:   - private static org.apache.solr.schema.IndexSchema org.apache.solr.analytics.function.field.AbstractAnalyticsFieldTest.indexSchema   - private static org.apache.solr.search.SolrIndexSearcher org.apache.solr.analytics.function.field.AbstractAnalyticsFieldTest.searcher

Stack Trace:
junit.framework.AssertionFailedError: Clean up static fields (in @AfterClass?) and null them, your test still has references to classes of which the sizes cannot be measured due to security restrictions or Java 9 module encapsulation:
  - private static org.apache.solr.schema.IndexSchema org.apache.solr.analytics.function.field.AbstractAnalyticsFieldTest.indexSchema
  - private static org.apache.solr.search.SolrIndexSearcher org.apache.solr.analytics.function.field.AbstractAnalyticsFieldTest.searcher
	at __randomizedtesting.SeedInfo.seed([9A10D700C18FA1E5]:0)
	at com.carrotsearch.randomizedtesting.rules.StaticFieldsInvariantRule$1.afterAlways(StaticFieldsInvariantRule.java:146)
	at com.carrotsearch.randomizedtesting.rules.StatementAdapter.evaluate(StatementAdapter.java:43)
	at com.carrotsearch.randomizedtesting.rules.StatementAdapter.evaluate(StatementAdapter.java:36)
	at com.carrotsearch.randomizedtesting.rules.StatementAdapter.evaluate(StatementAdapter.java:36)
	at org.apache.lucene.util.TestRuleAssertionsRequired$1.evaluate(TestRuleAssertionsRequired.java:53)
	at org.apache.lucene.util.TestRuleMarkFailure$1.evaluate(TestRuleMarkFailure.java:47)
	at org.apache.lucene.util.TestRuleIgnoreAfterMaxFailures$1.evaluate(TestRuleIgnoreAfterMaxFailures.java:64)
	at org.apache.lucene.util.TestRuleIgnoreTestSuites$1.evaluate(TestRuleIgnoreTestSuites.java:54)
	at com.carrotsearch.randomizedtesting.rules.StatementAdapter.evaluate(StatementAdapter.java:36)
	at com.carrotsearch.randomizedtesting.ThreadLeakControl$StatementRunner.run(ThreadLeakControl.java:368)
	at java.lang.Thread.run(Thread.java:748)
Caused by: java.security.AccessControlException: access denied ("java.lang.RuntimePermission" "accessClassInPackage.sun.nio.fs")
	at java.security.AccessControlContext.checkPermission(AccessControlContext.java:472)
	at java.security.AccessController.checkPermission(AccessController.java:884)
	at java.lang.SecurityManager.checkPermission(SecurityManager.java:549)
	at java.lang.SecurityManager.checkPackageAccess(SecurityManager.java:1564)
	at java.lang.Class.checkPackageAccess(Class.java:2372)
	at java.lang.Class.checkMemberAccess(Class.java:2351)
	at java.lang.Class.getDeclaredFields(Class.java:1915)
	at com.carrotsearch.randomizedtesting.rules.RamUsageEstimator$2.run(RamUsageEstimator.java:585)
	at com.carrotsearch.randomizedtesting.rules.RamUsageEstimator$2.run(RamUsageEstimator.java:582)
	at java.security.AccessController.doPrivileged(Native Method)
	at com.carrotsearch.randomizedtesting.rules.RamUsageEstimator.createCacheEntry(RamUsageEstimator.java:582)
	at com.carrotsearch.randomizedtesting.rules.RamUsageEstimator.measureSizeOf(RamUsageEstimator.java:545)
	at com.carrotsearch.randomizedtesting.rules.RamUsageEstimator.sizeOfAll(RamUsageEstimator.java:387)
	at com.carrotsearch.randomizedtesting.rules.StaticFieldsInvariantRule$1.afterAlways(StaticFieldsInvariantRule.java:129)
	... 10 more


FAILED:  junit.framework.TestSuite.org.apache.solr.analytics.function.field.IntFieldsTest

Error Message:
Clean up static fields (in @AfterClass?) and null them, your test still has references to classes of which the sizes cannot be measured due to security restrictions or Java 9 module encapsulation:   - private static org.apache.solr.schema.IndexSchema org.apache.solr.analytics.function.field.AbstractAnalyticsFieldTest.indexSchema   - private static org.apache.solr.search.SolrIndexSearcher org.apache.solr.analytics.function.field.AbstractAnalyticsFieldTest.searcher

Stack Trace:
junit.framework.AssertionFailedError: Clean up static fields (in @AfterClass?) and null them, your test still has references to classes of which the sizes cannot be measured due to security restrictions or Java 9 module encapsulation:
  - private static org.apache.solr.schema.IndexSchema org.apache.solr.analytics.function.field.AbstractAnalyticsFieldTest.indexSchema
  - private static org.apache.solr.search.SolrIndexSearcher org.apache.solr.analytics.function.field.AbstractAnalyticsFieldTest.searcher
	at __randomizedtesting.SeedInfo.seed([9A10D700C18FA1E5]:0)
	at com.carrotsearch.randomizedtesting.rules.StaticFieldsInvariantRule$1.afterAlways(StaticFieldsInvariantRule.java:146)
	at com.carrotsearch.randomizedtesting.rules.StatementAdapter.evaluate(StatementAdapter.java:43)
	at com.carrotsearch.randomizedtesting.rules.StatementAdapter.evaluate(StatementAdapter.java:36)
	at com.carrotsearch.randomizedtesting.rules.StatementAdapter.evaluate(StatementAdapter.java:36)
	at org.apache.lucene.util.TestRuleAssertionsRequired$1.evaluate(TestRuleAssertionsRequired.java:53)
	at org.apache.lucene.util.TestRuleMarkFailure$1.evaluate(TestRuleMarkFailure.java:47)
	at org.apache.lucene.util.TestRuleIgnoreAfterMaxFailures$1.evaluate(TestRuleIgnoreAfterMaxFailures.java:64)
	at org.apache.lucene.util.TestRuleIgnoreTestSuites$1.evaluate(TestRuleIgnoreTestSuites.java:54)
	at com.carrotsearch.randomizedtesting.rules.StatementAdapter.evaluate(StatementAdapter.java:36)
	at com.carrotsearch.randomizedtesting.ThreadLeakControl$StatementRunner.run(ThreadLeakControl.java:368)
	at java.lang.Thread.run(Thread.java:748)
Caused by: java.security.AccessControlException: access denied ("java.lang.RuntimePermission" "accessClassInPackage.sun.nio.fs")
	at java.security.AccessControlContext.checkPermission(AccessControlContext.java:472)
	at java.security.AccessController.checkPermission(AccessController.java:884)
	at java.lang.SecurityManager.checkPermission(SecurityManager.java:549)
	at java.lang.SecurityManager.checkPackageAccess(SecurityManager.java:1564)
	at java.lang.Class.checkPackageAccess(Class.java:2372)
	at java.lang.Class.checkMemberAccess(Class.java:2351)
	at java.lang.Class.getDeclaredFields(Class.java:1915)
	at com.carrotsearch.randomizedtesting.rules.RamUsageEstimator$2.run(RamUsageEstimator.java:585)
	at com.carrotsearch.randomizedtesting.rules.RamUsageEstimator$2.run(RamUsageEstimator.java:582)
	at java.security.AccessController.doPrivileged(Native Method)
	at com.carrotsearch.randomizedtesting.rules.RamUsageEstimator.createCacheEntry(RamUsageEstimator.java:582)
	at com.carrotsearch.randomizedtesting.rules.RamUsageEstimator.measureSizeOf(RamUsageEstimator.java:545)
	at com.carrotsearch.randomizedtesting.rules.RamUsageEstimator.sizeOfAll(RamUsageEstimator.java:387)
	at com.carrotsearch.randomizedtesting.rules.StaticFieldsInvariantRule$1.afterAlways(StaticFieldsInvariantRule.java:129)
	... 10 more


FAILED:  junit.framework.TestSuite.org.apache.solr.analytics.function.field.LongFieldsTest

Error Message:
Clean up static fields (in @AfterClass?) and null them, your test still has references to classes of which the sizes cannot be measured due to security restrictions or Java 9 module encapsulation:   - private static org.apache.solr.schema.IndexSchema org.apache.solr.analytics.function.field.AbstractAnalyticsFieldTest.indexSchema   - private static org.apache.solr.search.SolrIndexSearcher org.apache.solr.analytics.function.field.AbstractAnalyticsFieldTest.searcher

Stack Trace:
junit.framework.AssertionFailedError: Clean up static fields (in @AfterClass?) and null them, your test still has references to classes of which the sizes cannot be measured due to security restrictions or Java 9 module encapsulation:
  - private static org.apache.solr.schema.IndexSchema org.apache.solr.analytics.function.field.AbstractAnalyticsFieldTest.indexSchema
  - private static org.apache.solr.search.SolrIndexSearcher org.apache.solr.analytics.function.field.AbstractAnalyticsFieldTest.searcher
	at __randomizedtesting.SeedInfo.seed([9A10D700C18FA1E5]:0)
	at com.carrotsearch.randomizedtesting.rules.StaticFieldsInvariantRule$1.afterAlways(StaticFieldsInvariantRule.java:146)
	at com.carrotsearch.randomizedtesting.rules.StatementAdapter.evaluate(StatementAdapter.java:43)
	at com.carrotsearch.randomizedtesting.rules.StatementAdapter.evaluate(StatementAdapter.java:36)
	at com.carrotsearch.randomizedtesting.rules.StatementAdapter.evaluate(StatementAdapter.java:36)
	at org.apache.lucene.util.TestRuleAssertionsRequired$1.evaluate(TestRuleAssertionsRequired.java:53)
	at org.apache.lucene.util.TestRuleMarkFailure$1.evaluate(TestRuleMarkFailure.java:47)
	at org.apache.lucene.util.TestRuleIgnoreAfterMaxFailures$1.evaluate(TestRuleIgnoreAfterMaxFailures.java:64)
	at org.apache.lucene.util.TestRuleIgnoreTestSuites$1.evaluate(TestRuleIgnoreTestSuites.java:54)
	at com.carrotsearch.randomizedtesting.rules.StatementAdapter.evaluate(StatementAdapter.java:36)
	at com.carrotsearch.randomizedtesting.ThreadLeakControl$StatementRunner.run(ThreadLeakControl.java:368)
	at java.lang.Thread.run(Thread.java:748)
Caused by: java.security.AccessControlException: access denied ("java.lang.RuntimePermission" "accessClassInPackage.sun.nio.fs")
	at java.security.AccessControlContext.checkPermission(AccessControlContext.java:472)
	at java.security.AccessController.checkPermission(AccessController.java:884)
	at java.lang.SecurityManager.checkPermission(SecurityManager.java:549)
	at java.lang.SecurityManager.checkPackageAccess(SecurityManager.java:1564)
	at java.lang.Class.checkPackageAccess(Class.java:2372)
	at java.lang.Class.checkMemberAccess(Class.java:2351)
	at java.lang.Class.getDeclaredFields(Class.java:1915)
	at com.carrotsearch.randomizedtesting.rules.RamUsageEstimator$2.run(RamUsageEstimator.java:585)
	at com.carrotsearch.randomizedtesting.rules.RamUsageEstimator$2.run(RamUsageEstimator.java:582)
	at java.security.AccessController.doPrivileged(Native Method)
	at com.carrotsearch.randomizedtesting.rules.RamUsageEstimator.createCacheEntry(RamUsageEstimator.java:582)
	at com.carrotsearch.randomizedtesting.rules.RamUsageEstimator.measureSizeOf(RamUsageEstimator.java:545)
	at com.carrotsearch.randomizedtesting.rules.RamUsageEstimator.sizeOfAll(RamUsageEstimator.java:387)
	at com.carrotsearch.randomizedtesting.rules.StaticFieldsInvariantRule$1.afterAlways(StaticFieldsInvariantRule.java:129)
	... 10 more


FAILED:  junit.framework.TestSuite.org.apache.solr.analytics.function.field.StringFieldsTest

Error Message:
Clean up static fields (in @AfterClass?) and null them, your test still has references to classes of which the sizes cannot be measured due to security restrictions or Java 9 module encapsulation:   - private static org.apache.solr.schema.IndexSchema org.apache.solr.analytics.function.field.AbstractAnalyticsFieldTest.indexSchema   - private static org.apache.solr.search.SolrIndexSearcher org.apache.solr.analytics.function.field.AbstractAnalyticsFieldTest.searcher

Stack Trace:
junit.framework.AssertionFailedError: Clean up static fields (in @AfterClass?) and null them, your test still has references to classes of which the sizes cannot be measured due to security restrictions or Java 9 module encapsulation:
  - private static org.apache.solr.schema.IndexSchema org.apache.solr.analytics.function.field.AbstractAnalyticsFieldTest.indexSchema
  - private static org.apache.solr.search.SolrIndexSearcher org.apache.solr.analytics.function.field.AbstractAnalyticsFieldTest.searcher
	at __randomizedtesting.SeedInfo.seed([9A10D700C18FA1E5]:0)
	at com.carrotsearch.randomizedtesting.rules.StaticFieldsInvariantRule$1.afterAlways(StaticFieldsInvariantRule.java:146)
	at com.carrotsearch.randomizedtesting.rules.StatementAdapter.evaluate(StatementAdapter.java:43)
	at com.carrotsearch.randomizedtesting.rules.StatementAdapter.evaluate(StatementAdapter.java:36)
	at com.carrotsearch.randomizedtesting.rules.StatementAdapter.evaluate(StatementAdapter.java:36)
	at org.apache.lucene.util.TestRuleAssertionsRequired$1.evaluate(TestRuleAssertionsRequired.java:53)
	at org.apache.lucene.util.TestRuleMarkFailure$1.evaluate(TestRuleMarkFailure.java:47)
	at org.apache.lucene.util.TestRuleIgnoreAfterMaxFailures$1.evaluate(TestRuleIgnoreAfterMaxFailures.java:64)
	at org.apache.lucene.util.TestRuleIgnoreTestSuites$1.evaluate(TestRuleIgnoreTestSuites.java:54)
	at com.carrotsearch.randomizedtesting.rules.StatementAdapter.evaluate(StatementAdapter.java:36)
	at com.carrotsearch.randomizedtesting.ThreadLeakControl$StatementRunner.run(ThreadLeakControl.java:368)
	at java.lang.Thread.run(Thread.java:748)
Caused by: java.security.AccessControlException: access denied ("java.lang.RuntimePermission" "accessClassInPackage.sun.nio.fs")
	at java.security.AccessControlContext.checkPermission(AccessControlContext.java:472)
	at java.security.AccessController.checkPermission(AccessController.java:884)
	at java.lang.SecurityManager.checkPermission(SecurityManager.java:549)
	at java.lang.SecurityManager.checkPackageAccess(SecurityManager.java:1564)
	at java.lang.Class.checkPackageAccess(Class.java:2372)
	at java.lang.Class.checkMemberAccess(Class.java:2351)
	at java.lang.Class.getDeclaredFields(Class.java:1915)
	at com.carrotsearch.randomizedtesting.rules.RamUsageEstimator$2.run(RamUsageEstimator.java:585)
	at com.carrotsearch.randomizedtesting.rules.RamUsageEstimator$2.run(RamUsageEstimator.java:582)
	at java.security.AccessController.doPrivileged(Native Method)
	at com.carrotsearch.randomizedtesting.rules.RamUsageEstimator.createCacheEntry(RamUsageEstimator.java:582)
	at com.carrotsearch.randomizedtesting.rules.RamUsageEstimator.measureSizeOf(RamUsageEstimator.java:545)
	at com.carrotsearch.randomizedtesting.rules.RamUsageEstimator.sizeOfAll(RamUsageEstimator.java:387)
	at com.carrotsearch.randomizedtesting.rules.StaticFieldsInvariantRule$1.afterAlways(StaticFieldsInvariantRule.java:129)
	... 10 more


FAILED:  junit.framework.TestSuite.org.apache.solr.prometheus.scraper.SolrStandaloneScraperTest

Error Message:
Clean up static fields (in @AfterClass?) and null them, your test still has references to classes of which the sizes cannot be measured due to security restrictions or Java 9 module encapsulation:   - private static org.apache.solr.prometheus.scraper.SolrStandaloneScraper org.apache.solr.prometheus.scraper.SolrStandaloneScraperTest.solrScraper   - private static org.apache.solr.client.solrj.impl.HttpSolrClient org.apache.solr.prometheus.scraper.SolrStandaloneScraperTest.solrClient

Stack Trace:
junit.framework.AssertionFailedError: Clean up static fields (in @AfterClass?) and null them, your test still has references to classes of which the sizes cannot be measured due to security restrictions or Java 9 module encapsulation:
  - private static org.apache.solr.prometheus.scraper.SolrStandaloneScraper org.apache.solr.prometheus.scraper.SolrStandaloneScraperTest.solrScraper
  - private static org.apache.solr.client.solrj.impl.HttpSolrClient org.apache.solr.prometheus.scraper.SolrStandaloneScraperTest.solrClient
	at __randomizedtesting.SeedInfo.seed([292121D03A449E0B]:0)
	at com.carrotsearch.randomizedtesting.rules.StaticFieldsInvariantRule$1.afterAlways(StaticFieldsInvariantRule.java:146)
	at com.carrotsearch.randomizedtesting.rules.StatementAdapter.evaluate(StatementAdapter.java:43)
	at com.carrotsearch.randomizedtesting.rules.StatementAdapter.evaluate(StatementAdapter.java:36)
	at com.carrotsearch.randomizedtesting.rules.StatementAdapter.evaluate(StatementAdapter.java:36)
	at org.apache.lucene.util.TestRuleAssertionsRequired$1.evaluate(TestRuleAssertionsRequired.java:53)
	at org.apache.lucene.util.TestRuleMarkFailure$1.evaluate(TestRuleMarkFailure.java:47)
	at org.apache.lucene.util.TestRuleIgnoreAfterMaxFailures$1.evaluate(TestRuleIgnoreAfterMaxFailures.java:64)
	at org.apache.lucene.util.TestRuleIgnoreTestSuites$1.evaluate(TestRuleIgnoreTestSuites.java:54)
	at com.carrotsearch.randomizedtesting.rules.StatementAdapter.evaluate(StatementAdapter.java:36)
	at com.carrotsearch.randomizedtesting.ThreadLeakControl$StatementRunner.run(ThreadLeakControl.java:368)
	at java.lang.Thread.run(Thread.java:748)
Caused by: java.security.AccessControlException: access denied ("java.lang.RuntimePermission" "accessClassInPackage.sun.security.ssl")
	at java.security.AccessControlContext.checkPermission(AccessControlContext.java:472)
	at java.security.AccessController.checkPermission(AccessController.java:884)
	at java.lang.SecurityManager.checkPermission(SecurityManager.java:549)
	at java.lang.SecurityManager.checkPackageAccess(SecurityManager.java:1564)
	at java.lang.Class.checkPackageAccess(Class.java:2372)
	at java.lang.Class.checkMemberAccess(Class.java:2351)
	at java.lang.Class.getDeclaredFields(Class.java:1915)
	at com.carrotsearch.randomizedtesting.rules.RamUsageEstimator$2.run(RamUsageEstimator.java:585)
	at com.carrotsearch.randomizedtesting.rules.RamUsageEstimator$2.run(RamUsageEstimator.java:582)
	at java.security.AccessController.doPrivileged(Native Method)
	at com.carrotsearch.randomizedtesting.rules.RamUsageEstimator.createCacheEntry(RamUsageEstimator.java:582)
	at com.carrotsearch.randomizedtesting.rules.RamUsageEstimator.measureSizeOf(RamUsageEstimator.java:545)
	at com.carrotsearch.randomizedtesting.rules.RamUsageEstimator.sizeOfAll(RamUsageEstimator.java:387)
	at com.carrotsearch.randomizedtesting.rules.StaticFieldsInvariantRule$1.afterAlways(StaticFieldsInvariantRule.java:129)
	... 10 more


FAILED:  junit.framework.TestSuite.org.apache.solr.cloud.OverseerCollectionConfigSetProcessorTest

Error Message:
Clean up static fields (in @AfterClass?) and null them, your test still has references to classes of which the sizes cannot be measured due to security restrictions or Java 9 module encapsulation:   - private static org.apache.solr.client.solrj.cloud.DistribStateManager org.apache.solr.cloud.OverseerCollectionConfigSetProcessorTest.stateManagerMock

Stack Trace:
junit.framework.AssertionFailedError: Clean up static fields (in @AfterClass?) and null them, your test still has references to classes of which the sizes cannot be measured due to security restrictions or Java 9 module encapsulation:
  - private static org.apache.solr.client.solrj.cloud.DistribStateManager org.apache.solr.cloud.OverseerCollectionConfigSetProcessorTest.stateManagerMock
	at __randomizedtesting.SeedInfo.seed([2729AD008107EC2B]:0)
	at com.carrotsearch.randomizedtesting.rules.StaticFieldsInvariantRule$1.afterAlways(StaticFieldsInvariantRule.java:146)
	at com.carrotsearch.randomizedtesting.rules.StatementAdapter.evaluate(StatementAdapter.java:43)
	at com.carrotsearch.randomizedtesting.rules.StatementAdapter.evaluate(StatementAdapter.java:36)
	at com.carrotsearch.randomizedtesting.rules.StatementAdapter.evaluate(StatementAdapter.java:36)
	at org.apache.lucene.util.TestRuleAssertionsRequired$1.evaluate(TestRuleAssertionsRequired.java:53)
	at org.apache.lucene.util.TestRuleMarkFailure$1.evaluate(TestRuleMarkFailure.java:47)
	at org.apache.lucene.util.TestRuleIgnoreAfterMaxFailures$1.evaluate(TestRuleIgnoreAfterMaxFailures.java:64)
	at org.apache.lucene.util.TestRuleIgnoreTestSuites$1.evaluate(TestRuleIgnoreTestSuites.java:54)
	at com.carrotsearch.randomizedtesting.rules.StatementAdapter.evaluate(StatementAdapter.java:36)
	at com.carrotsearch.randomizedtesting.ThreadLeakControl$StatementRunner.run(ThreadLeakControl.java:368)
	at java.lang.Thread.run(Thread.java:748)
Caused by: java.security.AccessControlException: access denied ("java.lang.RuntimePermission" "accessClassInPackage.sun.reflect.generics.repository")
	at java.security.AccessControlContext.checkPermission(AccessControlContext.java:472)
	at java.security.AccessController.checkPermission(AccessController.java:884)
	at java.lang.SecurityManager.checkPermission(SecurityManager.java:549)
	at java.lang.SecurityManager.checkPackageAccess(SecurityManager.java:1564)
	at java.lang.Class.checkPackageAccess(Class.java:2372)
	at java.lang.Class.checkMemberAccess(Class.java:2351)
	at java.lang.Class.getDeclaredFields(Class.java:1915)
	at com.carrotsearch.randomizedtesting.rules.RamUsageEstimator$2.run(RamUsageEstimator.java:585)
	at com.carrotsearch.randomizedtesting.rules.RamUsageEstimator$2.run(RamUsageEstimator.java:582)
	at java.security.AccessController.doPrivileged(Native Method)
	at com.carrotsearch.randomizedtesting.rules.RamUsageEstimator.createCacheEntry(RamUsageEstimator.java:582)
	at com.carrotsearch.randomizedtesting.rules.RamUsageEstimator.measureSizeOf(RamUsageEstimator.java:545)
	at com.carrotsearch.randomizedtesting.rules.RamUsageEstimator.sizeOfAll(RamUsageEstimator.java:387)
	at com.carrotsearch.randomizedtesting.rules.StaticFieldsInvariantRule$1.afterAlways(StaticFieldsInvariantRule.java:129)
	... 10 more


FAILED:  junit.framework.TestSuite.org.apache.solr.cloud.OverseerTest

Error Message:
Clean up static fields (in @AfterClass?) and null them, your test still has references to classes of which the sizes cannot be measured due to security restrictions or Java 9 module encapsulation:   - private static org.apache.solr.cloud.ZkTestServer org.apache.solr.cloud.OverseerTest.server

Stack Trace:
junit.framework.AssertionFailedError: Clean up static fields (in @AfterClass?) and null them, your test still has references to classes of which the sizes cannot be measured due to security restrictions or Java 9 module encapsulation:
  - private static org.apache.solr.cloud.ZkTestServer org.apache.solr.cloud.OverseerTest.server
	at __randomizedtesting.SeedInfo.seed([2729AD008107EC2B]:0)
	at com.carrotsearch.randomizedtesting.rules.StaticFieldsInvariantRule$1.afterAlways(StaticFieldsInvariantRule.java:146)
	at com.carrotsearch.randomizedtesting.rules.StatementAdapter.evaluate(StatementAdapter.java:43)
	at com.carrotsearch.randomizedtesting.rules.StatementAdapter.evaluate(StatementAdapter.java:36)
	at com.carrotsearch.randomizedtesting.rules.StatementAdapter.evaluate(StatementAdapter.java:36)
	at org.apache.lucene.util.TestRuleAssertionsRequired$1.evaluate(TestRuleAssertionsRequired.java:53)
	at org.apache.lucene.util.TestRuleMarkFailure$1.evaluate(TestRuleMarkFailure.java:47)
	at org.apache.lucene.util.TestRuleIgnoreAfterMaxFailures$1.evaluate(TestRuleIgnoreAfterMaxFailures.java:64)
	at org.apache.lucene.util.TestRuleIgnoreTestSuites$1.evaluate(TestRuleIgnoreTestSuites.java:54)
	at com.carrotsearch.randomizedtesting.rules.StatementAdapter.evaluate(StatementAdapter.java:36)
	at com.carrotsearch.randomizedtesting.ThreadLeakControl$StatementRunner.run(ThreadLeakControl.java:368)
	at java.lang.Thread.run(Thread.java:748)
Caused by: java.security.AccessControlException: access denied ("java.lang.RuntimePermission" "accessClassInPackage.sun.nio.fs")
	at java.security.AccessControlContext.checkPermission(AccessControlContext.java:472)
	at java.security.AccessController.checkPermission(AccessController.java:884)
	at java.lang.SecurityManager.checkPermission(SecurityManager.java:549)
	at java.lang.SecurityManager.checkPackageAccess(SecurityManager.java:1564)
	at java.lang.Class.checkPackageAccess(Class.java:2372)
	at java.lang.Class.checkMemberAccess(Class.java:2351)
	at java.lang.Class.getDeclaredFields(Class.java:1915)
	at com.carrotsearch.randomizedtesting.rules.RamUsageEstimator$2.run(RamUsageEstimator.java:585)
	at com.carrotsearch.randomizedtesting.rules.RamUsageEstimator$2.run(RamUsageEstimator.java:582)
	at java.security.AccessController.doPrivileged(Native Method)
	at com.carrotsearch.randomizedtesting.rules.RamUsageEstimator.createCacheEntry(RamUsageEstimator.java:582)
	at com.carrotsearch.randomizedtesting.rules.RamUsageEstimator.measureSizeOf(RamUsageEstimator.java:545)
	at com.carrotsearch.randomizedtesting.rules.RamUsageEstimator.sizeOfAll(RamUsageEstimator.java:387)
	at com.carrotsearch.randomizedtesting.rules.StaticFieldsInvariantRule$1.afterAlways(StaticFieldsInvariantRule.java:129)
	... 10 more


FAILED:  junit.framework.TestSuite.org.apache.solr.cloud.TestWithCollection

Error Message:
Clean up static fields (in @AfterClass?) and null them, your test still has references to classes of which the sizes cannot be measured due to security restrictions or Java 9 module encapsulation:   - private static org.apache.solr.client.solrj.cloud.SolrCloudManager org.apache.solr.cloud.TestWithCollection.cloudManager

Stack Trace:
junit.framework.AssertionFailedError: Clean up static fields (in @AfterClass?) and null them, your test still has references to classes of which the sizes cannot be measured due to security restrictions or Java 9 module encapsulation:
  - private static org.apache.solr.client.solrj.cloud.SolrCloudManager org.apache.solr.cloud.TestWithCollection.cloudManager
	at __randomizedtesting.SeedInfo.seed([2729AD008107EC2B]:0)
	at com.carrotsearch.randomizedtesting.rules.StaticFieldsInvariantRule$1.afterAlways(StaticFieldsInvariantRule.java:146)
	at com.carrotsearch.randomizedtesting.rules.StatementAdapter.evaluate(StatementAdapter.java:43)
	at com.carrotsearch.randomizedtesting.rules.StatementAdapter.evaluate(StatementAdapter.java:36)
	at com.carrotsearch.randomizedtesting.rules.StatementAdapter.evaluate(StatementAdapter.java:36)
	at org.apache.lucene.util.TestRuleAssertionsRequired$1.evaluate(TestRuleAssertionsRequired.java:53)
	at org.apache.lucene.util.TestRuleMarkFailure$1.evaluate(TestRuleMarkFailure.java:47)
	at org.apache.lucene.util.TestRuleIgnoreAfterMaxFailures$1.evaluate(TestRuleIgnoreAfterMaxFailures.java:64)
	at org.apache.lucene.util.TestRuleIgnoreTestSuites$1.evaluate(TestRuleIgnoreTestSuites.java:54)
	at com.carrotsearch.randomizedtesting.rules.StatementAdapter.evaluate(StatementAdapter.java:36)
	at com.carrotsearch.randomizedtesting.ThreadLeakControl$StatementRunner.run(ThreadLeakControl.java:368)
	at java.lang.Thread.run(Thread.java:748)
Caused by: java.security.AccessControlException: access denied ("java.lang.RuntimePermission" "accessClassInPackage.sun.nio.fs")
	at java.security.AccessControlContext.checkPermission(AccessControlContext.java:472)
	at java.security.AccessController.checkPermission(AccessController.java:884)
	at java.lang.SecurityManager.checkPermission(SecurityManager.java:549)
	at java.lang.SecurityManager.checkPackageAccess(SecurityManager.java:1564)
	at java.lang.Class.checkPackageAccess(Class.java:2372)
	at java.lang.Class.checkMemberAccess(Class.java:2351)
	at java.lang.Class.getDeclaredFields(Class.java:1915)
	at com.carrotsearch.randomizedtesting.rules.RamUsageEstimator$2.run(RamUsageEstimator.java:585)
	at com.carrotsearch.randomizedtesting.rules.RamUsageEstimator$2.run(RamUsageEstimator.java:582)
	at java.security.AccessController.doPrivileged(Native Method)
	at com.carrotsearch.randomizedtesting.rules.RamUsageEstimator.createCacheEntry(RamUsageEstimator.java:582)
	at com.carrotsearch.randomizedtesting.rules.RamUsageEstimator.measureSizeOf(RamUsageEstimator.java:545)
	at com.carrotsearch.randomizedtesting.rules.RamUsageEstimator.sizeOfAll(RamUsageEstimator.java:387)
	at com.carrotsearch.randomizedtesting.rules.StaticFieldsInvariantRule$1.afterAlways(StaticFieldsInvariantRule.java:129)
	... 10 more


FAILED:  junit.framework.TestSuite.org.apache.solr.cloud.api.collections.TestHdfsCloudBackupRestore

Error Message:
failure to login: javax.security.auth.login.LoginException: Security Exception

Stack Trace:
org.apache.hadoop.security.KerberosAuthException: failure to login: javax.security.auth.login.LoginException: Security Exception
	at __randomizedtesting.SeedInfo.seed([2729AD008107EC2B]:0)
	at org.apache.hadoop.security.UserGroupInformation.doSubjectLogin(UserGroupInformation.java:1847)
	at org.apache.hadoop.security.UserGroupInformation.createLoginUser(UserGroupInformation.java:710)
	at org.apache.hadoop.security.UserGroupInformation.getLoginUser(UserGroupInformation.java:660)
	at org.apache.hadoop.security.UserGroupInformation.getCurrentUser(UserGroupInformation.java:571)
	at org.apache.hadoop.hdfs.server.namenode.FSNamesystem.<init>(FSNamesystem.java:767)
	at org.apache.hadoop.hdfs.server.namenode.FSNamesystem.<init>(FSNamesystem.java:733)
	at org.apache.hadoop.hdfs.server.namenode.NameNode.format(NameNode.java:1140)
	at org.apache.hadoop.hdfs.server.namenode.NameNode.format(NameNode.java:409)
	at org.apache.hadoop.hdfs.DFSTestUtil.formatNameNode(DFSTestUtil.java:261)
	at org.apache.hadoop.hdfs.MiniDFSCluster.configureNameService(MiniDFSCluster.java:1072)
	at org.apache.hadoop.hdfs.MiniDFSCluster.createNameNodesAndSetConf(MiniDFSCluster.java:958)
	at org.apache.hadoop.hdfs.MiniDFSCluster.initMiniDFSCluster(MiniDFSCluster.java:890)
	at org.apache.hadoop.hdfs.MiniDFSCluster.<init>(MiniDFSCluster.java:518)
	at org.apache.hadoop.hdfs.MiniDFSCluster$Builder.build(MiniDFSCluster.java:477)
	at org.apache.solr.cloud.hdfs.HdfsTestUtil.setupClass(HdfsTestUtil.java:134)
	at org.apache.solr.cloud.hdfs.HdfsTestUtil.setupClass(HdfsTestUtil.java:66)
	at org.apache.solr.cloud.api.collections.TestHdfsCloudBackupRestore.setupClass(TestHdfsCloudBackupRestore.java:110)
	at sun.reflect.NativeMethodAccessorImpl.invoke0(Native Method)
	at sun.reflect.NativeMethodAccessorImpl.invoke(NativeMethodAccessorImpl.java:62)
	at sun.reflect.DelegatingMethodAccessorImpl.invoke(DelegatingMethodAccessorImpl.java:43)
	at java.lang.reflect.Method.invoke(Method.java:498)
	at com.carrotsearch.randomizedtesting.RandomizedRunner.invoke(RandomizedRunner.java:1750)
	at com.carrotsearch.randomizedtesting.RandomizedRunner$6.evaluate(RandomizedRunner.java:878)
	at com.carrotsearch.randomizedtesting.RandomizedRunner$7.evaluate(RandomizedRunner.java:894)
	at com.carrotsearch.randomizedtesting.rules.StatementAdapter.evaluate(StatementAdapter.java:36)
	at com.carrotsearch.randomizedtesting.rules.SystemPropertiesRestoreRule$1.evaluate(SystemPropertiesRestoreRule.java:57)
	at org.apache.lucene.util.AbstractBeforeAfterRule$1.evaluate(AbstractBeforeAfterRule.java:45)
	at com.carrotsearch.randomizedtesting.rules.StatementAdapter.evaluate(StatementAdapter.java:36)
	at org.apache.lucene.util.TestRuleStoreClassName$1.evaluate(TestRuleStoreClassName.java:41)
	at com.carrotsearch.randomizedtesting.rules.NoShadowingOrOverridesOnMethodsRule$1.evaluate(NoShadowingOrOverridesOnMethodsRule.java:40)
	at com.carrotsearch.randomizedtesting.rules.NoShadowingOrOverridesOnMethodsRule$1.evaluate(NoShadowingOrOverridesOnMethodsRule.java:40)
	at com.carrotsearch.randomizedtesting.rules.StatementAdapter.evaluate(StatementAdapter.java:36)
	at com.carrotsearch.randomizedtesting.rules.StatementAdapter.evaluate(StatementAdapter.java:36)
	at com.carrotsearch.randomizedtesting.rules.StatementAdapter.evaluate(StatementAdapter.java:36)
	at org.apache.lucene.util.TestRuleAssertionsRequired$1.evaluate(TestRuleAssertionsRequired.java:53)
	at org.apache.lucene.util.TestRuleMarkFailure$1.evaluate(TestRuleMarkFailure.java:47)
	at org.apache.lucene.util.TestRuleIgnoreAfterMaxFailures$1.evaluate(TestRuleIgnoreAfterMaxFailures.java:64)
	at org.apache.lucene.util.TestRuleIgnoreTestSuites$1.evaluate(TestRuleIgnoreTestSuites.java:54)
	at com.carrotsearch.randomizedtesting.rules.StatementAdapter.evaluate(StatementAdapter.java:36)
	at com.carrotsearch.randomizedtesting.ThreadLeakControl$StatementRunner.run(ThreadLeakControl.java:368)
	at java.lang.Thread.run(Thread.java:748)
Caused by: javax.security.auth.login.LoginException: Security Exception
	at javax.security.auth.login.LoginContext.invoke(LoginContext.java:840)
	at javax.security.auth.login.LoginContext.access$000(LoginContext.java:195)
	at javax.security.auth.login.LoginContext$4.run(LoginContext.java:682)
	at javax.security.auth.login.LoginContext$4.run(LoginContext.java:680)
	at java.security.AccessController.doPrivileged(Native Method)
	at javax.security.auth.login.LoginContext.invokePriv(LoginContext.java:680)
	at javax.security.auth.login.LoginContext.login(LoginContext.java:587)
	at org.apache.hadoop.security.UserGroupInformation$HadoopLoginContext.login(UserGroupInformation.java:1926)
	at org.apache.hadoop.security.UserGroupInformation.doSubjectLogin(UserGroupInformation.java:1837)
	... 40 more
Caused by: java.lang.SecurityException
	at javax.security.auth.login.LoginContext.invoke(LoginContext.java:841)
	... 48 more


FAILED:  junit.framework.TestSuite.org.apache.solr.cloud.autoscaling.ComputePlanActionTest

Error Message:
Clean up static fields (in @AfterClass?) and null them, your test still has references to classes of which the sizes cannot be measured due to security restrictions or Java 9 module encapsulation:   - private static org.apache.solr.client.solrj.cloud.SolrCloudManager org.apache.solr.cloud.autoscaling.ComputePlanActionTest.cloudManager

Stack Trace:
junit.framework.AssertionFailedError: Clean up static fields (in @AfterClass?) and null them, your test still has references to classes of which the sizes cannot be measured due to security restrictions or Java 9 module encapsulation:
  - private static org.apache.solr.client.solrj.cloud.SolrCloudManager org.apache.solr.cloud.autoscaling.ComputePlanActionTest.cloudManager
	at __randomizedtesting.SeedInfo.seed([2729AD008107EC2B]:0)
	at com.carrotsearch.randomizedtesting.rules.StaticFieldsInvariantRule$1.afterAlways(StaticFieldsInvariantRule.java:146)
	at com.carrotsearch.randomizedtesting.rules.StatementAdapter.evaluate(StatementAdapter.java:43)
	at com.carrotsearch.randomizedtesting.rules.StatementAdapter.evaluate(StatementAdapter.java:36)
	at com.carrotsearch.randomizedtesting.rules.StatementAdapter.evaluate(StatementAdapter.java:36)
	at org.apache.lucene.util.TestRuleAssertionsRequired$1.evaluate(TestRuleAssertionsRequired.java:53)
	at org.apache.lucene.util.TestRuleMarkFailure$1.evaluate(TestRuleMarkFailure.java:47)
	at org.apache.lucene.util.TestRuleIgnoreAfterMaxFailures$1.evaluate(TestRuleIgnoreAfterMaxFailures.java:64)
	at org.apache.lucene.util.TestRuleIgnoreTestSuites$1.evaluate(TestRuleIgnoreTestSuites.java:54)
	at com.carrotsearch.randomizedtesting.rules.StatementAdapter.evaluate(StatementAdapter.java:36)
	at com.carrotsearch.randomizedtesting.ThreadLeakControl$StatementRunner.run(ThreadLeakControl.java:368)
	at java.lang.Thread.run(Thread.java:748)
Caused by: java.security.AccessControlException: access denied ("java.lang.RuntimePermission" "accessClassInPackage.sun.nio.fs")
	at java.security.AccessControlContext.checkPermission(AccessControlContext.java:472)
	at java.security.AccessController.checkPermission(AccessController.java:884)
	at java.lang.SecurityManager.checkPermission(SecurityManager.java:549)
	at java.lang.SecurityManager.checkPackageAccess(SecurityManager.java:1564)
	at java.lang.Class.checkPackageAccess(Class.java:2372)
	at java.lang.Class.checkMemberAccess(Class.java:2351)
	at java.lang.Class.getDeclaredFields(Class.java:1915)
	at com.carrotsearch.randomizedtesting.rules.RamUsageEstimator$2.run(RamUsageEstimator.java:585)
	at com.carrotsearch.randomizedtesting.rules.RamUsageEstimator$2.run(RamUsageEstimator.java:582)
	at java.security.AccessController.doPrivileged(Native Method)
	at com.carrotsearch.randomizedtesting.rules.RamUsageEstimator.createCacheEntry(RamUsageEstimator.java:582)
	at com.carrotsearch.randomizedtesting.rules.RamUsageEstimator.measureSizeOf(RamUsageEstimator.java:545)
	at com.carrotsearch.randomizedtesting.rules.RamUsageEstimator.sizeOfAll(RamUsageEstimator.java:387)
	at com.carrotsearch.randomizedtesting.rules.StaticFieldsInvariantRule$1.afterAlways(StaticFieldsInvariantRule.java:129)
	... 10 more


FAILED:  junit.framework.TestSuite.org.apache.solr.cloud.autoscaling.IndexSizeTriggerTest

Error Message:
Clean up static fields (in @AfterClass?) and null them, your test still has references to classes of which the sizes cannot be measured due to security restrictions or Java 9 module encapsulation:   - private static org.apache.solr.core.SolrResourceLoader org.apache.solr.cloud.autoscaling.IndexSizeTriggerTest.loader

Stack Trace:
junit.framework.AssertionFailedError: Clean up static fields (in @AfterClass?) and null them, your test still has references to classes of which the sizes cannot be measured due to security restrictions or Java 9 module encapsulation:
  - private static org.apache.solr.core.SolrResourceLoader org.apache.solr.cloud.autoscaling.IndexSizeTriggerTest.loader
	at __randomizedtesting.SeedInfo.seed([2729AD008107EC2B]:0)
	at com.carrotsearch.randomizedtesting.rules.StaticFieldsInvariantRule$1.afterAlways(StaticFieldsInvariantRule.java:146)
	at com.carrotsearch.randomizedtesting.rules.StatementAdapter.evaluate(StatementAdapter.java:43)
	at com.carrotsearch.randomizedtesting.rules.StatementAdapter.evaluate(StatementAdapter.java:36)
	at com.carrotsearch.randomizedtesting.rules.StatementAdapter.evaluate(StatementAdapter.java:36)
	at org.apache.lucene.util.TestRuleAssertionsRequired$1.evaluate(TestRuleAssertionsRequired.java:53)
	at org.apache.lucene.util.TestRuleMarkFailure$1.evaluate(TestRuleMarkFailure.java:47)
	at org.apache.lucene.util.TestRuleIgnoreAfterMaxFailures$1.evaluate(TestRuleIgnoreAfterMaxFailures.java:64)
	at org.apache.lucene.util.TestRuleIgnoreTestSuites$1.evaluate(TestRuleIgnoreTestSuites.java:54)
	at com.carrotsearch.randomizedtesting.rules.StatementAdapter.evaluate(StatementAdapter.java:36)
	at com.carrotsearch.randomizedtesting.ThreadLeakControl$StatementRunner.run(ThreadLeakControl.java:368)
	at java.lang.Thread.run(Thread.java:748)
Caused by: java.security.AccessControlException: access denied ("java.lang.RuntimePermission" "accessClassInPackage.sun.nio.fs")
	at java.security.AccessControlContext.checkPermission(AccessControlContext.java:472)
	at java.security.AccessController.checkPermission(AccessController.java:884)
	at java.lang.SecurityManager.checkPermission(SecurityManager.java:549)
	at java.lang.SecurityManager.checkPackageAccess(SecurityManager.java:1564)
	at java.lang.Class.checkPackageAccess(Class.java:2372)
	at java.lang.Class.checkMemberAccess(Class.java:2351)
	at java.lang.Class.getDeclaredFields(Class.java:1915)
	at com.carrotsearch.randomizedtesting.rules.RamUsageEstimator$2.run(RamUsageEstimator.java:585)
	at com.carrotsearch.randomizedtesting.rules.RamUsageEstimator$2.run(RamUsageEstimator.java:582)
	at java.security.AccessController.doPrivileged(Native Method)
	at com.carrotsearch.randomizedtesting.rules.RamUsageEstimator.createCacheEntry(RamUsageEstimator.java:582)
	at com.carrotsearch.randomizedtesting.rules.RamUsageEstimator.measureSizeOf(RamUsageEstimator.java:545)
	at com.carrotsearch.randomizedtesting.rules.RamUsageEstimator.sizeOfAll(RamUsageEstimator.java:387)
	at com.carrotsearch.randomizedtesting.rules.StaticFieldsInvariantRule$1.afterAlways(StaticFieldsInvariantRule.java:129)
	... 10 more


FAILED:  junit.framework.TestSuite.org.apache.solr.cloud.autoscaling.NodeAddedTriggerIntegrationTest

Error Message:
Clean up static fields (in @AfterClass?) and null them, your test still has references to classes of which the sizes cannot be measured due to security restrictions or Java 9 module encapsulation:   - private static volatile org.apache.solr.client.solrj.cloud.SolrCloudManager org.apache.solr.cloud.autoscaling.NodeAddedTriggerIntegrationTest.cloudManager

Stack Trace:
junit.framework.AssertionFailedError: Clean up static fields (in @AfterClass?) and null them, your test still has references to classes of which the sizes cannot be measured due to security restrictions or Java 9 module encapsulation:
  - private static volatile org.apache.solr.client.solrj.cloud.SolrCloudManager org.apache.solr.cloud.autoscaling.NodeAddedTriggerIntegrationTest.cloudManager
	at __randomizedtesting.SeedInfo.seed([2729AD008107EC2B]:0)
	at com.carrotsearch.randomizedtesting.rules.StaticFieldsInvariantRule$1.afterAlways(StaticFieldsInvariantRule.java:146)
	at com.carrotsearch.randomizedtesting.rules.StatementAdapter.evaluate(StatementAdapter.java:43)
	at com.carrotsearch.randomizedtesting.rules.StatementAdapter.evaluate(StatementAdapter.java:36)
	at com.carrotsearch.randomizedtesting.rules.StatementAdapter.evaluate(StatementAdapter.java:36)
	at org.apache.lucene.util.TestRuleAssertionsRequired$1.evaluate(TestRuleAssertionsRequired.java:53)
	at org.apache.lucene.util.TestRuleMarkFailure$1.evaluate(TestRuleMarkFailure.java:47)
	at org.apache.lucene.util.TestRuleIgnoreAfterMaxFailures$1.evaluate(TestRuleIgnoreAfterMaxFailures.java:64)
	at org.apache.lucene.util.TestRuleIgnoreTestSuites$1.evaluate(TestRuleIgnoreTestSuites.java:54)
	at com.carrotsearch.randomizedtesting.rules.StatementAdapter.evaluate(StatementAdapter.java:36)
	at com.carrotsearch.randomizedtesting.ThreadLeakControl$StatementRunner.run(ThreadLeakControl.java:368)
	at java.lang.Thread.run(Thread.java:748)
Caused by: java.security.AccessControlException: access denied ("java.lang.RuntimePermission" "accessClassInPackage.sun.nio.fs")
	at java.security.AccessControlContext.checkPermission(AccessControlContext.java:472)
	at java.security.AccessController.checkPermission(AccessController.java:884)
	at java.lang.SecurityManager.checkPermission(SecurityManager.java:549)
	at java.lang.SecurityManager.checkPackageAccess(SecurityManager.java:1564)
	at java.lang.Class.checkPackageAccess(Class.java:2372)
	at java.lang.Class.checkMemberAccess(Class.java:2351)
	at java.lang.Class.getDeclaredFields(Class.java:1915)
	at com.carrotsearch.randomizedtesting.rules.RamUsageEstimator$2.run(RamUsageEstimator.java:585)
	at com.carrotsearch.randomizedtesting.rules.RamUsageEstimator$2.run(RamUsageEstimator.java:582)
	at java.security.AccessController.doPrivileged(Native Method)
	at com.carrotsearch.randomizedtesting.rules.RamUsageEstimator.createCacheEntry(RamUsageEstimator.java:582)
	at com.carrotsearch.randomizedtesting.rules.RamUsageEstimator.measureSizeOf(RamUsageEstimator.java:545)
	at com.carrotsearch.randomizedtesting.rules.RamUsageEstimator.sizeOfAll(RamUsageEstimator.java:387)
	at com.carrotsearch.randomizedtesting.rules.StaticFieldsInvariantRule$1.afterAlways(StaticFieldsInvariantRule.java:129)
	... 10 more


FAILED:  junit.framework.TestSuite.org.apache.solr.cloud.autoscaling.NodeLostTriggerIntegrationTest

Error Message:
Clean up static fields (in @AfterClass?) and null them, your test still has references to classes of which the sizes cannot be measured due to security restrictions or Java 9 module encapsulation:   - private static volatile org.apache.solr.client.solrj.cloud.SolrCloudManager org.apache.solr.cloud.autoscaling.NodeLostTriggerIntegrationTest.cloudManager

Stack Trace:
junit.framework.AssertionFailedError: Clean up static fields (in @AfterClass?) and null them, your test still has references to classes of which the sizes cannot be measured due to security restrictions or Java 9 module encapsulation:
  - private static volatile org.apache.solr.client.solrj.cloud.SolrCloudManager org.apache.solr.cloud.autoscaling.NodeLostTriggerIntegrationTest.cloudManager
	at __randomizedtesting.SeedInfo.seed([2729AD008107EC2B]:0)
	at com.carrotsearch.randomizedtesting.rules.StaticFieldsInvariantRule$1.afterAlways(StaticFieldsInvariantRule.java:146)
	at com.carrotsearch.randomizedtesting.rules.StatementAdapter.evaluate(StatementAdapter.java:43)
	at com.carrotsearch.randomizedtesting.rules.StatementAdapter.evaluate(StatementAdapter.java:36)
	at com.carrotsearch.randomizedtesting.rules.StatementAdapter.evaluate(StatementAdapter.java:36)
	at org.apache.lucene.util.TestRuleAssertionsRequired$1.evaluate(TestRuleAssertionsRequired.java:53)
	at org.apache.lucene.util.TestRuleMarkFailure$1.evaluate(TestRuleMarkFailure.java:47)
	at org.apache.lucene.util.TestRuleIgnoreAfterMaxFailures$1.evaluate(TestRuleIgnoreAfterMaxFailures.java:64)
	at org.apache.lucene.util.TestRuleIgnoreTestSuites$1.evaluate(TestRuleIgnoreTestSuites.java:54)
	at com.carrotsearch.randomizedtesting.rules.StatementAdapter.evaluate(StatementAdapter.java:36)
	at com.carrotsearch.randomizedtesting.ThreadLeakControl$StatementRunner.run(ThreadLeakControl.java:368)
	at java.lang.Thread.run(Thread.java:748)
Caused by: java.security.AccessControlException: access denied ("java.lang.RuntimePermission" "accessClassInPackage.sun.nio.fs")
	at java.security.AccessControlContext.checkPermission(AccessControlContext.java:472)
	at java.security.AccessController.checkPermission(AccessController.java:884)
	at java.lang.SecurityManager.checkPermission(SecurityManager.java:549)
	at java.lang.SecurityManager.checkPackageAccess(SecurityManager.java:1564)
	at java.lang.Class.checkPackageAccess(Class.java:2372)
	at java.lang.Class.checkMemberAccess(Class.java:2351)
	at java.lang.Class.getDeclaredFields(Class.java:1915)
	at com.carrotsearch.randomizedtesting.rules.RamUsageEstimator$2.run(RamUsageEstimator.java:585)
	at com.carrotsearch.randomizedtesting.rules.RamUsageEstimator$2.run(RamUsageEstimator.java:582)
	at java.security.AccessController.doPrivileged(Native Method)
	at com.carrotsearch.randomizedtesting.rules.RamUsageEstimator.createCacheEntry(RamUsageEstimator.java:582)
	at com.carrotsearch.randomizedtesting.rules.RamUsageEstimator.measureSizeOf(RamUsageEstimator.java:545)
	at com.carrotsearch.randomizedtesting.rules.RamUsageEstimator.sizeOfAll(RamUsageEstimator.java:387)
	at com.carrotsearch.randomizedtesting.rules.StaticFieldsInvariantRule$1.afterAlways(StaticFieldsInvariantRule.java:129)
	... 10 more


FAILED:  junit.framework.TestSuite.org.apache.solr.cloud.autoscaling.TriggerIntegrationTest

Error Message:
Clean up static fields (in @AfterClass?) and null them, your test still has references to classes of which the sizes cannot be measured due to security restrictions or Java 9 module encapsulation:   - private static org.apache.solr.client.solrj.cloud.SolrCloudManager org.apache.solr.cloud.autoscaling.TriggerIntegrationTest.cloudManager

Stack Trace:
junit.framework.AssertionFailedError: Clean up static fields (in @AfterClass?) and null them, your test still has references to classes of which the sizes cannot be measured due to security restrictions or Java 9 module encapsulation:
  - private static org.apache.solr.client.solrj.cloud.SolrCloudManager org.apache.solr.cloud.autoscaling.TriggerIntegrationTest.cloudManager
	at __randomizedtesting.SeedInfo.seed([2729AD008107EC2B]:0)
	at com.carrotsearch.randomizedtesting.rules.StaticFieldsInvariantRule$1.afterAlways(StaticFieldsInvariantRule.java:146)
	at com.carrotsearch.randomizedtesting.rules.StatementAdapter.evaluate(StatementAdapter.java:43)
	at com.carrotsearch.randomizedtesting.rules.StatementAdapter.evaluate(StatementAdapter.java:36)
	at com.carrotsearch.randomizedtesting.rules.StatementAdapter.evaluate(StatementAdapter.java:36)
	at org.apache.lucene.util.TestRuleAssertionsRequired$1.evaluate(TestRuleAssertionsRequired.java:53)
	at org.apache.lucene.util.TestRuleMarkFailure$1.evaluate(TestRuleMarkFailure.java:47)
	at org.apache.lucene.util.TestRuleIgnoreAfterMaxFailures$1.evaluate(TestRuleIgnoreAfterMaxFailures.java:64)
	at org.apache.lucene.util.TestRuleIgnoreTestSuites$1.evaluate(TestRuleIgnoreTestSuites.java:54)
	at com.carrotsearch.randomizedtesting.rules.StatementAdapter.evaluate(StatementAdapter.java:36)
	at com.carrotsearch.randomizedtesting.ThreadLeakControl$StatementRunner.run(ThreadLeakControl.java:368)
	at java.lang.Thread.run(Thread.java:748)
Caused by: java.security.AccessControlException: access denied ("java.lang.RuntimePermission" "accessClassInPackage.sun.nio.fs")
	at java.security.AccessControlContext.checkPermission(AccessControlContext.java:472)
	at java.security.AccessController.checkPermission(AccessController.java:884)
	at java.lang.SecurityManager.checkPermission(SecurityManager.java:549)
	at java.lang.SecurityManager.checkPackageAccess(SecurityManager.java:1564)
	at java.lang.Class.checkPackageAccess(Class.java:2372)
	at java.lang.Class.checkMemberAccess(Class.java:2351)
	at java.lang.Class.getDeclaredFields(Class.java:1915)
	at com.carrotsearch.randomizedtesting.rules.RamUsageEstimator$2.run(RamUsageEstimator.java:585)
	at com.carrotsearch.randomizedtesting.rules.RamUsageEstimator$2.run(RamUsageEstimator.java:582)
	at java.security.AccessController.doPrivileged(Native Method)
	at com.carrotsearch.randomizedtesting.rules.RamUsageEstimator.createCacheEntry(RamUsageEstimator.java:582)
	at com.carrotsearch.randomizedtesting.rules.RamUsageEstimator.measureSizeOf(RamUsageEstimator.java:545)
	at com.carrotsearch.randomizedtesting.rules.RamUsageEstimator.sizeOfAll(RamUsageEstimator.java:387)
	at com.carrotsearch.randomizedtesting.rules.StaticFieldsInvariantRule$1.afterAlways(StaticFieldsInvariantRule.java:129)
	... 10 more


FAILED:  junit.framework.TestSuite.org.apache.solr.cloud.autoscaling.sim.TestSimClusterStateProvider

Error Message:
Clean up static fields (in @AfterClass?) and null them, your test still has references to classes of which the sizes cannot be measured due to security restrictions or Java 9 module encapsulation:   - private static org.apache.solr.client.solrj.cloud.SolrCloudManager org.apache.solr.cloud.autoscaling.sim.TestSimClusterStateProvider.cloudManager

Stack Trace:
junit.framework.AssertionFailedError: Clean up static fields (in @AfterClass?) and null them, your test still has references to classes of which the sizes cannot be measured due to security restrictions or Java 9 module encapsulation:
  - private static org.apache.solr.client.solrj.cloud.SolrCloudManager org.apache.solr.cloud.autoscaling.sim.TestSimClusterStateProvider.cloudManager
	at __randomizedtesting.SeedInfo.seed([2729AD008107EC2B]:0)
	at com.carrotsearch.randomizedtesting.rules.StaticFieldsInvariantRule$1.afterAlways(StaticFieldsInvariantRule.java:146)
	at com.carrotsearch.randomizedtesting.rules.StatementAdapter.evaluate(StatementAdapter.java:43)
	at com.carrotsearch.randomizedtesting.rules.StatementAdapter.evaluate(StatementAdapter.java:36)
	at com.carrotsearch.randomizedtesting.rules.StatementAdapter.evaluate(StatementAdapter.java:36)
	at org.apache.lucene.util.TestRuleAssertionsRequired$1.evaluate(TestRuleAssertionsRequired.java:53)
	at org.apache.lucene.util.TestRuleMarkFailure$1.evaluate(TestRuleMarkFailure.java:47)
	at org.apache.lucene.util.TestRuleIgnoreAfterMaxFailures$1.evaluate(TestRuleIgnoreAfterMaxFailures.java:64)
	at org.apache.lucene.util.TestRuleIgnoreTestSuites$1.evaluate(TestRuleIgnoreTestSuites.java:54)
	at com.carrotsearch.randomizedtesting.rules.StatementAdapter.evaluate(StatementAdapter.java:36)
	at com.carrotsearch.randomizedtesting.ThreadLeakControl$StatementRunner.run(ThreadLeakControl.java:368)
	at java.lang.Thread.run(Thread.java:748)
Caused by: java.security.AccessControlException: access denied ("java.lang.RuntimePermission" "accessClassInPackage.sun.nio.fs")
	at java.security.AccessControlContext.checkPermission(AccessControlContext.java:472)
	at java.security.AccessController.checkPermission(AccessController.java:884)
	at java.lang.SecurityManager.checkPermission(SecurityManager.java:549)
	at java.lang.SecurityManager.checkPackageAccess(SecurityManager.java:1564)
	at java.lang.Class.checkPackageAccess(Class.java:2372)
	at java.lang.Class.checkMemberAccess(Class.java:2351)
	at java.lang.Class.getDeclaredFields(Class.java:1915)
	at com.carrotsearch.randomizedtesting.rules.RamUsageEstimator$2.run(RamUsageEstimator.java:585)
	at com.carrotsearch.randomizedtesting.rules.RamUsageEstimator$2.run(RamUsageEstimator.java:582)
	at java.security.AccessController.doPrivileged(Native Method)
	at com.carrotsearch.randomizedtesting.rules.RamUsageEstimator.createCacheEntry(RamUsageEstimator.java:582)
	at com.carrotsearch.randomizedtesting.rules.RamUsageEstimator.measureSizeOf(RamUsageEstimator.java:545)
	at com.carrotsearch.randomizedtesting.rules.RamUsageEstimator.sizeOfAll(RamUsageEstimator.java:387)
	at com.carrotsearch.randomizedtesting.rules.StaticFieldsInvariantRule$1.afterAlways(StaticFieldsInvariantRule.java:129)
	... 10 more


FAILED:  junit.framework.TestSuite.org.apache.solr.cloud.autoscaling.sim.TestSnapshotCloudManager

Error Message:
Clean up static fields (in @AfterClass?) and null them, your test still has references to classes of which the sizes cannot be measured due to security restrictions or Java 9 module encapsulation:   - private static org.apache.solr.client.solrj.cloud.SolrCloudManager org.apache.solr.cloud.autoscaling.sim.TestSnapshotCloudManager.realManager

Stack Trace:
junit.framework.AssertionFailedError: Clean up static fields (in @AfterClass?) and null them, your test still has references to classes of which the sizes cannot be measured due to security restrictions or Java 9 module encapsulation:
  - private static org.apache.solr.client.solrj.cloud.SolrCloudManager org.apache.solr.cloud.autoscaling.sim.TestSnapshotCloudManager.realManager
	at __randomizedtesting.SeedInfo.seed([2729AD008107EC2B]:0)
	at com.carrotsearch.randomizedtesting.rules.StaticFieldsInvariantRule$1.afterAlways(StaticFieldsInvariantRule.java:146)
	at com.carrotsearch.randomizedtesting.rules.StatementAdapter.evaluate(StatementAdapter.java:43)
	at com.carrotsearch.randomizedtesting.rules.StatementAdapter.evaluate(StatementAdapter.java:36)
	at com.carrotsearch.randomizedtesting.rules.StatementAdapter.evaluate(StatementAdapter.java:36)
	at org.apache.lucene.util.TestRuleAssertionsRequired$1.evaluate(TestRuleAssertionsRequired.java:53)
	at org.apache.lucene.util.TestRuleMarkFailure$1.evaluate(TestRuleMarkFailure.java:47)
	at org.apache.lucene.util.TestRuleIgnoreAfterMaxFailures$1.evaluate(TestRuleIgnoreAfterMaxFailures.java:64)
	at org.apache.lucene.util.TestRuleIgnoreTestSuites$1.evaluate(TestRuleIgnoreTestSuites.java:54)
	at com.carrotsearch.randomizedtesting.rules.StatementAdapter.evaluate(StatementAdapter.java:36)
	at com.carrotsearch.randomizedtesting.ThreadLeakControl$StatementRunner.run(ThreadLeakControl.java:368)
	at java.lang.Thread.run(Thread.java:748)
Caused by: java.security.AccessControlException: access denied ("java.lang.RuntimePermission" "accessClassInPackage.sun.nio.fs")
	at java.security.AccessControlContext.checkPermission(AccessControlContext.java:472)
	at java.security.AccessController.checkPermission(AccessController.java:884)
	at java.lang.SecurityManager.checkPermission(SecurityManager.java:549)
	at java.lang.SecurityManager.checkPackageAccess(SecurityManager.java:1564)
	at java.lang.Class.checkPackageAccess(Class.java:2372)
	at java.lang.Class.checkMemberAccess(Class.java:2351)
	at java.lang.Class.getDeclaredFields(Class.java:1915)
	at com.carrotsearch.randomizedtesting.rules.RamUsageEstimator$2.run(RamUsageEstimator.java:585)
	at com.carrotsearch.randomizedtesting.rules.RamUsageEstimator$2.run(RamUsageEstimator.java:582)
	at java.security.AccessController.doPrivileged(Native Method)
	at com.carrotsearch.randomizedtesting.rules.RamUsageEstimator.createCacheEntry(RamUsageEstimator.java:582)
	at com.carrotsearch.randomizedtesting.rules.RamUsageEstimator.measureSizeOf(RamUsageEstimator.java:545)
	at com.carrotsearch.randomizedtesting.rules.RamUsageEstimator.sizeOfAll(RamUsageEstimator.java:387)
	at com.carrotsearch.randomizedtesting.rules.StaticFieldsInvariantRule$1.afterAlways(StaticFieldsInvariantRule.java:129)
	... 10 more


FAILED:  junit.framework.TestSuite.org.apache.solr.cloud.hdfs.HDFSCollectionsAPITest

Error Message:
failure to login: javax.security.auth.login.LoginException: Security Exception

Stack Trace:
org.apache.hadoop.security.KerberosAuthException: failure to login: javax.security.auth.login.LoginException: Security Exception
	at __randomizedtesting.SeedInfo.seed([2729AD008107EC2B]:0)
	at org.apache.hadoop.security.UserGroupInformation.doSubjectLogin(UserGroupInformation.java:1847)
	at org.apache.hadoop.security.UserGroupInformation.createLoginUser(UserGroupInformation.java:710)
	at org.apache.hadoop.security.UserGroupInformation.getLoginUser(UserGroupInformation.java:660)
	at org.apache.hadoop.security.UserGroupInformation.getCurrentUser(UserGroupInformation.java:571)
	at org.apache.hadoop.hdfs.server.namenode.FSNamesystem.<init>(FSNamesystem.java:767)
	at org.apache.hadoop.hdfs.server.namenode.FSNamesystem.<init>(FSNamesystem.java:733)
	at org.apache.hadoop.hdfs.server.namenode.NameNode.format(NameNode.java:1140)
	at org.apache.hadoop.hdfs.server.namenode.NameNode.format(NameNode.java:409)
	at org.apache.hadoop.hdfs.DFSTestUtil.formatNameNode(DFSTestUtil.java:261)
	at org.apache.hadoop.hdfs.MiniDFSCluster.configureNameService(MiniDFSCluster.java:1072)
	at org.apache.hadoop.hdfs.MiniDFSCluster.createNameNodesAndSetConf(MiniDFSCluster.java:958)
	at org.apache.hadoop.hdfs.MiniDFSCluster.initMiniDFSCluster(MiniDFSCluster.java:890)
	at org.apache.hadoop.hdfs.MiniDFSCluster.<init>(MiniDFSCluster.java:518)
	at org.apache.hadoop.hdfs.MiniDFSCluster$Builder.build(MiniDFSCluster.java:477)
	at org.apache.solr.cloud.hdfs.HdfsTestUtil.setupClass(HdfsTestUtil.java:134)
	at org.apache.solr.cloud.hdfs.HdfsTestUtil.setupClass(HdfsTestUtil.java:66)
	at org.apache.solr.cloud.hdfs.HDFSCollectionsAPITest.setupClass(HDFSCollectionsAPITest.java:46)
	at sun.reflect.NativeMethodAccessorImpl.invoke0(Native Method)
	at sun.reflect.NativeMethodAccessorImpl.invoke(NativeMethodAccessorImpl.java:62)
	at sun.reflect.DelegatingMethodAccessorImpl.invoke(DelegatingMethodAccessorImpl.java:43)
	at java.lang.reflect.Method.invoke(Method.java:498)
	at com.carrotsearch.randomizedtesting.RandomizedRunner.invoke(RandomizedRunner.java:1750)
	at com.carrotsearch.randomizedtesting.RandomizedRunner$6.evaluate(RandomizedRunner.java:878)
	at com.carrotsearch.randomizedtesting.RandomizedRunner$7.evaluate(RandomizedRunner.java:894)
	at com.carrotsearch.randomizedtesting.rules.StatementAdapter.evaluate(StatementAdapter.java:36)
	at com.carrotsearch.randomizedtesting.rules.SystemPropertiesRestoreRule$1.evaluate(SystemPropertiesRestoreRule.java:57)
	at org.apache.lucene.util.AbstractBeforeAfterRule$1.evaluate(AbstractBeforeAfterRule.java:45)
	at com.carrotsearch.randomizedtesting.rules.StatementAdapter.evaluate(StatementAdapter.java:36)
	at org.apache.lucene.util.TestRuleStoreClassName$1.evaluate(TestRuleStoreClassName.java:41)
	at com.carrotsearch.randomizedtesting.rules.NoShadowingOrOverridesOnMethodsRule$1.evaluate(NoShadowingOrOverridesOnMethodsRule.java:40)
	at com.carrotsearch.randomizedtesting.rules.NoShadowingOrOverridesOnMethodsRule$1.evaluate(NoShadowingOrOverridesOnMethodsRule.java:40)
	at com.carrotsearch.randomizedtesting.rules.StatementAdapter.evaluate(StatementAdapter.java:36)
	at com.carrotsearch.randomizedtesting.rules.StatementAdapter.evaluate(StatementAdapter.java:36)
	at com.carrotsearch.randomizedtesting.rules.StatementAdapter.evaluate(StatementAdapter.java:36)
	at org.apache.lucene.util.TestRuleAssertionsRequired$1.evaluate(TestRuleAssertionsRequired.java:53)
	at org.apache.lucene.util.TestRuleMarkFailure$1.evaluate(TestRuleMarkFailure.java:47)
	at org.apache.lucene.util.TestRuleIgnoreAfterMaxFailures$1.evaluate(TestRuleIgnoreAfterMaxFailures.java:64)
	at org.apache.lucene.util.TestRuleIgnoreTestSuites$1.evaluate(TestRuleIgnoreTestSuites.java:54)
	at com.carrotsearch.randomizedtesting.rules.StatementAdapter.evaluate(StatementAdapter.java:36)
	at com.carrotsearch.randomizedtesting.ThreadLeakControl$StatementRunner.run(ThreadLeakControl.java:368)
	at java.lang.Thread.run(Thread.java:748)
Caused by: javax.security.auth.login.LoginException: Security Exception
	at javax.security.auth.login.LoginContext.invoke(LoginContext.java:840)
	at javax.security.auth.login.LoginContext.access$000(LoginContext.java:195)
	at javax.security.auth.login.LoginContext$4.run(LoginContext.java:682)
	at javax.security.auth.login.LoginContext$4.run(LoginContext.java:680)
	at java.security.AccessController.doPrivileged(Native Method)
	at javax.security.auth.login.LoginContext.invokePriv(LoginContext.java:680)
	at javax.security.auth.login.LoginContext.login(LoginContext.java:587)
	at org.apache.hadoop.security.UserGroupInformation$HadoopLoginContext.login(UserGroupInformation.java:1926)
	at org.apache.hadoop.security.UserGroupInformation.doSubjectLogin(UserGroupInformation.java:1837)
	... 40 more
Caused by: java.lang.SecurityException
	at javax.security.auth.login.LoginContext.invoke(LoginContext.java:841)
	... 48 more


FAILED:  junit.framework.TestSuite.org.apache.solr.cloud.hdfs.HdfsNNFailoverTest

Error Message:
failure to login: javax.security.auth.login.LoginException: Security Exception

Stack Trace:
org.apache.hadoop.security.KerberosAuthException: failure to login: javax.security.auth.login.LoginException: Security Exception
	at __randomizedtesting.SeedInfo.seed([2729AD008107EC2B]:0)
	at org.apache.hadoop.security.UserGroupInformation.doSubjectLogin(UserGroupInformation.java:1847)
	at org.apache.hadoop.security.UserGroupInformation.createLoginUser(UserGroupInformation.java:710)
	at org.apache.hadoop.security.UserGroupInformation.getLoginUser(UserGroupInformation.java:660)
	at org.apache.hadoop.security.UserGroupInformation.getCurrentUser(UserGroupInformation.java:571)
	at org.apache.hadoop.hdfs.server.namenode.FSNamesystem.<init>(FSNamesystem.java:767)
	at org.apache.hadoop.hdfs.server.namenode.FSNamesystem.<init>(FSNamesystem.java:733)
	at org.apache.hadoop.hdfs.server.namenode.NameNode.format(NameNode.java:1140)
	at org.apache.hadoop.hdfs.server.namenode.NameNode.format(NameNode.java:409)
	at org.apache.hadoop.hdfs.DFSTestUtil.formatNameNode(DFSTestUtil.java:261)
	at org.apache.hadoop.hdfs.MiniDFSCluster.configureNameService(MiniDFSCluster.java:1072)
	at org.apache.hadoop.hdfs.MiniDFSCluster.createNameNodesAndSetConf(MiniDFSCluster.java:958)
	at org.apache.hadoop.hdfs.MiniDFSCluster.initMiniDFSCluster(MiniDFSCluster.java:890)
	at org.apache.hadoop.hdfs.MiniDFSCluster.<init>(MiniDFSCluster.java:518)
	at org.apache.hadoop.hdfs.MiniDFSCluster$Builder.build(MiniDFSCluster.java:477)
	at org.apache.solr.cloud.hdfs.HdfsTestUtil.setupClass(HdfsTestUtil.java:134)
	at org.apache.solr.cloud.hdfs.HdfsNNFailoverTest.setupClass(HdfsNNFailoverTest.java:41)
	at sun.reflect.NativeMethodAccessorImpl.invoke0(Native Method)
	at sun.reflect.NativeMethodAccessorImpl.invoke(NativeMethodAccessorImpl.java:62)
	at sun.reflect.DelegatingMethodAccessorImpl.invoke(DelegatingMethodAccessorImpl.java:43)
	at java.lang.reflect.Method.invoke(Method.java:498)
	at com.carrotsearch.randomizedtesting.RandomizedRunner.invoke(RandomizedRunner.java:1750)
	at com.carrotsearch.randomizedtesting.RandomizedRunner$6.evaluate(RandomizedRunner.java:878)
	at com.carrotsearch.randomizedtesting.RandomizedRunner$7.evaluate(RandomizedRunner.java:894)
	at com.carrotsearch.randomizedtesting.rules.StatementAdapter.evaluate(StatementAdapter.java:36)
	at com.carrotsearch.randomizedtesting.rules.SystemPropertiesRestoreRule$1.evaluate(SystemPropertiesRestoreRule.java:57)
	at org.apache.lucene.util.AbstractBeforeAfterRule$1.evaluate(AbstractBeforeAfterRule.java:45)
	at com.carrotsearch.randomizedtesting.rules.StatementAdapter.evaluate(StatementAdapter.java:36)
	at org.apache.lucene.util.TestRuleStoreClassName$1.evaluate(TestRuleStoreClassName.java:41)
	at com.carrotsearch.randomizedtesting.rules.NoShadowingOrOverridesOnMethodsRule$1.evaluate(NoShadowingOrOverridesOnMethodsRule.java:40)
	at com.carrotsearch.randomizedtesting.rules.NoShadowingOrOverridesOnMethodsRule$1.evaluate(NoShadowingOrOverridesOnMethodsRule.java:40)
	at com.carrotsearch.randomizedtesting.rules.StatementAdapter.evaluate(StatementAdapter.java:36)
	at com.carrotsearch.randomizedtesting.rules.StatementAdapter.evaluate(StatementAdapter.java:36)
	at com.carrotsearch.randomizedtesting.rules.StatementAdapter.evaluate(StatementAdapter.java:36)
	at org.apache.lucene.util.TestRuleAssertionsRequired$1.evaluate(TestRuleAssertionsRequired.java:53)
	at org.apache.lucene.util.TestRuleMarkFailure$1.evaluate(TestRuleMarkFailure.java:47)
	at org.apache.lucene.util.TestRuleIgnoreAfterMaxFailures$1.evaluate(TestRuleIgnoreAfterMaxFailures.java:64)
	at org.apache.lucene.util.TestRuleIgnoreTestSuites$1.evaluate(TestRuleIgnoreTestSuites.java:54)
	at com.carrotsearch.randomizedtesting.rules.StatementAdapter.evaluate(StatementAdapter.java:36)
	at com.carrotsearch.randomizedtesting.ThreadLeakControl$StatementRunner.run(ThreadLeakControl.java:368)
	at java.lang.Thread.run(Thread.java:748)
Caused by: javax.security.auth.login.LoginException: Security Exception
	at javax.security.auth.login.LoginContext.invoke(LoginContext.java:840)
	at javax.security.auth.login.LoginContext.access$000(LoginContext.java:195)
	at javax.security.auth.login.LoginContext$4.run(LoginContext.java:682)
	at javax.security.auth.login.LoginContext$4.run(LoginContext.java:680)
	at java.security.AccessController.doPrivileged(Native Method)
	at javax.security.auth.login.LoginContext.invokePriv(LoginContext.java:680)
	at javax.security.auth.login.LoginContext.login(LoginContext.java:587)
	at org.apache.hadoop.security.UserGroupInformation$HadoopLoginContext.login(UserGroupInformation.java:1926)
	at org.apache.hadoop.security.UserGroupInformation.doSubjectLogin(UserGroupInformation.java:1837)
	... 39 more
Caused by: java.lang.SecurityException
	at javax.security.auth.login.LoginContext.invoke(LoginContext.java:841)
	... 47 more


FAILED:  junit.framework.TestSuite.org.apache.solr.cloud.hdfs.HdfsRecoverLeaseTest

Error Message:
failure to login: javax.security.auth.login.LoginException: Security Exception

Stack Trace:
org.apache.hadoop.security.KerberosAuthException: failure to login: javax.security.auth.login.LoginException: Security Exception
	at __randomizedtesting.SeedInfo.seed([2729AD008107EC2B]:0)
	at org.apache.hadoop.security.UserGroupInformation.doSubjectLogin(UserGroupInformation.java:1847)
	at org.apache.hadoop.security.UserGroupInformation.createLoginUser(UserGroupInformation.java:710)
	at org.apache.hadoop.security.UserGroupInformation.getLoginUser(UserGroupInformation.java:660)
	at org.apache.hadoop.security.UserGroupInformation.getCurrentUser(UserGroupInformation.java:571)
	at org.apache.hadoop.hdfs.server.namenode.FSNamesystem.<init>(FSNamesystem.java:767)
	at org.apache.hadoop.hdfs.server.namenode.FSNamesystem.<init>(FSNamesystem.java:733)
	at org.apache.hadoop.hdfs.server.namenode.NameNode.format(NameNode.java:1140)
	at org.apache.hadoop.hdfs.server.namenode.NameNode.format(NameNode.java:409)
	at org.apache.hadoop.hdfs.DFSTestUtil.formatNameNode(DFSTestUtil.java:261)
	at org.apache.hadoop.hdfs.MiniDFSCluster.configureNameService(MiniDFSCluster.java:1072)
	at org.apache.hadoop.hdfs.MiniDFSCluster.createNameNodesAndSetConf(MiniDFSCluster.java:958)
	at org.apache.hadoop.hdfs.MiniDFSCluster.initMiniDFSCluster(MiniDFSCluster.java:890)
	at org.apache.hadoop.hdfs.MiniDFSCluster.<init>(MiniDFSCluster.java:518)
	at org.apache.hadoop.hdfs.MiniDFSCluster$Builder.build(MiniDFSCluster.java:477)
	at org.apache.solr.cloud.hdfs.HdfsTestUtil.setupClass(HdfsTestUtil.java:134)
	at org.apache.solr.cloud.hdfs.HdfsTestUtil.setupClass(HdfsTestUtil.java:70)
	at org.apache.solr.cloud.hdfs.HdfsRecoverLeaseTest.beforeClass(HdfsRecoverLeaseTest.java:50)
	at sun.reflect.NativeMethodAccessorImpl.invoke0(Native Method)
	at sun.reflect.NativeMethodAccessorImpl.invoke(NativeMethodAccessorImpl.java:62)
	at sun.reflect.DelegatingMethodAccessorImpl.invoke(DelegatingMethodAccessorImpl.java:43)
	at java.lang.reflect.Method.invoke(Method.java:498)
	at com.carrotsearch.randomizedtesting.RandomizedRunner.invoke(RandomizedRunner.java:1750)
	at com.carrotsearch.randomizedtesting.RandomizedRunner$6.evaluate(RandomizedRunner.java:878)
	at com.carrotsearch.randomizedtesting.RandomizedRunner$7.evaluate(RandomizedRunner.java:894)
	at com.carrotsearch.randomizedtesting.rules.StatementAdapter.evaluate(StatementAdapter.java:36)
	at com.carrotsearch.randomizedtesting.rules.SystemPropertiesRestoreRule$1.evaluate(SystemPropertiesRestoreRule.java:57)
	at org.apache.lucene.util.AbstractBeforeAfterRule$1.evaluate(AbstractBeforeAfterRule.java:45)
	at com.carrotsearch.randomizedtesting.rules.StatementAdapter.evaluate(StatementAdapter.java:36)
	at org.apache.lucene.util.TestRuleStoreClassName$1.evaluate(TestRuleStoreClassName.java:41)
	at com.carrotsearch.randomizedtesting.rules.NoShadowingOrOverridesOnMethodsRule$1.evaluate(NoShadowingOrOverridesOnMethodsRule.java:40)
	at com.carrotsearch.randomizedtesting.rules.NoShadowingOrOverridesOnMethodsRule$1.evaluate(NoShadowingOrOverridesOnMethodsRule.java:40)
	at com.carrotsearch.randomizedtesting.rules.StatementAdapter.evaluate(StatementAdapter.java:36)
	at com.carrotsearch.randomizedtesting.rules.StatementAdapter.evaluate(StatementAdapter.java:36)
	at com.carrotsearch.randomizedtesting.rules.StatementAdapter.evaluate(StatementAdapter.java:36)
	at org.apache.lucene.util.TestRuleAssertionsRequired$1.evaluate(TestRuleAssertionsRequired.java:53)
	at org.apache.lucene.util.TestRuleMarkFailure$1.evaluate(TestRuleMarkFailure.java:47)
	at org.apache.lucene.util.TestRuleIgnoreAfterMaxFailures$1.evaluate(TestRuleIgnoreAfterMaxFailures.java:64)
	at org.apache.lucene.util.TestRuleIgnoreTestSuites$1.evaluate(TestRuleIgnoreTestSuites.java:54)
	at com.carrotsearch.randomizedtesting.rules.StatementAdapter.evaluate(StatementAdapter.java:36)
	at com.carrotsearch.randomizedtesting.ThreadLeakControl$StatementRunner.run(ThreadLeakControl.java:368)
	at java.lang.Thread.run(Thread.java:748)
Caused by: javax.security.auth.login.LoginException: Security Exception
	at javax.security.auth.login.LoginContext.invoke(LoginContext.java:840)
	at javax.security.auth.login.LoginContext.access$000(LoginContext.java:195)
	at javax.security.auth.login.LoginContext$4.run(LoginContext.java:682)
	at javax.security.auth.login.LoginContext$4.run(LoginContext.java:680)
	at java.security.AccessController.doPrivileged(Native Method)
	at javax.security.auth.login.LoginContext.invokePriv(LoginContext.java:680)
	at javax.security.auth.login.LoginContext.login(LoginContext.java:587)
	at org.apache.hadoop.security.UserGroupInformation$HadoopLoginContext.login(UserGroupInformation.java:1926)
	at org.apache.hadoop.security.UserGroupInformation.doSubjectLogin(UserGroupInformation.java:1837)
	... 40 more
Caused by: java.lang.SecurityException
	at javax.security.auth.login.LoginContext.invoke(LoginContext.java:841)
	... 48 more


FAILED:  junit.framework.TestSuite.org.apache.solr.cloud.hdfs.HdfsThreadLeakTest

Error Message:
failure to login: javax.security.auth.login.LoginException: Security Exception

Stack Trace:
org.apache.hadoop.security.KerberosAuthException: failure to login: javax.security.auth.login.LoginException: Security Exception
	at __randomizedtesting.SeedInfo.seed([2729AD008107EC2B]:0)
	at org.apache.hadoop.security.UserGroupInformation.doSubjectLogin(UserGroupInformation.java:1847)
	at org.apache.hadoop.security.UserGroupInformation.createLoginUser(UserGroupInformation.java:710)
	at org.apache.hadoop.security.UserGroupInformation.getLoginUser(UserGroupInformation.java:660)
	at org.apache.hadoop.security.UserGroupInformation.getCurrentUser(UserGroupInformation.java:571)
	at org.apache.hadoop.hdfs.server.namenode.FSNamesystem.<init>(FSNamesystem.java:767)
	at org.apache.hadoop.hdfs.server.namenode.FSNamesystem.<init>(FSNamesystem.java:733)
	at org.apache.hadoop.hdfs.server.namenode.NameNode.format(NameNode.java:1140)
	at org.apache.hadoop.hdfs.server.namenode.NameNode.format(NameNode.java:409)
	at org.apache.hadoop.hdfs.DFSTestUtil.formatNameNode(DFSTestUtil.java:261)
	at org.apache.hadoop.hdfs.MiniDFSCluster.configureNameService(MiniDFSCluster.java:1072)
	at org.apache.hadoop.hdfs.MiniDFSCluster.createNameNodesAndSetConf(MiniDFSCluster.java:958)
	at org.apache.hadoop.hdfs.MiniDFSCluster.initMiniDFSCluster(MiniDFSCluster.java:890)
	at org.apache.hadoop.hdfs.MiniDFSCluster.<init>(MiniDFSCluster.java:518)
	at org.apache.hadoop.hdfs.MiniDFSCluster$Builder.build(MiniDFSCluster.java:477)
	at org.apache.solr.cloud.hdfs.HdfsTestUtil.setupClass(HdfsTestUtil.java:134)
	at org.apache.solr.cloud.hdfs.HdfsThreadLeakTest.beforeClass(HdfsThreadLeakTest.java:42)
	at sun.reflect.NativeMethodAccessorImpl.invoke0(Native Method)
	at sun.reflect.NativeMethodAccessorImpl.invoke(NativeMethodAccessorImpl.java:62)
	at sun.reflect.DelegatingMethodAccessorImpl.invoke(DelegatingMethodAccessorImpl.java:43)
	at java.lang.reflect.Method.invoke(Method.java:498)
	at com.carrotsearch.randomizedtesting.RandomizedRunner.invoke(RandomizedRunner.java:1750)
	at com.carrotsearch.randomizedtesting.RandomizedRunner$6.evaluate(RandomizedRunner.java:878)
	at com.carrotsearch.randomizedtesting.RandomizedRunner$7.evaluate(RandomizedRunner.java:894)
	at com.carrotsearch.randomizedtesting.rules.StatementAdapter.evaluate(StatementAdapter.java:36)
	at com.carrotsearch.randomizedtesting.rules.SystemPropertiesRestoreRule$1.evaluate(SystemPropertiesRestoreRule.java:57)
	at org.apache.lucene.util.AbstractBeforeAfterRule$1.evaluate(AbstractBeforeAfterRule.java:45)
	at com.carrotsearch.randomizedtesting.rules.StatementAdapter.evaluate(StatementAdapter.java:36)
	at org.apache.lucene.util.TestRuleStoreClassName$1.evaluate(TestRuleStoreClassName.java:41)
	at com.carrotsearch.randomizedtesting.rules.NoShadowingOrOverridesOnMethodsRule$1.evaluate(NoShadowingOrOverridesOnMethodsRule.java:40)
	at com.carrotsearch.randomizedtesting.rules.NoShadowingOrOverridesOnMethodsRule$1.evaluate(NoShadowingOrOverridesOnMethodsRule.java:40)
	at com.carrotsearch.randomizedtesting.rules.StatementAdapter.evaluate(StatementAdapter.java:36)
	at com.carrotsearch.randomizedtesting.rules.StatementAdapter.evaluate(StatementAdapter.java:36)
	at com.carrotsearch.randomizedtesting.rules.StatementAdapter.evaluate(StatementAdapter.java:36)
	at org.apache.lucene.util.TestRuleAssertionsRequired$1.evaluate(TestRuleAssertionsRequired.java:53)
	at org.apache.lucene.util.TestRuleMarkFailure$1.evaluate(TestRuleMarkFailure.java:47)
	at org.apache.lucene.util.TestRuleIgnoreAfterMaxFailures$1.evaluate(TestRuleIgnoreAfterMaxFailures.java:64)
	at org.apache.lucene.util.TestRuleIgnoreTestSuites$1.evaluate(TestRuleIgnoreTestSuites.java:54)
	at com.carrotsearch.randomizedtesting.rules.StatementAdapter.evaluate(StatementAdapter.java:36)
	at com.carrotsearch.randomizedtesting.ThreadLeakControl$StatementRunner.run(ThreadLeakControl.java:368)
	at java.lang.Thread.run(Thread.java:748)
Caused by: javax.security.auth.login.LoginException: Security Exception
	at javax.security.auth.login.LoginContext.invoke(LoginContext.java:840)
	at javax.security.auth.login.LoginContext.access$000(LoginContext.java:195)
	at javax.security.auth.login.LoginContext$4.run(LoginContext.java:682)
	at javax.security.auth.login.LoginContext$4.run(LoginContext.java:680)
	at java.security.AccessController.doPrivileged(Native Method)
	at javax.security.auth.login.LoginContext.invokePriv(LoginContext.java:680)
	at javax.security.auth.login.LoginContext.login(LoginContext.java:587)
	at org.apache.hadoop.security.UserGroupInformation$HadoopLoginContext.login(UserGroupInformation.java:1926)
	at org.apache.hadoop.security.UserGroupInformation.doSubjectLogin(UserGroupInformation.java:1837)
	... 39 more
Caused by: java.lang.SecurityException
	at javax.security.auth.login.LoginContext.invoke(LoginContext.java:841)
	... 47 more


FAILED:  junit.framework.TestSuite.org.apache.solr.core.HdfsDirectoryFactoryTest

Error Message:
failure to login: javax.security.auth.login.LoginException: Security Exception

Stack Trace:
org.apache.hadoop.security.KerberosAuthException: failure to login: javax.security.auth.login.LoginException: Security Exception
	at __randomizedtesting.SeedInfo.seed([2729AD008107EC2B]:0)
	at org.apache.hadoop.security.UserGroupInformation.doSubjectLogin(UserGroupInformation.java:1847)
	at org.apache.hadoop.security.UserGroupInformation.createLoginUser(UserGroupInformation.java:710)
	at org.apache.hadoop.security.UserGroupInformation.getLoginUser(UserGroupInformation.java:660)
	at org.apache.hadoop.security.UserGroupInformation.getCurrentUser(UserGroupInformation.java:571)
	at org.apache.hadoop.hdfs.server.name

[...truncated too long message...]

te_dt_t=Lucene84, string_s=PostingsFormat(name=MockRandom), boolean_b=PostingsFormat(name=LuceneVarGapDocFreqInterval), id=PostingsFormat(name=LuceneVarGapDocFreqInterval), int_i_t=TestBloomFilteredLucenePostings(BloomFilteringPostingsFormat(Lucene84)), string_sm=TestBloomFilteredLucenePostings(BloomFilteringPostingsFormat(Lucene84))}, docValues:{long_l_t=DocValuesFormat(name=Lucene80), int_im_p=DocValuesFormat(name=Asserting), double_d_t=DocValuesFormat(name=Direct), long_l_p=DocValuesFormat(name=Lucene80), long_lm_t=DocValuesFormat(name=Asserting), double_d_p=DocValuesFormat(name=Direct), long_lm_p=DocValuesFormat(name=Asserting), date_dtm_t=DocValuesFormat(name=Asserting), int_im_t=DocValuesFormat(name=Asserting), date_dt_p=DocValuesFormat(name=Lucene80), float_f_t=DocValuesFormat(name=Lucene80), date_dt_t=DocValuesFormat(name=Lucene80), float_f_p=DocValuesFormat(name=Lucene80), id=DocValuesFormat(name=Direct), double_dm_t=DocValuesFormat(name=Lucene80), float_fm_t=DocValuesFormat(name=Direct), double_dm_p=DocValuesFormat(name=Lucene80), float_fm_p=DocValuesFormat(name=Direct), boolean_bm=DocValuesFormat(name=Lucene80), date_dtm_p=DocValuesFormat(name=Asserting), string_s=DocValuesFormat(name=Asserting), int_i_p=DocValuesFormat(name=Lucene80), boolean_b=DocValuesFormat(name=Direct), int_i_t=DocValuesFormat(name=Lucene80), string_sm=DocValuesFormat(name=Lucene80)}, maxPointsInLeafNode=1532, maxMBSortInHeap=6.65023704986039, sim=Asserting(org.apache.lucene.search.similarities.AssertingSimilarity@1fc52bdc), locale=es-ES, timezone=Atlantic/Bermuda
   [junit4]   2> NOTE: Linux 4.4.0-112-generic amd64/Oracle Corporation 1.8.0_191 (64-bit)/cpus=4,threads=1,free=202356472,total=325058560
   [junit4]   2> NOTE: All tests run in this JVM: [LegacyQueryFacetTest, TopFunctionTest, CastingDoubleValueTest, ConcatFunctionTest, ConstantValueTest, LegacyFacetSortingTest, BooleanFieldsTest, CastingLongValueTest, RangeFacetTest, DivideFunctionTest, FillMissingFunctionTest, GTEFunctionTest, CastingAnalyticsValueTest, NoFacetTest, LongFieldsTest]
   [junit4]   2> NOTE: reproduce with: ant test  -Dtestcase=LongFieldsTest -Dtests.seed=9A10D700C18FA1E5 -Dtests.multiplier=2 -Dtests.slow=true -Dtests.locale=es-ES -Dtests.timezone=Atlantic/Bermuda -Dtests.asserts=true -Dtests.file.encoding=ISO-8859-1
   [junit4] ERROR   0.00s J2 | LongFieldsTest (suite) <<<
   [junit4]    > Throwable #1: junit.framework.AssertionFailedError: Clean up static fields (in @AfterClass?) and null them, your test still has references to classes of which the sizes cannot be measured due to security restrictions or Java 9 module encapsulation:
   [junit4]    >   - private static org.apache.solr.schema.IndexSchema org.apache.solr.analytics.function.field.AbstractAnalyticsFieldTest.indexSchema
   [junit4]    >   - private static org.apache.solr.search.SolrIndexSearcher org.apache.solr.analytics.function.field.AbstractAnalyticsFieldTest.searcher
   [junit4]    > 	at __randomizedtesting.SeedInfo.seed([9A10D700C18FA1E5]:0)
   [junit4]    > 	at java.lang.Thread.run(Thread.java:748)
   [junit4]    > Caused by: java.security.AccessControlException: access denied ("java.lang.RuntimePermission" "accessClassInPackage.sun.nio.fs")
   [junit4]    > 	at java.security.AccessControlContext.checkPermission(AccessControlContext.java:472)
   [junit4]    > 	at java.security.AccessController.checkPermission(AccessController.java:884)
   [junit4]    > 	at java.lang.SecurityManager.checkPermission(SecurityManager.java:549)
   [junit4]    > 	at java.lang.SecurityManager.checkPackageAccess(SecurityManager.java:1564)
   [junit4]    > 	at java.lang.Class.checkPackageAccess(Class.java:2372)
   [junit4]    > 	at java.lang.Class.checkMemberAccess(Class.java:2351)
   [junit4]    > 	at java.lang.Class.getDeclaredFields(Class.java:1915)
   [junit4]    > 	at java.security.AccessController.doPrivileged(Native Method)
   [junit4]    > 	... 10 more
   [junit4] Completed [46/78 (7!)] on J2 in 0.51s, 5 tests, 1 failure <<< FAILURES!

[...truncated 4 lines...]
   [junit4] Suite: org.apache.solr.analytics.function.field.StringFieldsTest
   [junit4]   2> NOTE: test params are: codec=HighCompressionCompressingStoredFields(storedFieldsFormat=CompressingStoredFieldsFormat(compressionMode=HIGH_COMPRESSION, chunkSize=10, maxDocsPerChunk=2, blockSize=710), termVectorsFormat=CompressingTermVectorsFormat(compressionMode=HIGH_COMPRESSION, chunkSize=10, blockSize=710)), sim=Asserting(org.apache.lucene.search.similarities.AssertingSimilarity@24bd4c7a), locale=fr-LU, timezone=Antarctica/Mawson
   [junit4]   2> NOTE: Linux 4.4.0-112-generic amd64/Oracle Corporation 1.8.0_191 (64-bit)/cpus=4,threads=1,free=235495008,total=333447168
   [junit4]   2> NOTE: All tests run in this JVM: [LegacyQueryFacetCloudTest, SubtractFunctionTest, CastingDoubleValueStreamTest, CeilingFunctionTest, CastingStringValueTest, LegacyAbstractAnalyticsFacetTest, AbstractAnalyticsFieldTest, CastingLongValueStreamTest, QueryFacetTest, DateParseFunctionTest, ExistsFunctionTest, FloorFunctionTest, LegacyRangeFacetTest, ExpressionFactoryTest, OverallAnalyticsTest, DateFieldsTest, DoubleFieldsTest, FloatFieldsTest, IntFieldsTest, StringFieldsTest]
   [junit4]   2> NOTE: reproduce with: ant test  -Dtestcase=StringFieldsTest -Dtests.seed=9A10D700C18FA1E5 -Dtests.multiplier=2 -Dtests.slow=true -Dtests.locale=fr-LU -Dtests.timezone=Antarctica/Mawson -Dtests.asserts=true -Dtests.file.encoding=ISO-8859-1
   [junit4] ERROR   0.00s J1 | StringFieldsTest (suite) <<<
   [junit4]    > Throwable #1: junit.framework.AssertionFailedError: Clean up static fields (in @AfterClass?) and null them, your test still has references to classes of which the sizes cannot be measured due to security restrictions or Java 9 module encapsulation:
   [junit4]    >   - private static org.apache.solr.schema.IndexSchema org.apache.solr.analytics.function.field.AbstractAnalyticsFieldTest.indexSchema
   [junit4]    >   - private static org.apache.solr.search.SolrIndexSearcher org.apache.solr.analytics.function.field.AbstractAnalyticsFieldTest.searcher
   [junit4]    > 	at __randomizedtesting.SeedInfo.seed([9A10D700C18FA1E5]:0)
   [junit4]    > 	at java.lang.Thread.run(Thread.java:748)
   [junit4]    > Caused by: java.security.AccessControlException: access denied ("java.lang.RuntimePermission" "accessClassInPackage.sun.nio.fs")
   [junit4]    > 	at java.security.AccessControlContext.checkPermission(AccessControlContext.java:472)
   [junit4]    > 	at java.security.AccessController.checkPermission(AccessController.java:884)
   [junit4]    > 	at java.lang.SecurityManager.checkPermission(SecurityManager.java:549)
   [junit4]    > 	at java.lang.SecurityManager.checkPackageAccess(SecurityManager.java:1564)
   [junit4]    > 	at java.lang.Class.checkPackageAccess(Class.java:2372)
   [junit4]    > 	at java.lang.Class.checkMemberAccess(Class.java:2351)
   [junit4]    > 	at java.lang.Class.getDeclaredFields(Class.java:1915)
   [junit4]    > 	at java.security.AccessController.doPrivileged(Native Method)
   [junit4]    > 	... 10 more
   [junit4] Completed [48/78 (8!)] on J1 in 0.50s, 3 tests, 1 failure <<< FAILURES!

[...truncated 5652 lines...]
   [junit4] Suite: org.apache.solr.prometheus.scraper.SolrStandaloneScraperTest
   [junit4]   1> 05:50:51.424 [SUITE-SolrStandaloneScraperTest-seed#[292121D03A449E0B]-worker] ERROR org.apache.solr.util.StartupLoggingUtils - Missing Java Option solr.log.dir. Logging may be missing or incomplete.
   [junit4]   2> NOTE: test params are: codec=Asserting(Lucene84): {}, docValues:{}, maxPointsInLeafNode=1758, maxMBSortInHeap=6.656778841888914, sim=Asserting(org.apache.lucene.search.similarities.AssertingSimilarity@598d08f3), locale=zh-CN, timezone=America/Thule
   [junit4]   2> NOTE: Linux 4.4.0-112-generic amd64/Oracle Corporation 1.8.0_191 (64-bit)/cpus=4,threads=1,free=262207728,total=303038464
   [junit4]   2> NOTE: All tests run in this JVM: [SolrStandaloneScraperTest]
   [junit4]   2> NOTE: reproduce with: ant test  -Dtestcase=SolrStandaloneScraperTest -Dtests.seed=292121D03A449E0B -Dtests.multiplier=2 -Dtests.slow=true -Dtests.locale=zh-CN -Dtests.timezone=America/Thule -Dtests.asserts=true -Dtests.file.encoding=UTF-8
   [junit4] ERROR   0.00s J2 | SolrStandaloneScraperTest (suite) <<<
   [junit4]    > Throwable #1: junit.framework.AssertionFailedError: Clean up static fields (in @AfterClass?) and null them, your test still has references to classes of which the sizes cannot be measured due to security restrictions or Java 9 module encapsulation:
   [junit4]    >   - private static org.apache.solr.prometheus.scraper.SolrStandaloneScraper org.apache.solr.prometheus.scraper.SolrStandaloneScraperTest.solrScraper
   [junit4]    >   - private static org.apache.solr.client.solrj.impl.HttpSolrClient org.apache.solr.prometheus.scraper.SolrStandaloneScraperTest.solrClient
   [junit4]    > 	at __randomizedtesting.SeedInfo.seed([292121D03A449E0B]:0)
   [junit4]    > 	at java.lang.Thread.run(Thread.java:748)
   [junit4]    > Caused by: java.security.AccessControlException: access denied ("java.lang.RuntimePermission" "accessClassInPackage.sun.security.ssl")
   [junit4]    > 	at java.security.AccessControlContext.checkPermission(AccessControlContext.java:472)
   [junit4]    > 	at java.security.AccessController.checkPermission(AccessController.java:884)
   [junit4]    > 	at java.lang.SecurityManager.checkPermission(SecurityManager.java:549)
   [junit4]    > 	at java.lang.SecurityManager.checkPackageAccess(SecurityManager.java:1564)
   [junit4]    > 	at java.lang.Class.checkPackageAccess(Class.java:2372)
   [junit4]    > 	at java.lang.Class.checkMemberAccess(Class.java:2351)
   [junit4]    > 	at java.lang.Class.getDeclaredFields(Class.java:1915)
   [junit4]    > 	at java.security.AccessController.doPrivileged(Native Method)
   [junit4]    > 	... 10 more
   [junit4] Completed [4/5 (1!)] on J2 in 11.03s, 5 tests, 1 failure <<< FAILURES!

[...truncated 43970 lines...]

Mime
View raw message