logging-log4net-dev mailing list archives

Site index · List index
Message view « Date » · « Thread »
Top « Date » · « Thread »
From Apache Jenkins Server <jenk...@builds.apache.org>
Subject Build failed in Jenkins: log4net-trunk-build #6
Date Wed, 07 Aug 2013 10:27:49 GMT
See <https://builds.apache.org/job/log4net-trunk-build/6/changes>

Changes:

[dpsenner] LOG4NET-342 fixed typos introduced with the prior commit

[dpsenner] LOG4NET-342 added a FAQ entry that describes how to check if the repository was configured and how one can enumerate the configuration messages

------------------------------------------
[...truncated 820 lines...]
      [csc] <https://builds.apache.org/job/log4net-trunk-build/ws/tests\src\Context\ThreadContextTest.cs(47,10)>: error CS0246: The type or namespace name 'Test' could not be found (are you missing a using directive or an assembly reference?)
      [csc] <https://builds.apache.org/job/log4net-trunk-build/ws/tests\src\Context\ThreadContextTest.cs(47,10)>: error CS0246: The type or namespace name 'TestAttribute' could not be found (are you missing a using directive or an assembly reference?)
      [csc] <https://builds.apache.org/job/log4net-trunk-build/ws/tests\src\Context\ThreadContextTest.cs(75,4)>: error CS0246: The type or namespace name 'Test' could not be found (are you missing a using directive or an assembly reference?)
      [csc] <https://builds.apache.org/job/log4net-trunk-build/ws/tests\src\Context\ThreadContextTest.cs(75,4)>: error CS0246: The type or namespace name 'TestAttribute' could not be found (are you missing a using directive or an assembly reference?)
      [csc] <https://builds.apache.org/job/log4net-trunk-build/ws/tests\src\Context\ThreadContextTest.cs(102,4)>: error CS0246: The type or namespace name 'Test' could not be found (are you missing a using directive or an assembly reference?)
      [csc] <https://builds.apache.org/job/log4net-trunk-build/ws/tests\src\Context\ThreadContextTest.cs(102,4)>: error CS0246: The type or namespace name 'TestAttribute' could not be found (are you missing a using directive or an assembly reference?)
      [csc] <https://builds.apache.org/job/log4net-trunk-build/ws/tests\src\Context\ThreadContextTest.cs(136,4)>: error CS0246: The type or namespace name 'Test' could not be found (are you missing a using directive or an assembly reference?)
      [csc] <https://builds.apache.org/job/log4net-trunk-build/ws/tests\src\Context\ThreadContextTest.cs(136,4)>: error CS0246: The type or namespace name 'TestAttribute' could not be found (are you missing a using directive or an assembly reference?)
      [csc] <https://builds.apache.org/job/log4net-trunk-build/ws/tests\src\Context\ThreadContextTest.cs(163,4)>: error CS0246: The type or namespace name 'Test' could not be found (are you missing a using directive or an assembly reference?)
      [csc] <https://builds.apache.org/job/log4net-trunk-build/ws/tests\src\Context\ThreadContextTest.cs(163,4)>: error CS0246: The type or namespace name 'TestAttribute' could not be found (are you missing a using directive or an assembly reference?)
      [csc] <https://builds.apache.org/job/log4net-trunk-build/ws/tests\src\Context\ThreadContextTest.cs(199,4)>: error CS0246: The type or namespace name 'Test' could not be found (are you missing a using directive or an assembly reference?)
      [csc] <https://builds.apache.org/job/log4net-trunk-build/ws/tests\src\Context\ThreadContextTest.cs(199,4)>: error CS0246: The type or namespace name 'TestAttribute' could not be found (are you missing a using directive or an assembly reference?)
      [csc] <https://builds.apache.org/job/log4net-trunk-build/ws/tests\src\Context\ThreadContextTest.cs(39,3)>: error CS0246: The type or namespace name 'TestFixture' could not be found (are you missing a using directive or an assembly reference?)
      [csc] <https://builds.apache.org/job/log4net-trunk-build/ws/tests\src\Context\ThreadContextTest.cs(39,3)>: error CS0246: The type or namespace name 'TestFixtureAttribute' could not be found (are you missing a using directive or an assembly reference?)
      [csc] <https://builds.apache.org/job/log4net-trunk-build/ws/tests\src\Core\EvaluatorTest.cs(37,4)>: error CS0246: The type or namespace name 'SetUp' could not be found (are you missing a using directive or an assembly reference?)
      [csc] <https://builds.apache.org/job/log4net-trunk-build/ws/tests\src\Core\EvaluatorTest.cs(37,4)>: error CS0246: The type or namespace name 'SetUpAttribute' could not be found (are you missing a using directive or an assembly reference?)
      [csc] <https://builds.apache.org/job/log4net-trunk-build/ws/tests\src\Core\EvaluatorTest.cs(56,4)>: error CS0246: The type or namespace name 'Test' could not be found (are you missing a using directive or an assembly reference?)
      [csc] <https://builds.apache.org/job/log4net-trunk-build/ws/tests\src\Core\EvaluatorTest.cs(56,4)>: error CS0246: The type or namespace name 'TestAttribute' could not be found (are you missing a using directive or an assembly reference?)
      [csc] <https://builds.apache.org/job/log4net-trunk-build/ws/tests\src\Core\EvaluatorTest.cs(73,4)>: error CS0246: The type or namespace name 'Test' could not be found (are you missing a using directive or an assembly reference?)
      [csc] <https://builds.apache.org/job/log4net-trunk-build/ws/tests\src\Core\EvaluatorTest.cs(73,4)>: error CS0246: The type or namespace name 'TestAttribute' could not be found (are you missing a using directive or an assembly reference?)
      [csc] <https://builds.apache.org/job/log4net-trunk-build/ws/tests\src\Core\EvaluatorTest.cs(90,4)>: error CS0246: The type or namespace name 'Test' could not be found (are you missing a using directive or an assembly reference?)
      [csc] <https://builds.apache.org/job/log4net-trunk-build/ws/tests\src\Core\EvaluatorTest.cs(90,4)>: error CS0246: The type or namespace name 'TestAttribute' could not be found (are you missing a using directive or an assembly reference?)
      [csc] <https://builds.apache.org/job/log4net-trunk-build/ws/tests\src\Core\EvaluatorTest.cs(107,4)>: error CS0246: The type or namespace name 'Test' could not be found (are you missing a using directive or an assembly reference?)
      [csc] <https://builds.apache.org/job/log4net-trunk-build/ws/tests\src\Core\EvaluatorTest.cs(107,4)>: error CS0246: The type or namespace name 'TestAttribute' could not be found (are you missing a using directive or an assembly reference?)
      [csc] <https://builds.apache.org/job/log4net-trunk-build/ws/tests\src\Core\EvaluatorTest.cs(124,4)>: error CS0246: The type or namespace name 'Test' could not be found (are you missing a using directive or an assembly reference?)
      [csc] <https://builds.apache.org/job/log4net-trunk-build/ws/tests\src\Core\EvaluatorTest.cs(124,4)>: error CS0246: The type or namespace name 'TestAttribute' could not be found (are you missing a using directive or an assembly reference?)
      [csc] <https://builds.apache.org/job/log4net-trunk-build/ws/tests\src\Core\EvaluatorTest.cs(30,3)>: error CS0246: The type or namespace name 'TestFixture' could not be found (are you missing a using directive or an assembly reference?)
      [csc] <https://builds.apache.org/job/log4net-trunk-build/ws/tests\src\Core\EvaluatorTest.cs(30,3)>: error CS0246: The type or namespace name 'TestFixtureAttribute' could not be found (are you missing a using directive or an assembly reference?)
      [csc] <https://builds.apache.org/job/log4net-trunk-build/ws/tests\src\Core\FixingTest.cs(36,10)>: error CS0246: The type or namespace name 'TestFixtureSetUp' could not be found (are you missing a using directive or an assembly reference?)
      [csc] <https://builds.apache.org/job/log4net-trunk-build/ws/tests\src\Core\FixingTest.cs(36,10)>: error CS0246: The type or namespace name 'TestFixtureSetUpAttribute' could not be found (are you missing a using directive or an assembly reference?)
      [csc] <https://builds.apache.org/job/log4net-trunk-build/ws/tests\src\Core\FixingTest.cs(60,4)>: error CS0246: The type or namespace name 'Test' could not be found (are you missing a using directive or an assembly reference?)
      [csc] <https://builds.apache.org/job/log4net-trunk-build/ws/tests\src\Core\FixingTest.cs(60,4)>: error CS0246: The type or namespace name 'TestAttribute' could not be found (are you missing a using directive or an assembly reference?)
      [csc] <https://builds.apache.org/job/log4net-trunk-build/ws/tests\src\Core\FixingTest.cs(79,4)>: error CS0246: The type or namespace name 'Test' could not be found (are you missing a using directive or an assembly reference?)
      [csc] <https://builds.apache.org/job/log4net-trunk-build/ws/tests\src\Core\FixingTest.cs(79,4)>: error CS0246: The type or namespace name 'TestAttribute' could not be found (are you missing a using directive or an assembly reference?)
      [csc] <https://builds.apache.org/job/log4net-trunk-build/ws/tests\src\Core\FixingTest.cs(100,4)>: error CS0246: The type or namespace name 'Test' could not be found (are you missing a using directive or an assembly reference?)
      [csc] <https://builds.apache.org/job/log4net-trunk-build/ws/tests\src\Core\FixingTest.cs(100,4)>: error CS0246: The type or namespace name 'TestAttribute' could not be found (are you missing a using directive or an assembly reference?)
      [csc] <https://builds.apache.org/job/log4net-trunk-build/ws/tests\src\Core\FixingTest.cs(31,3)>: error CS0246: The type or namespace name 'TestFixture' could not be found (are you missing a using directive or an assembly reference?)
      [csc] <https://builds.apache.org/job/log4net-trunk-build/ws/tests\src\Core\FixingTest.cs(31,3)>: error CS0246: The type or namespace name 'TestFixtureAttribute' could not be found (are you missing a using directive or an assembly reference?)
      [csc] <https://builds.apache.org/job/log4net-trunk-build/ws/tests\src\Core\ShutdownTest.cs(39,4)>: error CS0246: The type or namespace name 'Test' could not be found (are you missing a using directive or an assembly reference?)
      [csc] <https://builds.apache.org/job/log4net-trunk-build/ws/tests\src\Core\ShutdownTest.cs(39,4)>: error CS0246: The type or namespace name 'TestAttribute' could not be found (are you missing a using directive or an assembly reference?)
      [csc] <https://builds.apache.org/job/log4net-trunk-build/ws/tests\src\Core\ShutdownTest.cs(33,3)>: error CS0246: The type or namespace name 'TestFixture' could not be found (are you missing a using directive or an assembly reference?)
      [csc] <https://builds.apache.org/job/log4net-trunk-build/ws/tests\src\Core\ShutdownTest.cs(33,3)>: error CS0246: The type or namespace name 'TestFixtureAttribute' could not be found (are you missing a using directive or an assembly reference?)
      [csc] <https://builds.apache.org/job/log4net-trunk-build/ws/tests\src\Core\StringFormatTest.cs(43,4)>: error CS0246: The type or namespace name 'Test' could not be found (are you missing a using directive or an assembly reference?)
      [csc] <https://builds.apache.org/job/log4net-trunk-build/ws/tests\src\Core\StringFormatTest.cs(43,4)>: error CS0246: The type or namespace name 'TestAttribute' could not be found (are you missing a using directive or an assembly reference?)
      [csc] <https://builds.apache.org/job/log4net-trunk-build/ws/tests\src\Core\StringFormatTest.cs(100,4)>: error CS0246: The type or namespace name 'Test' could not be found (are you missing a using directive or an assembly reference?)
      [csc] <https://builds.apache.org/job/log4net-trunk-build/ws/tests\src\Core\StringFormatTest.cs(100,4)>: error CS0246: The type or namespace name 'TestAttribute' could not be found (are you missing a using directive or an assembly reference?)
      [csc] <https://builds.apache.org/job/log4net-trunk-build/ws/tests\src\Core\StringFormatTest.cs(158,4)>: error CS0246: The type or namespace name 'Test' could not be found (are you missing a using directive or an assembly reference?)
      [csc] <https://builds.apache.org/job/log4net-trunk-build/ws/tests\src\Core\StringFormatTest.cs(158,4)>: error CS0246: The type or namespace name 'TestAttribute' could not be found (are you missing a using directive or an assembly reference?)
      [csc] <https://builds.apache.org/job/log4net-trunk-build/ws/tests\src\Core\StringFormatTest.cs(218,4)>: error CS0246: The type or namespace name 'Test' could not be found (are you missing a using directive or an assembly reference?)
      [csc] <https://builds.apache.org/job/log4net-trunk-build/ws/tests\src\Core\StringFormatTest.cs(218,4)>: error CS0246: The type or namespace name 'TestAttribute' could not be found (are you missing a using directive or an assembly reference?)
      [csc] <https://builds.apache.org/job/log4net-trunk-build/ws/tests\src\Core\StringFormatTest.cs(276,4)>: error CS0246: The type or namespace name 'Test' could not be found (are you missing a using directive or an assembly reference?)
      [csc] <https://builds.apache.org/job/log4net-trunk-build/ws/tests\src\Core\StringFormatTest.cs(276,4)>: error CS0246: The type or namespace name 'TestAttribute' could not be found (are you missing a using directive or an assembly reference?)
      [csc] <https://builds.apache.org/job/log4net-trunk-build/ws/tests\src\Core\StringFormatTest.cs(336,4)>: error CS0246: The type or namespace name 'Test' could not be found (are you missing a using directive or an assembly reference?)
      [csc] <https://builds.apache.org/job/log4net-trunk-build/ws/tests\src\Core\StringFormatTest.cs(336,4)>: error CS0246: The type or namespace name 'TestAttribute' could not be found (are you missing a using directive or an assembly reference?)
      [csc] <https://builds.apache.org/job/log4net-trunk-build/ws/tests\src\Core\StringFormatTest.cs(394,4)>: error CS0246: The type or namespace name 'Test' could not be found (are you missing a using directive or an assembly reference?)
      [csc] <https://builds.apache.org/job/log4net-trunk-build/ws/tests\src\Core\StringFormatTest.cs(394,4)>: error CS0246: The type or namespace name 'TestAttribute' could not be found (are you missing a using directive or an assembly reference?)
      [csc] <https://builds.apache.org/job/log4net-trunk-build/ws/tests\src\Core\StringFormatTest.cs(454,4)>: error CS0246: The type or namespace name 'Test' could not be found (are you missing a using directive or an assembly reference?)
      [csc] <https://builds.apache.org/job/log4net-trunk-build/ws/tests\src\Core\StringFormatTest.cs(454,4)>: error CS0246: The type or namespace name 'TestAttribute' could not be found (are you missing a using directive or an assembly reference?)
      [csc] <https://builds.apache.org/job/log4net-trunk-build/ws/tests\src\Core\StringFormatTest.cs(512,4)>: error CS0246: The type or namespace name 'Test' could not be found (are you missing a using directive or an assembly reference?)
      [csc] <https://builds.apache.org/job/log4net-trunk-build/ws/tests\src\Core\StringFormatTest.cs(512,4)>: error CS0246: The type or namespace name 'TestAttribute' could not be found (are you missing a using directive or an assembly reference?)
      [csc] <https://builds.apache.org/job/log4net-trunk-build/ws/tests\src\Core\StringFormatTest.cs(572,4)>: error CS0246: The type or namespace name 'Test' could not be found (are you missing a using directive or an assembly reference?)
      [csc] <https://builds.apache.org/job/log4net-trunk-build/ws/tests\src\Core\StringFormatTest.cs(572,4)>: error CS0246: The type or namespace name 'TestAttribute' could not be found (are you missing a using directive or an assembly reference?)
      [csc] <https://builds.apache.org/job/log4net-trunk-build/ws/tests\src\Core\StringFormatTest.cs(630,4)>: error CS0246: The type or namespace name 'Test' could not be found (are you missing a using directive or an assembly reference?)
      [csc] <https://builds.apache.org/job/log4net-trunk-build/ws/tests\src\Core\StringFormatTest.cs(630,4)>: error CS0246: The type or namespace name 'TestAttribute' could not be found (are you missing a using directive or an assembly reference?)
      [csc] <https://builds.apache.org/job/log4net-trunk-build/ws/tests\src\Core\StringFormatTest.cs(40,3)>: error CS0246: The type or namespace name 'TestFixture' could not be found (are you missing a using directive or an assembly reference?)
      [csc] <https://builds.apache.org/job/log4net-trunk-build/ws/tests\src\Core\StringFormatTest.cs(40,3)>: error CS0246: The type or namespace name 'TestFixtureAttribute' could not be found (are you missing a using directive or an assembly reference?)
      [csc] <https://builds.apache.org/job/log4net-trunk-build/ws/tests\src\DateFormatter\AbsoluteTimeDateFormatterTest.cs(33,10)>: error CS0246: The type or namespace name 'TearDown' could not be found (are you missing a using directive or an assembly reference?)
      [csc] <https://builds.apache.org/job/log4net-trunk-build/ws/tests\src\DateFormatter\AbsoluteTimeDateFormatterTest.cs(33,10)>: error CS0246: The type or namespace name 'TearDownAttribute' could not be found (are you missing a using directive or an assembly reference?)
      [csc] <https://builds.apache.org/job/log4net-trunk-build/ws/tests\src\DateFormatter\AbsoluteTimeDateFormatterTest.cs(39,10)>: error CS0246: The type or namespace name 'Test' could not be found (are you missing a using directive or an assembly reference?)
      [csc] <https://builds.apache.org/job/log4net-trunk-build/ws/tests\src\DateFormatter\AbsoluteTimeDateFormatterTest.cs(39,10)>: error CS0246: The type or namespace name 'TestAttribute' could not be found (are you missing a using directive or an assembly reference?)
      [csc] <https://builds.apache.org/job/log4net-trunk-build/ws/tests\src\DateFormatter\AbsoluteTimeDateFormatterTest.cs(51,10)>: error CS0246: The type or namespace name 'Test' could not be found (are you missing a using directive or an assembly reference?)
      [csc] <https://builds.apache.org/job/log4net-trunk-build/ws/tests\src\DateFormatter\AbsoluteTimeDateFormatterTest.cs(51,10)>: error CS0246: The type or namespace name 'TestAttribute' could not be found (are you missing a using directive or an assembly reference?)
      [csc] <https://builds.apache.org/job/log4net-trunk-build/ws/tests\src\DateFormatter\AbsoluteTimeDateFormatterTest.cs(64,10)>: error CS0246: The type or namespace name 'Test' could not be found (are you missing a using directive or an assembly reference?)
      [csc] <https://builds.apache.org/job/log4net-trunk-build/ws/tests\src\DateFormatter\AbsoluteTimeDateFormatterTest.cs(64,10)>: error CS0246: The type or namespace name 'TestAttribute' could not be found (are you missing a using directive or an assembly reference?)
      [csc] <https://builds.apache.org/job/log4net-trunk-build/ws/tests\src\DateFormatter\AbsoluteTimeDateFormatterTest.cs(77,10)>: error CS0246: The type or namespace name 'Test' could not be found (are you missing a using directive or an assembly reference?)
      [csc] <https://builds.apache.org/job/log4net-trunk-build/ws/tests\src\DateFormatter\AbsoluteTimeDateFormatterTest.cs(77,10)>: error CS0246: The type or namespace name 'TestAttribute' could not be found (are you missing a using directive or an assembly reference?)
      [csc] <https://builds.apache.org/job/log4net-trunk-build/ws/tests\src\DateFormatter\AbsoluteTimeDateFormatterTest.cs(29,6)>: error CS0246: The type or namespace name 'TestFixture' could not be found (are you missing a using directive or an assembly reference?)
      [csc] <https://builds.apache.org/job/log4net-trunk-build/ws/tests\src\DateFormatter\AbsoluteTimeDateFormatterTest.cs(29,6)>: error CS0246: The type or namespace name 'TestFixtureAttribute' could not be found (are you missing a using directive or an assembly reference?)
      [csc] <https://builds.apache.org/job/log4net-trunk-build/ws/tests\src\Filter\FilterTest.cs(38,10)>: error CS0246: The type or namespace name 'Test' could not be found (are you missing a using directive or an assembly reference?)
      [csc] <https://builds.apache.org/job/log4net-trunk-build/ws/tests\src\Filter\FilterTest.cs(38,10)>: error CS0246: The type or namespace name 'TestAttribute' could not be found (are you missing a using directive or an assembly reference?)
      [csc] <https://builds.apache.org/job/log4net-trunk-build/ws/tests\src\Filter\FilterTest.cs(35,6)>: error CS0246: The type or namespace name 'TestFixture' could not be found (are you missing a using directive or an assembly reference?)
      [csc] <https://builds.apache.org/job/log4net-trunk-build/ws/tests\src\Filter\FilterTest.cs(35,6)>: error CS0246: The type or namespace name 'TestFixtureAttribute' could not be found (are you missing a using directive or an assembly reference?)
      [csc] <https://builds.apache.org/job/log4net-trunk-build/ws/tests\src\Hierarchy\Hierarchy.cs(36,10)>: error CS0246: The type or namespace name 'Test' could not be found (are you missing a using directive or an assembly reference?)
      [csc] <https://builds.apache.org/job/log4net-trunk-build/ws/tests\src\Hierarchy\Hierarchy.cs(36,10)>: error CS0246: The type or namespace name 'TestAttribute' could not be found (are you missing a using directive or an assembly reference?)
      [csc] <https://builds.apache.org/job/log4net-trunk-build/ws/tests\src\Hierarchy\Hierarchy.cs(63,10)>: error CS0246: The type or namespace name 'Test' could not be found (are you missing a using directive or an assembly reference?)
      [csc] <https://builds.apache.org/job/log4net-trunk-build/ws/tests\src\Hierarchy\Hierarchy.cs(63,10)>: error CS0246: The type or namespace name 'TestAttribute' could not be found (are you missing a using directive or an assembly reference?)
      [csc] <https://builds.apache.org/job/log4net-trunk-build/ws/tests\src\Hierarchy\Hierarchy.cs(82,10)>: error CS0246: The type or namespace name 'Test' could not be found (are you missing a using directive or an assembly reference?)
      [csc] <https://builds.apache.org/job/log4net-trunk-build/ws/tests\src\Hierarchy\Hierarchy.cs(82,10)>: error CS0246: The type or namespace name 'TestAttribute' could not be found (are you missing a using directive or an assembly reference?)
      [csc] <https://builds.apache.org/job/log4net-trunk-build/ws/tests\src\Hierarchy\Hierarchy.cs(97,10)>: error CS0246: The type or namespace name 'Test' could not be found (are you missing a using directive or an assembly reference?)
      [csc] <https://builds.apache.org/job/log4net-trunk-build/ws/tests\src\Hierarchy\Hierarchy.cs(97,10)>: error CS0246: The type or namespace name 'TestAttribute' could not be found (are you missing a using directive or an assembly reference?)
      [csc] <https://builds.apache.org/job/log4net-trunk-build/ws/tests\src\Hierarchy\Hierarchy.cs(120,10)>: error CS0246: The type or namespace name 'Test' could not be found (are you missing a using directive or an assembly reference?)
      [csc] <https://builds.apache.org/job/log4net-trunk-build/ws/tests\src\Hierarchy\Hierarchy.cs(120,10)>: error CS0246: The type or namespace name 'TestAttribute' could not be found (are you missing a using directive or an assembly reference?)
      [csc] <https://builds.apache.org/job/log4net-trunk-build/ws/tests\src\Hierarchy\Hierarchy.cs(142,10)>: error CS0246: The type or namespace name 'Test' could not be found (are you missing a using directive or an assembly reference?)
      [csc] <https://builds.apache.org/job/log4net-trunk-build/ws/tests\src\Hierarchy\Hierarchy.cs(142,10)>: error CS0246: The type or namespace name 'TestAttribute' could not be found (are you missing a using directive or an assembly reference?)
      [csc] <https://builds.apache.org/job/log4net-trunk-build/ws/tests\src\Hierarchy\Hierarchy.cs(33,6)>: error CS0246: The type or namespace name 'TestFixture' could not be found (are you missing a using directive or an assembly reference?)
      [csc] <https://builds.apache.org/job/log4net-trunk-build/ws/tests\src\Hierarchy\Hierarchy.cs(33,6)>: error CS0246: The type or namespace name 'TestFixtureAttribute' could not be found (are you missing a using directive or an assembly reference?)
      [csc] <https://builds.apache.org/job/log4net-trunk-build/ws/tests\src\Hierarchy\Logger.cs(48,4)>: error CS0118: 'log4net.Tests.Hierarchy.LoggerTest.SetUp()' is a 'method' but is used like a 'type'
      [csc] <https://builds.apache.org/job/log4net-trunk-build/ws/tests\src\Hierarchy\Logger.cs(48,4)>: error CS0246: The type or namespace name 'SetUpAttribute' could not be found (are you missing a using directive or an assembly reference?)
      [csc] <https://builds.apache.org/job/log4net-trunk-build/ws/tests\src\Hierarchy\Logger.cs(56,4)>: error CS0118: 'log4net.Tests.Hierarchy.LoggerTest.TearDown()' is a 'method' but is used like a 'type'
      [csc] <https://builds.apache.org/job/log4net-trunk-build/ws/tests\src\Hierarchy\Logger.cs(56,4)>: error CS0246: The type or namespace name 'TearDownAttribute' could not be found (are you missing a using directive or an assembly reference?)
      [csc] <https://builds.apache.org/job/log4net-trunk-build/ws/tests\src\Hierarchy\Logger.cs(68,4)>: error CS0246: The type or namespace name 'Test' could not be found (are you missing a using directive or an assembly reference?)
      [csc] <https://builds.apache.org/job/log4net-trunk-build/ws/tests\src\Hierarchy\Logger.cs(68,4)>: error CS0246: The type or namespace name 'TestAttribute' could not be found (are you missing a using directive or an assembly reference?)
      [csc] <https://builds.apache.org/job/log4net-trunk-build/ws/tests\src\Hierarchy\Logger.cs(86,4)>: error CS0246: The type or namespace name 'Test' could not be found (are you missing a using directive or an assembly reference?)
      [csc] <https://builds.apache.org/job/log4net-trunk-build/ws/tests\src\Hierarchy\Logger.cs(86,4)>: error CS0246: The type or namespace name 'TestAttribute' could not be found (are you missing a using directive or an assembly reference?)
      [csc] <https://builds.apache.org/job/log4net-trunk-build/ws/tests\src\Hierarchy\Logger.cs(119,4)>: error CS0246: The type or namespace name 'Test' could not be found (are you missing a using directive or an assembly reference?)
      [csc] <https://builds.apache.org/job/log4net-trunk-build/ws/tests\src\Hierarchy\Logger.cs(119,4)>: error CS0246: The type or namespace name 'TestAttribute' could not be found (are you missing a using directive or an assembly reference?)
      [csc] <https://builds.apache.org/job/log4net-trunk-build/ws/tests\src\Hierarchy\Logger.cs(143,4)>: error CS0246: The type or namespace name 'Test' could not be found (are you missing a using directive or an assembly reference?)
      [csc] <https://builds.apache.org/job/log4net-trunk-build/ws/tests\src\Hierarchy\Logger.cs(143,4)>: error CS0246: The type or namespace name 'TestAttribute' could not be found (are you missing a using directive or an assembly reference?)
      [csc] <https://builds.apache.org/job/log4net-trunk-build/ws/tests\src\Hierarchy\Logger.cs(177,4)>: error CS0246: The type or namespace name 'Test' could not be found (are you missing a using directive or an assembly reference?)
      [csc] <https://builds.apache.org/job/log4net-trunk-build/ws/tests\src\Hierarchy\Logger.cs(177,4)>: error CS0246: The type or namespace name 'TestAttribute' could not be found (are you missing a using directive or an assembly reference?)
      [csc] <https://builds.apache.org/job/log4net-trunk-build/ws/tests\src\Hierarchy\Logger.cs(219,4)>: error CS0246: The type or namespace name 'Test' could not be found (are you missing a using directive or an assembly reference?)
      [csc] <https://builds.apache.org/job/log4net-trunk-build/ws/tests\src\Hierarchy\Logger.cs(219,4)>: error CS0246: The type or namespace name 'TestAttribute' could not be found (are you missing a using directive or an assembly reference?)
      [csc] <https://builds.apache.org/job/log4net-trunk-build/ws/tests\src\Hierarchy\Logger.cs(271,4)>: error CS0246: The type or namespace name 'Test' could not be found (are you missing a using directive or an assembly reference?)
      [csc] <https://builds.apache.org/job/log4net-trunk-build/ws/tests\src\Hierarchy\Logger.cs(271,4)>: error CS0246: The type or namespace name 'TestAttribute' could not be found (are you missing a using directive or an assembly reference?)
      [csc] <https://builds.apache.org/job/log4net-trunk-build/ws/tests\src\Hierarchy\Logger.cs(292,4)>: error CS0246: The type or namespace name 'Test' could not be found (are you missing a using directive or an assembly reference?)
      [csc] <https://builds.apache.org/job/log4net-trunk-build/ws/tests\src\Hierarchy\Logger.cs(292,4)>: error CS0246: The type or namespace name 'TestAttribute' could not be found (are you missing a using directive or an assembly reference?)
      [csc] <https://builds.apache.org/job/log4net-trunk-build/ws/tests\src\Hierarchy\Logger.cs(36,3)>: error CS0246: The type or namespace name 'TestFixture' could not be found (are you missing a using directive or an assembly reference?)
      [csc] <https://builds.apache.org/job/log4net-trunk-build/ws/tests\src\Hierarchy\Logger.cs(36,3)>: error CS0246: The type or namespace name 'TestFixtureAttribute' could not be found (are you missing a using directive or an assembly reference?)
      [csc] <https://builds.apache.org/job/log4net-trunk-build/ws/tests\src\Layout\PatternLayoutTest.cs(45,10)>: error CS0118: 'log4net.Tests.Layout.PatternLayoutTest.TearDown()' is a 'method' but is used like a 'type'
      [csc] <https://builds.apache.org/job/log4net-trunk-build/ws/tests\src\Layout\PatternLayoutTest.cs(45,10)>: error CS0246: The type or namespace name 'TearDownAttribute' could not be found (are you missing a using directive or an assembly reference?)
      [csc] <https://builds.apache.org/job/log4net-trunk-build/ws/tests\src\Layout\PatternLayoutTest.cs(58,10)>: error CS0246: The type or namespace name 'Test' could not be found (are you missing a using directive or an assembly reference?)
      [csc] <https://builds.apache.org/job/log4net-trunk-build/ws/tests\src\Layout\PatternLayoutTest.cs(58,10)>: error CS0246: The type or namespace name 'TestAttribute' could not be found (are you missing a using directive or an assembly reference?)
      [csc] <https://builds.apache.org/job/log4net-trunk-build/ws/tests\src\Layout\PatternLayoutTest.cs(86,10)>: error CS0246: The type or namespace name 'Test' could not be found (are you missing a using directive or an assembly reference?)
      [csc] <https://builds.apache.org/job/log4net-trunk-build/ws/tests\src\Layout\PatternLayoutTest.cs(86,10)>: error CS0246: The type or namespace name 'TestAttribute' could not be found (are you missing a using directive or an assembly reference?)
      [csc] <https://builds.apache.org/job/log4net-trunk-build/ws/tests\src\Layout\PatternLayoutTest.cs(106,4)>: error CS0246: The type or namespace name 'Test' could not be found (are you missing a using directive or an assembly reference?)
      [csc] <https://builds.apache.org/job/log4net-trunk-build/ws/tests\src\Layout\PatternLayoutTest.cs(106,4)>: error CS0246: The type or namespace name 'TestAttribute' could not be found (are you missing a using directive or an assembly reference?)
      [csc] <https://builds.apache.org/job/log4net-trunk-build/ws/tests\src\Layout\PatternLayoutTest.cs(134,4)>: error CS0246: The type or namespace name 'Test' could not be found (are you missing a using directive or an assembly reference?)
      [csc] <https://builds.apache.org/job/log4net-trunk-build/ws/tests\src\Layout\PatternLayoutTest.cs(134,4)>: error CS0246: The type or namespace name 'TestAttribute' could not be found (are you missing a using directive or an assembly reference?)
      [csc] <https://builds.apache.org/job/log4net-trunk-build/ws/tests\src\Layout\PatternLayoutTest.cs(156,10)>: error CS0246: The type or namespace name 'Test' could not be found (are you missing a using directive or an assembly reference?)
      [csc] <https://builds.apache.org/job/log4net-trunk-build/ws/tests\src\Layout\PatternLayoutTest.cs(156,10)>: error CS0246: The type or namespace name 'TestAttribute' could not be found (are you missing a using directive or an assembly reference?)
      [csc] <https://builds.apache.org/job/log4net-trunk-build/ws/tests\src\Layout\PatternLayoutTest.cs(203,10)>: error CS0246: The type or namespace name 'Test' could not be found (are you missing a using directive or an assembly reference?)
      [csc] <https://builds.apache.org/job/log4net-trunk-build/ws/tests\src\Layout\PatternLayoutTest.cs(203,10)>: error CS0246: The type or namespace name 'TestAttribute' could not be found (are you missing a using directive or an assembly reference?)
      [csc] <https://builds.apache.org/job/log4net-trunk-build/ws/tests\src\Layout\PatternLayoutTest.cs(250,10)>: error CS0246: The type or namespace name 'Test' could not be found (are you missing a using directive or an assembly reference?)
      [csc] <https://builds.apache.org/job/log4net-trunk-build/ws/tests\src\Layout\PatternLayoutTest.cs(250,10)>: error CS0246: The type or namespace name 'TestAttribute' could not be found (are you missing a using directive or an assembly reference?)
      [csc] <https://builds.apache.org/job/log4net-trunk-build/ws/tests\src\Layout\PatternLayoutTest.cs(313,4)>: error CS0246: The type or namespace name 'Test' could not be found (are you missing a using directive or an assembly reference?)
      [csc] <https://builds.apache.org/job/log4net-trunk-build/ws/tests\src\Layout\PatternLayoutTest.cs(313,4)>: error CS0246: The type or namespace name 'TestAttribute' could not be found (are you missing a using directive or an assembly reference?)
      [csc] <https://builds.apache.org/job/log4net-trunk-build/ws/tests\src\Layout\PatternLayoutTest.cs(41,3)>: error CS0246: The type or namespace name 'TestFixture' could not be found (are you missing a using directive or an assembly reference?)
      [csc] <https://builds.apache.org/job/log4net-trunk-build/ws/tests\src\Layout\PatternLayoutTest.cs(41,3)>: error CS0246: The type or namespace name 'TestFixtureAttribute' could not be found (are you missing a using directive or an assembly reference?)
      [csc] <https://builds.apache.org/job/log4net-trunk-build/ws/tests\src\Layout\XmlLayoutTest.cs(83,4)>: error CS0246: The type or namespace name 'Test' could not be found (are you missing a using directive or an assembly reference?)
      [csc] <https://builds.apache.org/job/log4net-trunk-build/ws/tests\src\Layout\XmlLayoutTest.cs(83,4)>: error CS0246: The type or namespace name 'TestAttribute' could not be found (are you missing a using directive or an assembly reference?)
      [csc] <https://builds.apache.org/job/log4net-trunk-build/ws/tests\src\Layout\XmlLayoutTest.cs(97,4)>: error CS0246: The type or namespace name 'Test' could not be found (are you missing a using directive or an assembly reference?)
      [csc] <https://builds.apache.org/job/log4net-trunk-build/ws/tests\src\Layout\XmlLayoutTest.cs(97,4)>: error CS0246: The type or namespace name 'TestAttribute' could not be found (are you missing a using directive or an assembly reference?)
      [csc] <https://builds.apache.org/job/log4net-trunk-build/ws/tests\src\Layout\XmlLayoutTest.cs(113,4)>: error CS0246: The type or namespace name 'Test' could not be found (are you missing a using directive or an assembly reference?)
      [csc] <https://builds.apache.org/job/log4net-trunk-build/ws/tests\src\Layout\XmlLayoutTest.cs(113,4)>: error CS0246: The type or namespace name 'TestAttribute' could not be found (are you missing a using directive or an assembly reference?)
      [csc] <https://builds.apache.org/job/log4net-trunk-build/ws/tests\src\Layout\XmlLayoutTest.cs(130,4)>: error CS0246: The type or namespace name 'Test' could not be found (are you missing a using directive or an assembly reference?)
      [csc] <https://builds.apache.org/job/log4net-trunk-build/ws/tests\src\Layout\XmlLayoutTest.cs(130,4)>: error CS0246: The type or namespace name 'TestAttribute' could not be found (are you missing a using directive or an assembly reference?)
      [csc] <https://builds.apache.org/job/log4net-trunk-build/ws/tests\src\Layout\XmlLayoutTest.cs(147,4)>: error CS0246: The type or namespace name 'Test' could not be found (are you missing a using directive or an assembly reference?)
      [csc] <https://builds.apache.org/job/log4net-trunk-build/ws/tests\src\Layout\XmlLayoutTest.cs(147,4)>: error CS0246: The type or namespace name 'TestAttribute' could not be found (are you missing a using directive or an assembly reference?)
      [csc] <https://builds.apache.org/job/log4net-trunk-build/ws/tests\src\Layout\XmlLayoutTest.cs(164,4)>: error CS0246: The type or namespace name 'Test' could not be found (are you missing a using directive or an assembly reference?)
      [csc] <https://builds.apache.org/job/log4net-trunk-build/ws/tests\src\Layout\XmlLayoutTest.cs(164,4)>: error CS0246: The type or namespace name 'TestAttribute' could not be found (are you missing a using directive or an assembly reference?)
      [csc] <https://builds.apache.org/job/log4net-trunk-build/ws/tests\src\Layout\XmlLayoutTest.cs(179,4)>: error CS0246: The type or namespace name 'Test' could not be found (are you missing a using directive or an assembly reference?)
      [csc] <https://builds.apache.org/job/log4net-trunk-build/ws/tests\src\Layout\XmlLayoutTest.cs(179,4)>: error CS0246: The type or namespace name 'TestAttribute' could not be found (are you missing a using directive or an assembly reference?)
      [csc] <https://builds.apache.org/job/log4net-trunk-build/ws/tests\src\Layout\XmlLayoutTest.cs(200,4)>: error CS0246: The type or namespace name 'Test' could not be found (are you missing a using directive or an assembly reference?)
      [csc] <https://builds.apache.org/job/log4net-trunk-build/ws/tests\src\Layout\XmlLayoutTest.cs(200,4)>: error CS0246: The type or namespace name 'TestAttribute' could not be found (are you missing a using directive or an assembly reference?)
      [csc] <https://builds.apache.org/job/log4net-trunk-build/ws/tests\src\Layout\XmlLayoutTest.cs(222,4)>: error CS0246: The type or namespace name 'Test' could not be found (are you missing a using directive or an assembly reference?)
      [csc] <https://builds.apache.org/job/log4net-trunk-build/ws/tests\src\Layout\XmlLayoutTest.cs(222,4)>: error CS0246: The type or namespace name 'TestAttribute' could not be found (are you missing a using directive or an assembly reference?)
      [csc] <https://builds.apache.org/job/log4net-trunk-build/ws/tests\src\Layout\XmlLayoutTest.cs(243,4)>: error CS0246: The type or namespace name 'Test' could not be found (are you missing a using directive or an assembly reference?)
      [csc] <https://builds.apache.org/job/log4net-trunk-build/ws/tests\src\Layout\XmlLayoutTest.cs(243,4)>: error CS0246: The type or namespace name 'TestAttribute' could not be found (are you missing a using directive or an assembly reference?)
      [csc] <https://builds.apache.org/job/log4net-trunk-build/ws/tests\src\Layout\XmlLayoutTest.cs(264,4)>: error CS0246: The type or namespace name 'Test' could not be found (are you missing a using directive or an assembly reference?)
      [csc] <https://builds.apache.org/job/log4net-trunk-build/ws/tests\src\Layout\XmlLayoutTest.cs(264,4)>: error CS0246: The type or namespace name 'TestAttribute' could not be found (are you missing a using directive or an assembly reference?)
      [csc] <https://builds.apache.org/job/log4net-trunk-build/ws/tests\src\Layout\XmlLayoutTest.cs(286,10)>: error CS0246: The type or namespace name 'Test' could not be found (are you missing a using directive or an assembly reference?)
      [csc] <https://builds.apache.org/job/log4net-trunk-build/ws/tests\src\Layout\XmlLayoutTest.cs(286,10)>: error CS0246: The type or namespace name 'TestAttribute' could not be found (are you missing a using directive or an assembly reference?)
      [csc] <https://builds.apache.org/job/log4net-trunk-build/ws/tests\src\Layout\XmlLayoutTest.cs(309,10)>: error CS0246: The type or namespace name 'Test' could not be found (are you missing a using directive or an assembly reference?)
      [csc] <https://builds.apache.org/job/log4net-trunk-build/ws/tests\src\Layout\XmlLayoutTest.cs(309,10)>: error CS0246: The type or namespace name 'TestAttribute' could not be found (are you missing a using directive or an assembly reference?)
      [csc] <https://builds.apache.org/job/log4net-trunk-build/ws/tests\src\Layout\XmlLayoutTest.cs(35,3)>: error CS0246: The type or namespace name 'TestFixture' could not be found (are you missing a using directive or an assembly reference?)
      [csc] <https://builds.apache.org/job/log4net-trunk-build/ws/tests\src\Layout\XmlLayoutTest.cs(35,3)>: error CS0246: The type or namespace name 'TestFixtureAttribute' could not be found (are you missing a using directive or an assembly reference?)
      [csc] <https://builds.apache.org/job/log4net-trunk-build/ws/tests\src\LoggerRepository\ConfigurationMessages.cs(37,10)>: error CS0246: The type or namespace name 'Test' could not be found (are you missing a using directive or an assembly reference?)
      [csc] <https://builds.apache.org/job/log4net-trunk-build/ws/tests\src\LoggerRepository\ConfigurationMessages.cs(37,10)>: error CS0246: The type or namespace name 'TestAttribute' could not be found (are you missing a using directive or an assembly reference?)
      [csc] <https://builds.apache.org/job/log4net-trunk-build/ws/tests\src\LoggerRepository\ConfigurationMessages.cs(34,6)>: error CS0246: The type or namespace name 'TestFixture' could not be found (are you missing a using directive or an assembly reference?)
      [csc] <https://builds.apache.org/job/log4net-trunk-build/ws/tests\src\LoggerRepository\ConfigurationMessages.cs(34,6)>: error CS0246: The type or namespace name 'TestFixtureAttribute' could not be found (are you missing a using directive or an assembly reference?)
      [csc] <https://builds.apache.org/job/log4net-trunk-build/ws/tests\src\Util\CyclicBufferTest.cs(38,4)>: error CS0246: The type or namespace name 'Test' could not be found (are you missing a using directive or an assembly reference?)
      [csc] <https://builds.apache.org/job/log4net-trunk-build/ws/tests\src\Util\CyclicBufferTest.cs(38,4)>: error CS0246: The type or namespace name 'TestAttribute' could not be found (are you missing a using directive or an assembly reference?)
      [csc] <https://builds.apache.org/job/log4net-trunk-build/ws/tests\src\Util\CyclicBufferTest.cs(38,10)>: error CS0246: The type or namespace name 'ExpectedException' could not be found (are you missing a using directive or an assembly reference?)
      [csc] <https://builds.apache.org/job/log4net-trunk-build/ws/tests\src\Util\CyclicBufferTest.cs(38,10)>: error CS0246: The type or namespace name 'ExpectedExceptionAttribute' could not be found (are you missing a using directive or an assembly reference?)
      [csc] <https://builds.apache.org/job/log4net-trunk-build/ws/tests\src\Util\CyclicBufferTest.cs(45,4)>: error CS0246: The type or namespace name 'Test' could not be found (are you missing a using directive or an assembly reference?)
      [csc] <https://builds.apache.org/job/log4net-trunk-build/ws/tests\src\Util\CyclicBufferTest.cs(45,4)>: error CS0246: The type or namespace name 'TestAttribute' could not be found (are you missing a using directive or an assembly reference?)
      [csc] <https://builds.apache.org/job/log4net-trunk-build/ws/tests\src\Util\CyclicBufferTest.cs(77,4)>: error CS0246: The type or namespace name 'Test' could not be found (are you missing a using directive or an assembly reference?)
      [csc] <https://builds.apache.org/job/log4net-trunk-build/ws/tests\src\Util\CyclicBufferTest.cs(77,4)>: error CS0246: The type or namespace name 'TestAttribute' could not be found (are you missing a using directive or an assembly reference?)
      [csc] <https://builds.apache.org/job/log4net-trunk-build/ws/tests\src\Util\CyclicBufferTest.cs(35,3)>: error CS0246: The type or namespace name 'TestFixture' could not be found (are you missing a using directive or an assembly reference?)
      [csc] <https://builds.apache.org/job/log4net-trunk-build/ws/tests\src\Util\CyclicBufferTest.cs(35,3)>: error CS0246: The type or namespace name 'TestFixtureAttribute' could not be found (are you missing a using directive or an assembly reference?)
      [csc] <https://builds.apache.org/job/log4net-trunk-build/ws/tests\src\Util\EnvironmentPatternConverterTest.cs(41,10)>: error CS0246: The type or namespace name 'Test' could not be found (are you missing a using directive or an assembly reference?)
      [csc] <https://builds.apache.org/job/log4net-trunk-build/ws/tests\src\Util\EnvironmentPatternConverterTest.cs(41,10)>: error CS0246: The type or namespace name 'TestAttribute' could not be found (are you missing a using directive or an assembly reference?)
      [csc] <https://builds.apache.org/job/log4net-trunk-build/ws/tests\src\Util\EnvironmentPatternConverterTest.cs(62,10)>: error CS0246: The type or namespace name 'Test' could not be found (are you missing a using directive or an assembly reference?)
      [csc] <https://builds.apache.org/job/log4net-trunk-build/ws/tests\src\Util\EnvironmentPatternConverterTest.cs(62,10)>: error CS0246: The type or namespace name 'TestAttribute' could not be found (are you missing a using directive or an assembly reference?)
      [csc] <https://builds.apache.org/job/log4net-trunk-build/ws/tests\src\Util\EnvironmentPatternConverterTest.cs(78,10)>: error CS0246: The type or namespace name 'Test' could not be found (are you missing a using directive or an assembly reference?)
      [csc] <https://builds.apache.org/job/log4net-trunk-build/ws/tests\src\Util\EnvironmentPatternConverterTest.cs(78,10)>: error CS0246: The type or namespace name 'TestAttribute' could not be found (are you missing a using directive or an assembly reference?)
      [csc] <https://builds.apache.org/job/log4net-trunk-build/ws/tests\src\Util\EnvironmentPatternConverterTest.cs(33,6)>: error CS0246: The type or namespace name 'TestFixture' could not be found (are you missing a using directive or an assembly reference?)
      [csc] <https://builds.apache.org/job/log4net-trunk-build/ws/tests\src\Util\EnvironmentPatternConverterTest.cs(33,6)>: error CS0246: The type or namespace name 'TestFixtureAttribute' could not be found (are you missing a using directive or an assembly reference?)
      [csc] <https://builds.apache.org/job/log4net-trunk-build/ws/tests\src\Util\LogLogTest.cs(32,10)>: error CS0246: The type or namespace name 'Test' could not be found (are you missing a using directive or an assembly reference?)
      [csc] <https://builds.apache.org/job/log4net-trunk-build/ws/tests\src\Util\LogLogTest.cs(32,10)>: error CS0246: The type or namespace name 'TestAttribute' could not be found (are you missing a using directive or an assembly reference?)
      [csc] <https://builds.apache.org/job/log4net-trunk-build/ws/tests\src\Util\LogLogTest.cs(46,10)>: error CS0246: The type or namespace name 'Test' could not be found (are you missing a using directive or an assembly reference?)
      [csc] <https://builds.apache.org/job/log4net-trunk-build/ws/tests\src\Util\LogLogTest.cs(46,10)>: error CS0246: The type or namespace name 'TestAttribute' could not be found (are you missing a using directive or an assembly reference?)
      [csc] <https://builds.apache.org/job/log4net-trunk-build/ws/tests\src\Util\LogLogTest.cs(69,10)>: error CS0246: The type or namespace name 'Test' could not be found (are you missing a using directive or an assembly reference?)
      [csc] <https://builds.apache.org/job/log4net-trunk-build/ws/tests\src\Util\LogLogTest.cs(69,10)>: error CS0246: The type or namespace name 'TestAttribute' could not be found (are you missing a using directive or an assembly reference?)
      [csc] <https://builds.apache.org/job/log4net-trunk-build/ws/tests\src\Util\LogLogTest.cs(29,6)>: error CS0246: The type or namespace name 'TestFixture' could not be found (are you missing a using directive or an assembly reference?)
      [csc] <https://builds.apache.org/job/log4net-trunk-build/ws/tests\src\Util\LogLogTest.cs(29,6)>: error CS0246: The type or namespace name 'TestFixtureAttribute' could not be found (are you missing a using directive or an assembly reference?)
      [csc] <https://builds.apache.org/job/log4net-trunk-build/ws/tests\src\Util\PatternConverterTest.cs(38,10)>: error CS0246: The type or namespace name 'Test' could not be found (are you missing a using directive or an assembly reference?)
      [csc] <https://builds.apache.org/job/log4net-trunk-build/ws/tests\src\Util\PatternConverterTest.cs(38,10)>: error CS0246: The type or namespace name 'TestAttribute' could not be found (are you missing a using directive or an assembly reference?)
      [csc] <https://builds.apache.org/job/log4net-trunk-build/ws/tests\src\Util\PatternConverterTest.cs(83,10)>: error CS0246: The type or namespace name 'Test' could not be found (are you missing a using directive or an assembly reference?)
      [csc] <https://builds.apache.org/job/log4net-trunk-build/ws/tests\src\Util\PatternConverterTest.cs(83,10)>: error CS0246: The type or namespace name 'TestAttribute' could not be found (are you missing a using directive or an assembly reference?)
      [csc] <https://builds.apache.org/job/log4net-trunk-build/ws/tests\src\Util\PatternConverterTest.cs(35,6)>: error CS0246: The type or namespace name 'TestFixture' could not be found (are you missing a using directive or an assembly reference?)
      [csc] <https://builds.apache.org/job/log4net-trunk-build/ws/tests\src\Util\PatternConverterTest.cs(35,6)>: error CS0246: The type or namespace name 'TestFixtureAttribute' could not be found (are you missing a using directive or an assembly reference?)
      [csc] <https://builds.apache.org/job/log4net-trunk-build/ws/tests\src\Util\PatternStringTest.cs(31,10)>: error CS0246: The type or namespace name 'Test' could not be found (are you missing a using directive or an assembly reference?)
      [csc] <https://builds.apache.org/job/log4net-trunk-build/ws/tests\src\Util\PatternStringTest.cs(31,10)>: error CS0246: The type or namespace name 'TestAttribute' could not be found (are you missing a using directive or an assembly reference?)
      [csc] <https://builds.apache.org/job/log4net-trunk-build/ws/tests\src\Util\PatternStringTest.cs(28,6)>: error CS0246: The type or namespace name 'TestFixture' could not be found (are you missing a using directive or an assembly reference?)
      [csc] <https://builds.apache.org/job/log4net-trunk-build/ws/tests\src\Util\PatternStringTest.cs(28,6)>: error CS0246: The type or namespace name 'TestFixtureAttribute' could not be found (are you missing a using directive or an assembly reference?)
      [csc] <https://builds.apache.org/job/log4net-trunk-build/ws/tests\src\Util\PropertiesDictionaryTest.cs(38,4)>: error CS0246: The type or namespace name 'Test' could not be found (are you missing a using directive or an assembly reference?)
      [csc] <https://builds.apache.org/job/log4net-trunk-build/ws/tests\src\Util\PropertiesDictionaryTest.cs(38,4)>: error CS0246: The type or namespace name 'TestAttribute' could not be found (are you missing a using directive or an assembly reference?)
      [csc] <https://builds.apache.org/job/log4net-trunk-build/ws/tests\src\Util\PropertiesDictionaryTest.cs(35,3)>: error CS0246: The type or namespace name 'TestFixture' could not be found (are you missing a using directive or an assembly reference?)
      [csc] <https://builds.apache.org/job/log4net-trunk-build/ws/tests\src\Util\PropertiesDictionaryTest.cs(35,3)>: error CS0246: The type or namespace name 'TestFixtureAttribute' could not be found (are you missing a using directive or an assembly reference?)
      [csc] <https://builds.apache.org/job/log4net-trunk-build/ws/tests\src\Util\RandomStringPatternConverterTest.cs(35,4)>: error CS0246: The type or namespace name 'Test' could not be found (are you missing a using directive or an assembly reference?)
      [csc] <https://builds.apache.org/job/log4net-trunk-build/ws/tests\src\Util\RandomStringPatternConverterTest.cs(35,4)>: error CS0246: The type or namespace name 'TestAttribute' could not be found (are you missing a using directive or an assembly reference?)
      [csc] <https://builds.apache.org/job/log4net-trunk-build/ws/tests\src\Util\RandomStringPatternConverterTest.cs(32,3)>: error CS0246: The type or namespace name 'TestFixture' could not be found (are you missing a using directive or an assembly reference?)
      [csc] <https://builds.apache.org/job/log4net-trunk-build/ws/tests\src\Util\RandomStringPatternConverterTest.cs(32,3)>: error CS0246: The type or namespace name 'TestFixtureAttribute' could not be found (are you missing a using directive or an assembly reference?)
      [csc] <https://builds.apache.org/job/log4net-trunk-build/ws/tests\src\Util\SystemInfoTest.cs(34,4)>: error CS0246: The type or namespace name 'Test' could not be found (are you missing a using directive or an assembly reference?)
      [csc] <https://builds.apache.org/job/log4net-trunk-build/ws/tests\src\Util\SystemInfoTest.cs(34,4)>: error CS0246: The type or namespace name 'TestAttribute' could not be found (are you missing a using directive or an assembly reference?)
      [csc] <https://builds.apache.org/job/log4net-trunk-build/ws/tests\src\Util\SystemInfoTest.cs(49,18)>: error CS0246: The type or namespace name 'Test' could not be found (are you missing a using directive or an assembly reference?)
      [csc] <https://builds.apache.org/job/log4net-trunk-build/ws/tests\src\Util\SystemInfoTest.cs(49,18)>: error CS0246: The type or namespace name 'TestAttribute' could not be found (are you missing a using directive or an assembly reference?)
      [csc] <https://builds.apache.org/job/log4net-trunk-build/ws/tests\src\Util\SystemInfoTest.cs(49,24)>: error CS0246: The type or namespace name 'Platform' could not be found (are you missing a using directive or an assembly reference?)
      [csc] <https://builds.apache.org/job/log4net-trunk-build/ws/tests\src\Util\SystemInfoTest.cs(49,24)>: error CS0246: The type or namespace name 'PlatformAttribute' could not be found (are you missing a using directive or an assembly reference?)
      [csc] <https://builds.apache.org/job/log4net-trunk-build/ws/tests\src\Util\SystemInfoTest.cs(61,4)>: error CS0246: The type or namespace name 'Test' could not be found (are you missing a using directive or an assembly reference?)
      [csc] <https://builds.apache.org/job/log4net-trunk-build/ws/tests\src\Util\SystemInfoTest.cs(61,4)>: error CS0246: The type or namespace name 'TestAttribute' could not be found (are you missing a using directive or an assembly reference?)
      [csc] <https://builds.apache.org/job/log4net-trunk-build/ws/tests\src\Util\SystemInfoTest.cs(76,4)>: error CS0246: The type or namespace name 'Test' could not be found (are you missing a using directive or an assembly reference?)
      [csc] <https://builds.apache.org/job/log4net-trunk-build/ws/tests\src\Util\SystemInfoTest.cs(76,4)>: error CS0246: The type or namespace name 'TestAttribute' could not be found (are you missing a using directive or an assembly reference?)
      [csc] <https://builds.apache.org/job/log4net-trunk-build/ws/tests\src\Util\SystemInfoTest.cs(91,4)>: error CS0246: The type or namespace name 'Test' could not be found (are you missing a using directive or an assembly reference?)
      [csc] <https://builds.apache.org/job/log4net-trunk-build/ws/tests\src\Util\SystemInfoTest.cs(91,4)>: error CS0246: The type or namespace name 'TestAttribute' could not be found (are you missing a using directive or an assembly reference?)
      [csc] <https://builds.apache.org/job/log4net-trunk-build/ws/tests\src\Util\SystemInfoTest.cs(91,10)>: error CS0246: The type or namespace name 'ExpectedException' could not be found (are you missing a using directive or an assembly reference?)
      [csc] <https://builds.apache.org/job/log4net-trunk-build/ws/tests\src\Util\SystemInfoTest.cs(91,10)>: error CS0246: The type or namespace name 'ExpectedExceptionAttribute' could not be found (are you missing a using directive or an assembly reference?)
      [csc] <https://builds.apache.org/job/log4net-trunk-build/ws/tests\src\Util\SystemInfoTest.cs(102,4)>: error CS0246: The type or namespace name 'Test' could not be found (are you missing a using directive or an assembly reference?)
      [csc] <https://builds.apache.org/job/log4net-trunk-build/ws/tests\src\Util\SystemInfoTest.cs(102,4)>: error CS0246: The type or namespace name 'TestAttribute' could not be found (are you missing a using directive or an assembly reference?)
      [csc] <https://builds.apache.org/job/log4net-trunk-build/ws/tests\src\Util\SystemInfoTest.cs(102,10)>: error CS0246: The type or namespace name 'ExpectedException' could not be found (are you missing a using directive or an assembly reference?)
      [csc] <https://builds.apache.org/job/log4net-trunk-build/ws/tests\src\Util\SystemInfoTest.cs(102,10)>: error CS0246: The type or namespace name 'ExpectedExceptionAttribute' could not be found (are you missing a using directive or an assembly reference?)
      [csc] <https://builds.apache.org/job/log4net-trunk-build/ws/tests\src\Util\SystemInfoTest.cs(31,3)>: error CS0246: The type or namespace name 'TestFixture' could not be found (are you missing a using directive or an assembly reference?)
      [csc] <https://builds.apache.org/job/log4net-trunk-build/ws/tests\src\Util\SystemInfoTest.cs(31,3)>: error CS0246: The type or namespace name 'TestFixtureAttribute' could not be found (are you missing a using directive or an assembly reference?)
      [csc] <https://builds.apache.org/job/log4net-trunk-build/ws/tests\src\Util\TransformTest.cs(31,10)>: error CS0246: The type or namespace name 'Test' could not be found (are you missing a using directive or an assembly reference?)
      [csc] <https://builds.apache.org/job/log4net-trunk-build/ws/tests\src\Util\TransformTest.cs(31,10)>: error CS0246: The type or namespace name 'TestAttribute' could not be found (are you missing a using directive or an assembly reference?)
      [csc] <https://builds.apache.org/job/log4net-trunk-build/ws/tests\src\Util\TransformTest.cs(38,10)>: error CS0246: The type or namespace name 'Test' could not be found (are you missing a using directive or an assembly reference?)
      [csc] <https://builds.apache.org/job/log4net-trunk-build/ws/tests\src\Util\TransformTest.cs(38,10)>: error CS0246: The type or namespace name 'TestAttribute' could not be found (are you missing a using directive or an assembly reference?)
      [csc] <https://builds.apache.org/job/log4net-trunk-build/ws/tests\src\Util\TransformTest.cs(28,6)>: error CS0246: The type or namespace name 'TestFixture' could not be found (are you missing a using directive or an assembly reference?)
      [csc] <https://builds.apache.org/job/log4net-trunk-build/ws/tests\src\Util\TransformTest.cs(28,6)>: error CS0246: The type or namespace name 'TestFixtureAttribute' could not be found (are you missing a using directive or an assembly reference?)

BUILD FAILED

<https://builds.apache.org/job/log4net-trunk-build/ws/tests\nant.build(472,10)>:
External Program Failed: C:\Windows\Microsoft.NET\Framework64\v4.0.30319\csc.exe (return code was 1)

Total time: 1.4 seconds.

Build step 'Execute NAnt build' marked build as failure

Mime
View raw message