logging-log4j-dev mailing list archives

Site index · List index
Message view « Date » · « Thread »
Top « Date » · « Thread »
From Apache Jenkins Server <jenk...@builds.apache.org>
Subject Build failed in Jenkins: Log4jWindows » Windows,JDK 1.7 (unlimited security) 64-bit Windows only #42
Date Sun, 02 Apr 2017 18:19:52 GMT
See <https://builds.apache.org/job/Log4jWindows/Windows%20Slaves=Windows,jdk=JDK%201.7%20(unlimited%20security)%2064-bit%20Windows%20only/42/display/redirect?page=changes>

Changes:

[wangyuntao] Correct errors in the comments of Order and OrderComparator

[Matt Sicker] [LOG4J2-1861] Fix ThreadContext javadoc about inheritance

[Matt Sicker] Add changelog entries

------------------------------------------
[...truncated 366.21 KB...]
2017-04-02 18:18:48,178 main DEBUG Starting FileManager target/test-properties.log
2017-04-02 18:18:48,179 main DEBUG Building Plugin[name=filter, class=org.apache.logging.log4j.core.filter.ThresholdFilter].
2017-04-02 18:18:48,181 main DEBUG createFilter(level="ERROR", onMatch="null", onMismatch="null")
2017-04-02 18:18:48,181 main DEBUG Building Plugin[name=appender, class=org.apache.logging.log4j.test.appender.ListAppender].
2017-04-02 18:18:48,184 main DEBUG ListAppender$Builder(name="List", entryPerNewLine="null",
raw="null", Layout=null, ThresholdFilter(ERROR))
2017-04-02 18:18:48,184 main DEBUG Building Plugin[name=layout, class=org.apache.logging.log4j.core.layout.PatternLayout].
2017-04-02 18:18:48,186 main DEBUG PatternLayout$Builder(pattern="%m%n", PatternSelector=null,
Configuration(PropertiesConfigTest), Replace=null, charset="null", alwaysWriteExceptions="null",
disableAnsi="null", noConsoleNoAnsi="null", header="null", footer="null")
2017-04-02 18:18:48,186 main DEBUG Building Plugin[name=appender, class=org.apache.logging.log4j.core.appender.ConsoleAppender].
2017-04-02 18:18:48,201 main DEBUG ConsoleAppender$Builder(target="null", follow="null", direct="null",
bufferedIo="null", bufferSize="null", immediateFlush="null", ignoreExceptions="null", PatternLayout(%m%n),
name="STDOUT", Configuration(PropertiesConfigTest), Filter=null)
2017-04-02 18:18:48,202 main WARN Unable to instantiate org.fusesource.jansi.WindowsAnsiOutputStream
2017-04-02 18:18:48,202 main DEBUG Starting OutputStreamManager SYSTEM_OUT.false.false
2017-04-02 18:18:48,202 main DEBUG Building Plugin[name=appenders, class=org.apache.logging.log4j.core.config.AppendersPlugin].
2017-04-02 18:18:48,203 main DEBUG createAppenders(={File, List, STDOUT})
2017-04-02 18:18:48,203 main DEBUG Building Plugin[name=filter, class=org.apache.logging.log4j.core.filter.ThresholdFilter].
2017-04-02 18:18:48,204 main DEBUG createFilter(level="DEBUG", onMatch="null", onMismatch="null")
2017-04-02 18:18:48,205 main DEBUG Configuration org.apache.logging.log4j.core.config.properties.PropertiesConfiguration@94eefbf
initialized
2017-04-02 18:18:48,206 main DEBUG Starting configuration org.apache.logging.log4j.core.config.properties.PropertiesConfiguration@94eefbf
2017-04-02 18:18:48,207 main DEBUG Log4j2 ConfigurationScheduler starting 1 threads
2017-04-02 18:18:48,208 main DEBUG Started configuration org.apache.logging.log4j.core.config.properties.PropertiesConfiguration@94eefbf
OK.
2017-04-02 18:18:48,209 main DEBUG Shutting down OutputStreamManager SYSTEM_OUT.false.false-1
2017-04-02 18:18:48,209 main DEBUG Shut down OutputStreamManager SYSTEM_OUT.false.false-1,
all resources released: true
2017-04-02 18:18:48,210 main DEBUG Appender DefaultConsole-1 stopped with status true
2017-04-02 18:18:48,210 main DEBUG Stopped org.apache.logging.log4j.core.config.DefaultConfiguration@52052438
OK
2017-04-02 18:18:48,310 main DEBUG Registering MBean org.apache.logging.log4j2:type=org.apache.logging.log4j.core.PropertiesFileConfigTest
2017-04-02 18:18:48,315 main DEBUG Registering MBean org.apache.logging.log4j2:type=org.apache.logging.log4j.core.PropertiesFileConfigTest,component=StatusLogger
2017-04-02 18:18:48,317 main DEBUG Registering MBean org.apache.logging.log4j2:type=org.apache.logging.log4j.core.PropertiesFileConfigTest,component=ContextSelector
2017-04-02 18:18:48,320 main DEBUG Registering MBean org.apache.logging.log4j2:type=org.apache.logging.log4j.core.PropertiesFileConfigTest,component=Loggers,name=org.apache.logging.log4j.test2
2017-04-02 18:18:48,321 main DEBUG Registering MBean org.apache.logging.log4j2:type=org.apache.logging.log4j.core.PropertiesFileConfigTest,component=Loggers,name=
2017-04-02 18:18:48,322 main DEBUG Registering MBean org.apache.logging.log4j2:type=org.apache.logging.log4j.core.PropertiesFileConfigTest,component=Loggers,name=org.apache.logging.log4j.test1
2017-04-02 18:18:48,324 main DEBUG Registering MBean org.apache.logging.log4j2:type=org.apache.logging.log4j.core.PropertiesFileConfigTest,component=Appenders,name=List
2017-04-02 18:18:48,325 main DEBUG Registering MBean org.apache.logging.log4j2:type=org.apache.logging.log4j.core.PropertiesFileConfigTest,component=Appenders,name=STDOUT
2017-04-02 18:18:48,325 main DEBUG Registering MBean org.apache.logging.log4j2:type=org.apache.logging.log4j.core.PropertiesFileConfigTest,component=Appenders,name=File
2017-04-02 18:18:48,328 main DEBUG LoggerContext[name=org.apache.logging.log4j.core.PropertiesFileConfigTest,
org.apache.logging.log4j.core.LoggerContext@d697ff2] started OK with configuration org.apache.logging.log4j.core.config.properties.PropertiesConfiguration@94eefbf.
Running org.apache.logging.log4j.core.PropertiesFileConfigTest
2017-04-02 18:18:49,208 Log4j2-TF-2-Scheduled-1 INFO File target\test-classes\log4j-test2.properties
was modified on 1491156264939, previous modification was 1491156254939
2017-04-02 18:18:49,210 Log4j2-TF-1-ConfiguratonFileWatcher-2 DEBUG Reconfiguration started
for context org.apache.logging.log4j.core.PropertiesFileConfigTest (org.apache.logging.log4j.core.LoggerContext@d697ff2)
2017-04-02 18:18:49,212 Log4j2-TF-1-ConfiguratonFileWatcher-2 DEBUG Not in a ServletContext
environment, thus not loading WebLookup plugin.
2017-04-02 18:18:49,215 Log4j2-TF-1-ConfiguratonFileWatcher-2 DEBUG Not in a ServletContext
environment, thus not loading WebLookup plugin.
2017-04-02 18:18:49,215 Log4j2-TF-1-ConfiguratonFileWatcher-2 DEBUG Initializing configuration
org.apache.logging.log4j.core.config.properties.PropertiesConfiguration@2df7afcf
2017-04-02 18:18:49,217 Log4j2-TF-1-ConfiguratonFileWatcher-2 DEBUG Installed script engines
2017-04-02 18:18:49,218 Log4j2-TF-1-ConfiguratonFileWatcher-2 DEBUG Mozilla Rhino Version:
1.7 release 3 PRERELEASE, Language: ECMAScript, Threading: MULTITHREADED, Compile: true, Names:
{js, rhino, JavaScript, javascript, ECMAScript, ecmascript}
2017-04-02 18:18:49,219 Log4j2-TF-1-ConfiguratonFileWatcher-2 DEBUG Groovy Scripting Engine
Version: 2.0, Language: Groovy, Threading: MULTITHREADED, Compile: true, Names: {groovy, Groovy}
2017-04-02 18:18:49,231 Log4j2-TF-1-ConfiguratonFileWatcher-2 DEBUG BeanShell Engine Version:
1.0, Language: BeanShell, Threading: MULTITHREADED, Compile: true, Names: {beanshell, bsh,
java}
2017-04-02 18:18:49,231 Log4j2-TF-1-ConfiguratonFileWatcher-2 DEBUG PluginManager 'Core' found
122 plugins
2017-04-02 18:18:49,231 Log4j2-TF-1-ConfiguratonFileWatcher-2 DEBUG PluginManager 'Level'
found 1 plugins
2017-04-02 18:18:49,232 Log4j2-TF-1-ConfiguratonFileWatcher-2 DEBUG Building Plugin[name=property,
class=org.apache.logging.log4j.core.config.Property].
2017-04-02 18:18:49,233 Log4j2-TF-1-ConfiguratonFileWatcher-2 DEBUG createProperty(name="filename",
value="target/test-properties.log")
2017-04-02 18:18:49,233 Log4j2-TF-1-ConfiguratonFileWatcher-2 DEBUG Building Plugin[name=properties,
class=org.apache.logging.log4j.core.config.PropertiesPlugin].
2017-04-02 18:18:49,233 Log4j2-TF-1-ConfiguratonFileWatcher-2 DEBUG configureSubstitutor(={filename=target/test-properties.log},
Configuration(PropertiesConfigTest))
2017-04-02 18:18:49,234 Log4j2-TF-1-ConfiguratonFileWatcher-2 DEBUG PluginManager 'Lookup'
found 13 plugins
2017-04-02 18:18:49,234 Log4j2-TF-1-ConfiguratonFileWatcher-2 DEBUG Building Plugin[name=AppenderRef,
class=org.apache.logging.log4j.core.config.AppenderRef].
2017-04-02 18:18:49,235 Log4j2-TF-1-ConfiguratonFileWatcher-2 DEBUG createAppenderRef(ref="File",
level="null", Filter=null)
2017-04-02 18:18:49,235 Log4j2-TF-1-ConfiguratonFileWatcher-2 DEBUG Building Plugin[name=logger,
class=org.apache.logging.log4j.core.config.LoggerConfig].
2017-04-02 18:18:49,237 Log4j2-TF-1-ConfiguratonFileWatcher-2 DEBUG createLogger(additivity="false",
level="DEBUG", name="org.apache.logging.log4j.test2", includeLocation="null", ={File}, ={},
Configuration(PropertiesConfigTest), Filter=null)
2017-04-02 18:18:49,238 Log4j2-TF-1-ConfiguratonFileWatcher-2 DEBUG Building Plugin[name=AppenderRef,
class=org.apache.logging.log4j.core.config.AppenderRef].
2017-04-02 18:18:49,239 Log4j2-TF-1-ConfiguratonFileWatcher-2 DEBUG createAppenderRef(ref="STDOUT",
level="null", Filter=null)
2017-04-02 18:18:49,239 Log4j2-TF-1-ConfiguratonFileWatcher-2 DEBUG Building Plugin[name=KeyValuePair,
class=org.apache.logging.log4j.core.util.KeyValuePair].
2017-04-02 18:18:49,239 Log4j2-TF-1-ConfiguratonFileWatcher-2 DEBUG KeyValuePair$Builder(key="test",
value="123")
2017-04-02 18:18:49,240 Log4j2-TF-1-ConfiguratonFileWatcher-2 DEBUG Building Plugin[name=filter,
class=org.apache.logging.log4j.core.filter.ThreadContextMapFilter].
2017-04-02 18:18:49,241 Log4j2-TF-1-ConfiguratonFileWatcher-2 DEBUG createFilter(={test=123},
operator="null", onMatch="null", onMismatch="null")
2017-04-02 18:18:49,241 Log4j2-TF-1-ConfiguratonFileWatcher-2 DEBUG Building Plugin[name=logger,
class=org.apache.logging.log4j.core.config.LoggerConfig].
2017-04-02 18:18:49,243 Log4j2-TF-1-ConfiguratonFileWatcher-2 DEBUG createLogger(additivity="false",
level="DEBUG", name="org.apache.logging.log4j.test1", includeLocation="null", ={STDOUT}, ={},
Configuration(PropertiesConfigTest), ThreadContextMapFilter(isAnd=true, {test=[123]}))
2017-04-02 18:18:49,243 Log4j2-TF-1-ConfiguratonFileWatcher-2 DEBUG Building Plugin[name=AppenderRef,
class=org.apache.logging.log4j.core.config.AppenderRef].
2017-04-02 18:18:49,244 Log4j2-TF-1-ConfiguratonFileWatcher-2 DEBUG createAppenderRef(ref="STDOUT",
level="null", Filter=null)
2017-04-02 18:18:49,244 Log4j2-TF-1-ConfiguratonFileWatcher-2 DEBUG Building Plugin[name=root,
class=org.apache.logging.log4j.core.config.LoggerConfig$RootLogger].
2017-04-02 18:18:49,245 Log4j2-TF-1-ConfiguratonFileWatcher-2 DEBUG createLogger(additivity="null",
level="ERROR", includeLocation="null", ={STDOUT}, ={}, Configuration(PropertiesConfigTest),
Filter=null)
2017-04-02 18:18:49,246 Log4j2-TF-1-ConfiguratonFileWatcher-2 DEBUG Building Plugin[name=loggers,
class=org.apache.logging.log4j.core.config.LoggersPlugin].
2017-04-02 18:18:49,246 Log4j2-TF-1-ConfiguratonFileWatcher-2 DEBUG createLoggers(={org.apache.logging.log4j.test2,
org.apache.logging.log4j.test1, root})
2017-04-02 18:18:49,246 Log4j2-TF-1-ConfiguratonFileWatcher-2 DEBUG Building Plugin[name=layout,
class=org.apache.logging.log4j.core.layout.PatternLayout].
2017-04-02 18:18:49,248 Log4j2-TF-1-ConfiguratonFileWatcher-2 DEBUG PatternLayout$Builder(pattern="%d
%p %C{1.} [%t] %m%n", PatternSelector=null, Configuration(PropertiesConfigTest), Replace=null,
charset="null", alwaysWriteExceptions="null", disableAnsi="null", noConsoleNoAnsi="null",
header="null", footer="null")
2017-04-02 18:18:49,248 Log4j2-TF-1-ConfiguratonFileWatcher-2 DEBUG PluginManager 'Converter'
found 41 plugins
2017-04-02 18:18:49,249 Log4j2-TF-1-ConfiguratonFileWatcher-2 DEBUG Building Plugin[name=appender,
class=org.apache.logging.log4j.core.appender.FileAppender].
2017-04-02 18:18:49,252 Log4j2-TF-1-ConfiguratonFileWatcher-2 DEBUG FileAppender$Builder(fileName="target/test-properties.log",
append="null", locking="null", advertise="null", advertiseUri="null", createOnDemand="null",
bufferedIo="false", bufferSize="null", immediateFlush="null", ignoreExceptions="null", PatternLayout(%d
%p %C{1.} [%t] %m%n), name="File", Configuration(PropertiesConfigTest), Filter=null)
2017-04-02 18:18:49,252 Log4j2-TF-1-ConfiguratonFileWatcher-2 WARN The bufferSize is set to
8192 but bufferedIo is false: false
2017-04-02 18:18:49,253 Log4j2-TF-1-ConfiguratonFileWatcher-2 DEBUG Building Plugin[name=filter,
class=org.apache.logging.log4j.core.filter.ThresholdFilter].
2017-04-02 18:18:49,254 Log4j2-TF-1-ConfiguratonFileWatcher-2 DEBUG createFilter(level="ERROR",
onMatch="null", onMismatch="null")
2017-04-02 18:18:49,254 Log4j2-TF-1-ConfiguratonFileWatcher-2 DEBUG Building Plugin[name=appender,
class=org.apache.logging.log4j.test.appender.ListAppender].
2017-04-02 18:18:49,255 Log4j2-TF-1-ConfiguratonFileWatcher-2 DEBUG ListAppender$Builder(name="List",
entryPerNewLine="null", raw="null", Layout=null, ThresholdFilter(ERROR))
2017-04-02 18:18:49,255 Log4j2-TF-1-ConfiguratonFileWatcher-2 DEBUG Building Plugin[name=layout,
class=org.apache.logging.log4j.core.layout.PatternLayout].
2017-04-02 18:18:49,257 Log4j2-TF-1-ConfiguratonFileWatcher-2 DEBUG PatternLayout$Builder(pattern="%m%n",
PatternSelector=null, Configuration(PropertiesConfigTest), Replace=null, charset="null", alwaysWriteExceptions="null",
disableAnsi="null", noConsoleNoAnsi="null", header="null", footer="null")
2017-04-02 18:18:49,257 Log4j2-TF-1-ConfiguratonFileWatcher-2 DEBUG Building Plugin[name=appender,
class=org.apache.logging.log4j.core.appender.ConsoleAppender].
2017-04-02 18:18:49,260 Log4j2-TF-1-ConfiguratonFileWatcher-2 DEBUG ConsoleAppender$Builder(target="null",
follow="null", direct="null", bufferedIo="null", bufferSize="null", immediateFlush="null",
ignoreExceptions="null", PatternLayout(%m%n), name="STDOUT", Configuration(PropertiesConfigTest),
Filter=null)
2017-04-02 18:18:49,260 Log4j2-TF-1-ConfiguratonFileWatcher-2 WARN Unable to instantiate org.fusesource.jansi.WindowsAnsiOutputStream
2017-04-02 18:18:49,261 Log4j2-TF-1-ConfiguratonFileWatcher-2 DEBUG Building Plugin[name=appenders,
class=org.apache.logging.log4j.core.config.AppendersPlugin].
2017-04-02 18:18:49,262 Log4j2-TF-1-ConfiguratonFileWatcher-2 DEBUG createAppenders(={File,
List, STDOUT})
2017-04-02 18:18:49,262 Log4j2-TF-1-ConfiguratonFileWatcher-2 DEBUG Building Plugin[name=filter,
class=org.apache.logging.log4j.core.filter.ThresholdFilter].
2017-04-02 18:18:49,263 Log4j2-TF-1-ConfiguratonFileWatcher-2 DEBUG createFilter(level="DEBUG",
onMatch="null", onMismatch="null")
2017-04-02 18:18:49,263 Log4j2-TF-1-ConfiguratonFileWatcher-2 DEBUG Configuration org.apache.logging.log4j.core.config.properties.PropertiesConfiguration@2df7afcf
initialized
2017-04-02 18:18:49,264 Log4j2-TF-1-ConfiguratonFileWatcher-2 DEBUG Starting configuration
org.apache.logging.log4j.core.config.properties.PropertiesConfiguration@2df7afcf
2017-04-02 18:18:49,264 Log4j2-TF-1-ConfiguratonFileWatcher-2 DEBUG Log4j2 ConfigurationScheduler
starting 1 threads
2017-04-02 18:18:49,264 Log4j2-TF-1-ConfiguratonFileWatcher-2 DEBUG Started configuration
org.apache.logging.log4j.core.config.properties.PropertiesConfiguration@2df7afcf OK.
2017-04-02 18:18:49,265 Log4j2-TF-1-ConfiguratonFileWatcher-2 DEBUG Appender File stopped
with status true
2017-04-02 18:18:49,265 Log4j2-TF-1-ConfiguratonFileWatcher-2 DEBUG Appender STDOUT stopped
with status true
2017-04-02 18:18:49,266 Log4j2-TF-1-ConfiguratonFileWatcher-2 DEBUG Log4j2 ConfigurationScheduler
shutting down threads in java.util.concurrent.ScheduledThreadPoolExecutor@18019c40[Running,
pool size = 1, active threads = 0, queued tasks = 1, completed tasks = 1]
2017-04-02 18:18:49,267 Log4j2-TF-1-ConfiguratonFileWatcher-2 DEBUG Stopped org.apache.logging.log4j.core.config.properties.PropertiesConfiguration@94eefbf
OK
2017-04-02 18:18:49,269 Log4j2-TF-1-ConfiguratonFileWatcher-2 DEBUG Registering MBean org.apache.logging.log4j2:type=org.apache.logging.log4j.core.PropertiesFileConfigTest
2017-04-02 18:18:49,269 Log4j2-TF-1-ConfiguratonFileWatcher-2 DEBUG Registering MBean org.apache.logging.log4j2:type=org.apache.logging.log4j.core.PropertiesFileConfigTest,component=StatusLogger
2017-04-02 18:18:49,270 Log4j2-TF-1-ConfiguratonFileWatcher-2 DEBUG Registering MBean org.apache.logging.log4j2:type=org.apache.logging.log4j.core.PropertiesFileConfigTest,component=ContextSelector
2017-04-02 18:18:49,270 Log4j2-TF-1-ConfiguratonFileWatcher-2 DEBUG Registering MBean org.apache.logging.log4j2:type=org.apache.logging.log4j.core.PropertiesFileConfigTest,component=Loggers,name=org.apache.logging.log4j.test2
2017-04-02 18:18:49,271 Log4j2-TF-1-ConfiguratonFileWatcher-2 DEBUG Registering MBean org.apache.logging.log4j2:type=org.apache.logging.log4j.core.PropertiesFileConfigTest,component=Loggers,name=
2017-04-02 18:18:49,271 Log4j2-TF-1-ConfiguratonFileWatcher-2 DEBUG Registering MBean org.apache.logging.log4j2:type=org.apache.logging.log4j.core.PropertiesFileConfigTest,component=Loggers,name=org.apache.logging.log4j.test1
2017-04-02 18:18:49,272 Log4j2-TF-1-ConfiguratonFileWatcher-2 DEBUG Registering MBean org.apache.logging.log4j2:type=org.apache.logging.log4j.core.PropertiesFileConfigTest,component=Appenders,name=List
2017-04-02 18:18:49,272 Log4j2-TF-1-ConfiguratonFileWatcher-2 DEBUG Registering MBean org.apache.logging.log4j2:type=org.apache.logging.log4j.core.PropertiesFileConfigTest,component=Appenders,name=STDOUT
2017-04-02 18:18:49,272 Log4j2-TF-1-ConfiguratonFileWatcher-2 DEBUG Registering MBean org.apache.logging.log4j2:type=org.apache.logging.log4j.core.PropertiesFileConfigTest,component=Appenders,name=File
2017-04-02 18:18:49,273 Log4j2-TF-1-ConfiguratonFileWatcher-2 DEBUG Reconfiguration completed
for org.apache.logging.log4j.core.PropertiesFileConfigTest (org.apache.logging.log4j.core.LoggerContext@d697ff2)
2017-04-02 18:18:54,438 main DEBUG Stopping LoggerContext[name=org.apache.logging.log4j.core.PropertiesFileConfigTest,
org.apache.logging.log4j.core.LoggerContext@d697ff2]...
2017-04-02 18:18:54,440 main DEBUG Shutting down FileManager target/test-properties.log
2017-04-02 18:18:54,441 main DEBUG Shut down FileManager target/test-properties.log, all resources
released: true
2017-04-02 18:18:54,441 main DEBUG Appender File stopped with status true
2017-04-02 18:18:54,441 main DEBUG Shutting down OutputStreamManager SYSTEM_OUT.false.false
2017-04-02 18:18:54,441 main DEBUG Shut down OutputStreamManager SYSTEM_OUT.false.false, all
resources released: true
2017-04-02 18:18:54,441 main DEBUG Appender STDOUT stopped with status true
2017-04-02 18:18:54,442 main DEBUG Log4j2 ConfigurationScheduler shutting down threads in
java.util.concurrent.ScheduledThreadPoolExecutor@4f123549[Running, pool size = 1, active threads
= 0, queued tasks = 1, completed tasks = 5]
2017-04-02 18:18:54,442 main DEBUG Stopped org.apache.logging.log4j.core.config.properties.PropertiesConfiguration@2df7afcf
OK
2017-04-02 18:18:54,442 main DEBUG Stopped LoggerContext[name=org.apache.logging.log4j.core.PropertiesFileConfigTest,
org.apache.logging.log4j.core.LoggerContext@d697ff2] with status true
Tests run: 1, Failures: 0, Errors: 0, Skipped: 0, Time elapsed: 6.108 sec - in org.apache.logging.log4j.core.PropertiesFileConfigTest
Running org.apache.logging.log4j.core.selector.ClassLoaderContextSelectorTest
ERROR StatusLogger No log4j2 configuration file found. Using default configuration: logging
only errors to the console. Set system property 'org.apache.logging.log4j.simplelog.StatusLogger.level'
to TRACE to show Log4j2 internal initialization logging.
Tests run: 1, Failures: 0, Errors: 0, Skipped: 0, Time elapsed: 0.936 sec - in org.apache.logging.log4j.core.selector.ClassLoaderContextSelectorTest
Running org.apache.logging.log4j.core.ShutdownDisabledTest
Tests run: 1, Failures: 0, Errors: 0, Skipped: 0, Time elapsed: 0.002 sec - in org.apache.logging.log4j.core.ShutdownDisabledTest
Running org.apache.logging.log4j.core.ShutdownTimeoutConfigurationTest
Tests run: 1, Failures: 0, Errors: 0, Skipped: 0, Time elapsed: 0.006 sec - in org.apache.logging.log4j.core.ShutdownTimeoutConfigurationTest
Running org.apache.logging.log4j.core.StrictXmlConfigTest
Tests run: 10, Failures: 0, Errors: 0, Skipped: 0, Time elapsed: 0.075 sec - in org.apache.logging.log4j.core.StrictXmlConfigTest
Running org.apache.logging.log4j.core.TimestampMessageTest
Tests run: 1, Failures: 0, Errors: 0, Skipped: 0, Time elapsed: 0.042 sec - in org.apache.logging.log4j.core.TimestampMessageTest
Running org.apache.logging.log4j.core.tools.GenerateCustomLoggerTest
Tests run: 1, Failures: 0, Errors: 0, Skipped: 0, Time elapsed: 1.994 sec - in org.apache.logging.log4j.core.tools.GenerateCustomLoggerTest
Running org.apache.logging.log4j.core.tools.GenerateExtendedLoggerTest
Tests run: 1, Failures: 0, Errors: 0, Skipped: 0, Time elapsed: 2.072 sec - in org.apache.logging.log4j.core.tools.GenerateExtendedLoggerTest
Running org.apache.logging.log4j.core.util.AssertTest
Tests run: 13, Failures: 0, Errors: 0, Skipped: 0, Time elapsed: 0.006 sec - in org.apache.logging.log4j.core.util.AssertTest
Running org.apache.logging.log4j.core.util.ClockFactoryTest
Tests run: 8, Failures: 0, Errors: 0, Skipped: 0, Time elapsed: 0.117 sec - in org.apache.logging.log4j.core.util.ClockFactoryTest
Running org.apache.logging.log4j.core.util.CronExpressionTest
Tests run: 12, Failures: 0, Errors: 0, Skipped: 0, Time elapsed: 0.743 sec - in org.apache.logging.log4j.core.util.CronExpressionTest
Running org.apache.logging.log4j.core.util.datetime.FastDateParserSDFTest
Tests run: 276, Failures: 0, Errors: 0, Skipped: 0, Time elapsed: 0.221 sec - in org.apache.logging.log4j.core.util.datetime.FastDateParserSDFTest
Running org.apache.logging.log4j.core.util.datetime.FastDateParserTest
Tests run: 37, Failures: 0, Errors: 0, Skipped: 0, Time elapsed: 2.221 sec - in org.apache.logging.log4j.core.util.datetime.FastDateParserTest
Running org.apache.logging.log4j.core.util.datetime.FastDateParser_MoreOrLessTest
Tests run: 7, Failures: 0, Errors: 0, Skipped: 0, Time elapsed: 0.102 sec - in org.apache.logging.log4j.core.util.datetime.FastDateParser_MoreOrLessTest
Running org.apache.logging.log4j.core.util.datetime.FastDateParser_TimeZoneStrategyTest
Tests run: 2, Failures: 0, Errors: 0, Skipped: 0, Time elapsed: 3.951 sec - in org.apache.logging.log4j.core.util.datetime.FastDateParser_TimeZoneStrategyTest
Running org.apache.logging.log4j.core.util.datetime.FixedDateFormatTest
Tests run: 25, Failures: 0, Errors: 0, Skipped: 0, Time elapsed: 1.74 sec - in org.apache.logging.log4j.core.util.datetime.FixedDateFormatTest
Running org.apache.logging.log4j.core.util.DummyNanoClockTest
Tests run: 2, Failures: 0, Errors: 0, Skipped: 0, Time elapsed: 0.005 sec - in org.apache.logging.log4j.core.util.DummyNanoClockTest
Running org.apache.logging.log4j.core.util.FileUtilsTest
Tests run: 4, Failures: 0, Errors: 0, Skipped: 0, Time elapsed: 0.069 sec - in org.apache.logging.log4j.core.util.FileUtilsTest
Running org.apache.logging.log4j.core.util.IntegersTest
Tests run: 2, Failures: 0, Errors: 0, Skipped: 0, Time elapsed: 0 sec - in org.apache.logging.log4j.core.util.IntegersTest
Running org.apache.logging.log4j.core.util.JsonUtilsTest
Tests run: 3, Failures: 0, Errors: 0, Skipped: 0, Time elapsed: 0 sec - in org.apache.logging.log4j.core.util.JsonUtilsTest
Running org.apache.logging.log4j.core.util.LoaderTest
Tests run: 2, Failures: 0, Errors: 0, Skipped: 0, Time elapsed: 0.073 sec - in org.apache.logging.log4j.core.util.LoaderTest
Running org.apache.logging.log4j.core.util.NetUtilsTest
Tests run: 3, Failures: 0, Errors: 0, Skipped: 0, Time elapsed: 0.07 sec - in org.apache.logging.log4j.core.util.NetUtilsTest
Running org.apache.logging.log4j.core.util.ShutdownCallbackRegistryTest
Tests run: 1, Failures: 0, Errors: 0, Skipped: 0, Time elapsed: 0.972 sec - in org.apache.logging.log4j.core.util.ShutdownCallbackRegistryTest
Running org.apache.logging.log4j.core.util.SystemClockTest
Tests run: 2, Failures: 0, Errors: 0, Skipped: 0, Time elapsed: 0.107 sec - in org.apache.logging.log4j.core.util.SystemClockTest
Running org.apache.logging.log4j.core.util.SystemNanoClockTest
Tests run: 1, Failures: 0, Errors: 0, Skipped: 0, Time elapsed: 0.005 sec - in org.apache.logging.log4j.core.util.SystemNanoClockTest
Running org.apache.logging.log4j.core.util.ThrowablesTest
Tests run: 6, Failures: 0, Errors: 0, Skipped: 0, Time elapsed: 0.001 sec - in org.apache.logging.log4j.core.util.ThrowablesTest
Running org.apache.logging.log4j.core.util.UuidTest
Elapsed for 2000 UUIDS = 2228831190 Average = 1114415 ns
Elapsed for 200 UUIDS = 77251 Average = 386 ns
Tests run: 2, Failures: 0, Errors: 0, Skipped: 0, Time elapsed: 0.247 sec - in org.apache.logging.log4j.core.util.UuidTest
Running org.apache.logging.log4j.core.util.WatchManagerTest
Tests run: 1, Failures: 0, Errors: 0, Skipped: 1, Time elapsed: 0.015 sec - in org.apache.logging.log4j.core.util.WatchManagerTest
Running org.apache.logging.log4j.MarkerMixInJsonTest
Tests run: 3, Failures: 0, Errors: 0, Skipped: 0, Time elapsed: 0.745 sec - in org.apache.logging.log4j.MarkerMixInJsonTest
Running org.apache.logging.log4j.MarkerMixInXmlTest
Tests run: 3, Failures: 0, Errors: 0, Skipped: 0, Time elapsed: 0.871 sec - in org.apache.logging.log4j.MarkerMixInXmlTest
Running org.apache.logging.log4j.MarkerMixInYamlTest
Tests run: 3, Failures: 0, Errors: 0, Skipped: 0, Time elapsed: 0.748 sec - in org.apache.logging.log4j.MarkerMixInYamlTest
Running org.apache.logging.log4j.message.MutableLogEventWithReusableParamMsgTest
Tests run: 1, Failures: 0, Errors: 0, Skipped: 0, Time elapsed: 0.082 sec - in org.apache.logging.log4j.message.MutableLogEventWithReusableParamMsgTest

Results :

Tests in error: 
  SyslogAppenderCustomLayoutTest>SyslogAppenderTest.testUDPAppender:77->SyslogAppenderTest.initUDPTestEnvironment:94
» Bind
  SyslogAppenderCustomLayoutTest>SyslogAppenderTest.testUDPStructuredAppender:86->SyslogAppenderTest.initUDPTestEnvironment:94
» Bind
  TlsSyslogAppenderTest.sendLargeLegacyBsdMessageOverTls:50->initTlsTestEnvironment:103
» Bind
  TlsSyslogAppenderTest.sendLegacyBsdMessagesOverTls:61->initTlsTestEnvironment:103 »
Bind
  TlsSyslogAppenderTest.sendStructuredMessageOverTls:68->initTlsTestEnvironment:103 »
Bind
  TlsSyslogAppenderTest.sendStructuredMessagesOverTls:76->initTlsTestEnvironment:103 »
Bind
  TlsSyslogAppenderTest>SyslogAppenderTest.testDefaultAppender:62->SyslogAppenderTest.initTCPTestEnvironment:100
» Bind
  TlsSyslogAppenderTest>SyslogAppenderTest.testTCPAppender:54->SyslogAppenderTest.initTCPTestEnvironment:100
» Bind
  TlsSyslogAppenderTest>SyslogAppenderTest.testTCPStructuredAppender:70->SyslogAppenderTest.initTCPTestEnvironment:100
» Bind

Tests run: 1899, Failures: 0, Errors: 9, Skipped: 30

[INFO] ------------------------------------------------------------------------
[INFO] Reactor Summary:
[INFO] 
[INFO] Apache Log4j 2 ..................................... SUCCESS [  2.869 s]
[INFO] Apache Log4j API ................................... SUCCESS [ 25.506 s]
[INFO] Apache Log4j Core .................................. FAILURE [15:56 min]
[INFO] Apache Log4j Core Integration Tests ................ SKIPPED
[INFO] Apache Log4j 1.x Compatibility API ................. SKIPPED
[INFO] Apache Log4j SLF4J Binding ......................... SKIPPED
[INFO] Apache Log4j to SLF4J Adapter ...................... SKIPPED
[INFO] Apache Log4j Commons Logging Bridge ................ SKIPPED
[INFO] Apache Log4j Flume Bridge .......................... SKIPPED
[INFO] Apache Log4j Web ................................... SKIPPED
[INFO] Apache Log4j Tag Library ........................... SKIPPED
[INFO] Apache Log4j JMX GUI ............................... SKIPPED
[INFO] Apache Log4j Samples ............................... SKIPPED
[INFO] Apache Log4j Samples: Flume - Common ............... SKIPPED
[INFO] Apache Log4j Samples: Flume - Remote ............... SKIPPED
[INFO] Apache Log4j Samples: Flume - Embedded ............. SKIPPED
[INFO] Apache Log4j Samples: Configuration ................ SKIPPED
[INFO] Apache Log4j Samples: LoggerProperties ............. SKIPPED
[INFO] Apache Log4j Scala 2.11 wrapper for Log4j API ...... SKIPPED
[INFO] Apache Log4j Samples: Scala API .................... SKIPPED
[INFO] Apache Log4j OSGi .................................. SKIPPED
[INFO] Apache Log4j BOM ................................... SKIPPED
[INFO] Apache Log4j NoSQL ................................. SKIPPED
[INFO] Apache Log4J Performance Tests ..................... SKIPPED
[INFO] Apache Log4j Streaming Interface ................... SKIPPED
[INFO] Apache Log4j JUL Adapter ........................... SKIPPED
[INFO] Apache Log4j Liquibase Binding ..................... SKIPPED
[INFO] Apache Log4j Scala 2.10 wrapper for Log4j API ...... SKIPPED
[INFO] ------------------------------------------------------------------------
[INFO] BUILD FAILURE
[INFO] ------------------------------------------------------------------------
[INFO] Total time: 16:27 min
[INFO] Finished at: 2017-04-02T18:19:49+00:00
[INFO] Final Memory: 60M/1469M
[INFO] ------------------------------------------------------------------------
[ERROR] Failed to execute goal org.apache.maven.plugins:maven-surefire-plugin:2.19.1:test
(default-test) on project log4j-core: There are test failures.
[ERROR] 
[ERROR] Please refer to F:\jenkins\jenkins-slave\workspace\Log4jWindows\Windows Slaves\Windows\jdk\JDK
1.7 (unlimited security) 64-bit Windows only\log4j-core\target\surefire-reports for the individual
test results.
[ERROR] -> [Help 1]
[ERROR] 
[ERROR] To see the full stack trace of the errors, re-run Maven with the -e switch.
[ERROR] Re-run Maven using the -X switch to enable full debug logging.
[ERROR] 
[ERROR] For more information about the errors and possible solutions, please read the following
articles:
[ERROR] [Help 1] http://cwiki.apache.org/confluence/display/MAVEN/MojoFailureException
[ERROR] 
[ERROR] After correcting the problems, you can resume the build with the command
[ERROR]   mvn <goals> -rf :log4j-core
Build step 'Execute Windows batch command' marked build as failure

---------------------------------------------------------------------
To unsubscribe, e-mail: log4j-dev-unsubscribe@logging.apache.org
For additional commands, e-mail: log4j-dev-help@logging.apache.org


Mime
View raw message