logging-log4j-dev mailing list archives

Site index · List index
Message view « Date » · « Thread »
Top « Date » · « Thread »
From Apache Jenkins Server <jenk...@builds.apache.org>
Subject Build failed in Jenkins: Log4j 2.x #2639
Date Sun, 29 Jan 2017 22:45:27 GMT
See <https://builds.apache.org/job/Log4j%202.x/2639/changes>

Changes:

[Matt Sicker] Add fake site distribution to make maven-site-plugin happy

[Matt Sicker] [LOG4J2-1802]: Migrate component sites to markdown

------------------------------------------
[...truncated 327 lines...]
  cast to Object[] for a non-varargs call and to suppress this warning
[WARNING] <https://builds.apache.org/job/Log4j%202.x/ws/log4j-api/src/test/java/org/apache/logging/log4j/message/ReusableParameterizedMessageTest.java>:[56,78]
non-varargs call of varargs method with inexact argument type for last parameter;
  cast to Object for a varargs call
  cast to Object[] for a non-varargs call and to suppress this warning
[WARNING] <https://builds.apache.org/job/Log4j%202.x/ws/log4j-api/src/test/java/org/apache/logging/log4j/message/ReusableParameterizedMessageTest.java>:[64,78]
non-varargs call of varargs method with inexact argument type for last parameter;
  cast to Object for a varargs call
  cast to Object[] for a non-varargs call and to suppress this warning
[WARNING] <https://builds.apache.org/job/Log4j%202.x/ws/log4j-api/src/test/java/org/apache/logging/log4j/message/ReusableParameterizedMessageTest.java>:[72,78]
non-varargs call of varargs method with inexact argument type for last parameter;
  cast to Object for a varargs call
  cast to Object[] for a non-varargs call and to suppress this warning
[WARNING] <https://builds.apache.org/job/Log4j%202.x/ws/log4j-api/src/test/java/org/apache/logging/log4j/message/ReusableParameterizedMessageTest.java>:[80,78]
non-varargs call of varargs method with inexact argument type for last parameter;
  cast to Object for a varargs call
  cast to Object[] for a non-varargs call and to suppress this warning
[WARNING] <https://builds.apache.org/job/Log4j%202.x/ws/log4j-api/src/test/java/org/apache/logging/log4j/message/ReusableParameterizedMessageTest.java>:[88,78]
non-varargs call of varargs method with inexact argument type for last parameter;
  cast to Object for a varargs call
  cast to Object[] for a non-varargs call and to suppress this warning
[WARNING] <https://builds.apache.org/job/Log4j%202.x/ws/log4j-api/src/test/java/org/apache/logging/log4j/message/ReusableParameterizedMessageTest.java>:[96,78]
non-varargs call of varargs method with inexact argument type for last parameter;
  cast to Object for a varargs call
  cast to Object[] for a non-varargs call and to suppress this warning
[WARNING] <https://builds.apache.org/job/Log4j%202.x/ws/log4j-api/src/test/java/org/apache/logging/log4j/message/ReusableParameterizedMessageTest.java>:[104,78]
non-varargs call of varargs method with inexact argument type for last parameter;
  cast to Object for a varargs call
  cast to Object[] for a non-varargs call and to suppress this warning
[WARNING] <https://builds.apache.org/job/Log4j%202.x/ws/log4j-api/src/test/java/org/apache/logging/log4j/message/ReusableParameterizedMessageTest.java>:[112,78]
non-varargs call of varargs method with inexact argument type for last parameter;
  cast to Object for a varargs call
  cast to Object[] for a non-varargs call and to suppress this warning
[WARNING] <https://builds.apache.org/job/Log4j%202.x/ws/log4j-api/src/test/java/org/apache/logging/log4j/message/FormattedMessageTest.java>:[117,61]
non-varargs call of varargs method with inexact argument type for last parameter;
  cast to Object for a varargs call
  cast to Object[] for a non-varargs call and to suppress this warning
[WARNING] <https://builds.apache.org/job/Log4j%202.x/ws/log4j-api/src/test/java/org/apache/logging/log4j/AbstractLoggerTest.java>:[797,14]
[deprecation] MessageSupplier in org.apache.logging.log4j.util has been deprecated
[WARNING] <https://builds.apache.org/job/Log4j%202.x/ws/log4j-api/src/test/java/org/apache/logging/log4j/AbstractLoggerTest.java>:[797,45]
[deprecation] MessageSupplier in org.apache.logging.log4j.util has been deprecated
[WARNING] <https://builds.apache.org/job/Log4j%202.x/ws/log4j-api/src/test/java/org/apache/logging/log4j/AbstractLoggerTest.java>:[825,14]
[deprecation] MessageSupplier in org.apache.logging.log4j.util has been deprecated
[WARNING] <https://builds.apache.org/job/Log4j%202.x/ws/log4j-api/src/test/java/org/apache/logging/log4j/AbstractLoggerTest.java>:[825,45]
[deprecation] MessageSupplier in org.apache.logging.log4j.util has been deprecated
[WARNING] <https://builds.apache.org/job/Log4j%202.x/ws/log4j-api/src/test/java/org/apache/logging/log4j/util/LambdaUtilTest.java>:[46,50]
[deprecation] MessageSupplier in org.apache.logging.log4j.util has been deprecated
[WARNING] <https://builds.apache.org/job/Log4j%202.x/ws/log4j-api/src/test/java/org/apache/logging/log4j/util/LambdaUtilTest.java>:[63,46]
[deprecation] MessageSupplier in org.apache.logging.log4j.util has been deprecated
[WARNING] <https://builds.apache.org/job/Log4j%202.x/ws/log4j-api/src/test/java/org/apache/logging/log4j/util/LambdaUtilTest.java>:[79,27]
[deprecation] MessageSupplier in org.apache.logging.log4j.util has been deprecated
[WARNING] <https://builds.apache.org/job/Log4j%202.x/ws/log4j-api/src/test/java/org/apache/logging/log4j/CloseableThreadContextTest.java>:[45,51]
[try] auto-closeable resource ignored is never referenced in body of corresponding try statement
[WARNING] <https://builds.apache.org/job/Log4j%202.x/ws/log4j-api/src/test/java/org/apache/logging/log4j/CloseableThreadContextTest.java>:[54,51]
[try] auto-closeable resource ignored is never referenced in body of corresponding try statement
[WARNING] <https://builds.apache.org/job/Log4j%202.x/ws/log4j-api/src/test/java/org/apache/logging/log4j/CloseableThreadContextTest.java>:[67,55]
[try] auto-closeable resource ignored2 is never referenced in body of corresponding try statement
[WARNING] <https://builds.apache.org/job/Log4j%202.x/ws/log4j-api/src/test/java/org/apache/logging/log4j/CloseableThreadContextTest.java>:[65,51]
[try] auto-closeable resource ignored is never referenced in body of corresponding try statement
[WARNING] <https://builds.apache.org/job/Log4j%202.x/ws/log4j-api/src/test/java/org/apache/logging/log4j/CloseableThreadContextTest.java>:[79,51]
[try] auto-closeable resource ignored is never referenced in body of corresponding try statement
[WARNING] <https://builds.apache.org/job/Log4j%202.x/ws/log4j-api/src/test/java/org/apache/logging/log4j/CloseableThreadContextTest.java>:[90,51]
[try] auto-closeable resource ignored is never referenced in body of corresponding try statement
[WARNING] <https://builds.apache.org/job/Log4j%202.x/ws/log4j-api/src/test/java/org/apache/logging/log4j/CloseableThreadContextTest.java>:[99,51]
[try] auto-closeable resource ignored is never referenced in body of corresponding try statement
[WARNING] <https://builds.apache.org/job/Log4j%202.x/ws/log4j-api/src/test/java/org/apache/logging/log4j/CloseableThreadContextTest.java>:[109,51]
[try] auto-closeable resource ignored is never referenced in body of corresponding try statement
[WARNING] <https://builds.apache.org/job/Log4j%202.x/ws/log4j-api/src/test/java/org/apache/logging/log4j/CloseableThreadContextTest.java>:[120,51]
[try] auto-closeable resource ignored is never referenced in body of corresponding try statement
[WARNING] <https://builds.apache.org/job/Log4j%202.x/ws/log4j-api/src/test/java/org/apache/logging/log4j/CloseableThreadContextTest.java>:[129,51]
[try] auto-closeable resource ignored is never referenced in body of corresponding try statement
[WARNING] <https://builds.apache.org/job/Log4j%202.x/ws/log4j-api/src/test/java/org/apache/logging/log4j/CloseableThreadContextTest.java>:[138,51]
[try] auto-closeable resource ignored is never referenced in body of corresponding try statement
[WARNING] <https://builds.apache.org/job/Log4j%202.x/ws/log4j-api/src/test/java/org/apache/logging/log4j/CloseableThreadContextTest.java>:[201,51]
[try] auto-closeable resource ignored is never referenced in body of corresponding try statement
[WARNING] <https://builds.apache.org/job/Log4j%202.x/ws/log4j-api/src/test/java/org/apache/logging/log4j/CloseableThreadContextTest.java>:[215,51]
[try] auto-closeable resource ignored is never referenced in body of corresponding try statement
[INFO] 
[INFO] --- maven-surefire-plugin:2.19.1:test (default-test) @ log4j-api ---

-------------------------------------------------------
 T E S T S
-------------------------------------------------------
Running org.apache.logging.log4j.MarkerTest
Running org.apache.logging.log4j.util.Unbox1Test
Running org.apache.logging.log4j.AbstractLoggerTest
Running org.apache.logging.log4j.util.PropertiesUtilTest
Running org.apache.logging.log4j.util.Unbox2ConfigurableTest
Running org.apache.logging.log4j.util.StringsTest
Running org.apache.logging.log4j.util.LambdaUtilTest
Tests run: 7, Failures: 0, Errors: 0, Skipped: 0, Time elapsed: 0.293 sec - in org.apache.logging.log4j.MarkerTest
Running org.apache.logging.log4j.util.ReflectionUtilTest
Tests run: 2, Failures: 0, Errors: 0, Skipped: 0, Time elapsed: 0.17 sec - in org.apache.logging.log4j.util.StringsTest
Running org.apache.logging.log4j.util.SortedArrayStringMapTest
Tests run: 2, Failures: 0, Errors: 0, Skipped: 0, Time elapsed: 0.122 sec - in org.apache.logging.log4j.util.PropertiesUtilTest
Running org.apache.logging.log4j.LoggerTest
Tests run: 11, Failures: 0, Errors: 0, Skipped: 0, Time elapsed: 0.322 sec - in org.apache.logging.log4j.util.Unbox1Test
Running org.apache.logging.log4j.CloseableThreadContextTest
Tests run: 2, Failures: 0, Errors: 0, Skipped: 2, Time elapsed: 0.27 sec - in org.apache.logging.log4j.util.Unbox2ConfigurableTest
Running org.apache.logging.log4j.TraceLoggingTest
Tests run: 18, Failures: 0, Errors: 0, Skipped: 0, Time elapsed: 0.367 sec - in org.apache.logging.log4j.AbstractLoggerTest
Running org.apache.logging.log4j.spi.LoggerAdapterTest
Tests run: 7, Failures: 0, Errors: 0, Skipped: 0, Time elapsed: 0.131 sec - in org.apache.logging.log4j.util.ReflectionUtilTest
Tests run: 10, Failures: 0, Errors: 0, Skipped: 0, Time elapsed: 0.25 sec - in org.apache.logging.log4j.util.LambdaUtilTest
Running org.apache.logging.log4j.spi.MutableThreadContextStackTest
Running org.apache.logging.log4j.spi.DefaultThreadContextStackTest
Tests run: 14, Failures: 0, Errors: 0, Skipped: 0, Time elapsed: 0.102 sec - in org.apache.logging.log4j.CloseableThreadContextTest
Running org.apache.logging.log4j.spi.DefaultThreadContextMapTest
Tests run: 32, Failures: 0, Errors: 0, Skipped: 0, Time elapsed: 0.076 sec - in org.apache.logging.log4j.spi.MutableThreadContextStackTest
Running org.apache.logging.log4j.simple.SimpleLoggerTest
Running org.apache.logging.log4j.ThreadContextInheritanceTest
Tests run: 15, Failures: 0, Errors: 0, Skipped: 0, Time elapsed: 0.088 sec - in org.apache.logging.log4j.spi.DefaultThreadContextMapTest
Running org.apache.logging.log4j.message.LocalizedMessageTest
Tests run: 25, Failures: 0, Errors: 0, Skipped: 0, Time elapsed: 0.118 sec - in org.apache.logging.log4j.spi.DefaultThreadContextStackTest
Running org.apache.logging.log4j.message.ParameterizedMessageTest
ERROR TestError [Ljava.lang.Object;@29a4903e
ERROR TestError Logging with a size 1 Object[] only one param {}
ERROR TestError Logging with an empty Object[] {} {}
ERROR TestError Logging without args {}
ERROR TestError Logging without args
Tests run: 5, Failures: 0, Errors: 0, Skipped: 0, Time elapsed: 0.068 sec - in org.apache.logging.log4j.simple.SimpleLoggerTest
Running org.apache.logging.log4j.message.ReusableParameterizedMessageTest
Tests run: 12, Failures: 0, Errors: 0, Skipped: 0, Time elapsed: 0.036 sec - in org.apache.logging.log4j.message.ParameterizedMessageTest
Running org.apache.logging.log4j.message.StringFormattedMessageTest
Tests run: 11, Failures: 0, Errors: 0, Skipped: 0, Time elapsed: 0.016 sec - in org.apache.logging.log4j.message.ReusableParameterizedMessageTest
Running org.apache.logging.log4j.message.MessageFormatMessageSerializationTest
Tests run: 6, Failures: 0, Errors: 0, Skipped: 0, Time elapsed: 0.159 sec - in org.apache.logging.log4j.message.LocalizedMessageTest
Tests run: 8, Failures: 0, Errors: 0, Skipped: 0, Time elapsed: 0.123 sec - in org.apache.logging.log4j.message.StringFormattedMessageTest
Running org.apache.logging.log4j.message.MessageFormatsPerfTest
Running org.apache.logging.log4j.message.StructuredDataMessageTest
Timer Parameterized stopped. Elapsed time: 0.003567408 seconds Average per iteration: 0.000007134
seconds
Tests run: 6, Failures: 0, Errors: 0, Skipped: 0, Time elapsed: 0.125 sec - in org.apache.logging.log4j.message.MessageFormatMessageSerializationTest
Running org.apache.logging.log4j.message.MapMessageTest
Timer FormattedParameterized stopped. Elapsed time: 0.029303230 seconds Average per iteration:
0.000058606 seconds
Tests run: 4, Failures: 0, Errors: 0, Skipped: 0, Time elapsed: 0.034 sec - in org.apache.logging.log4j.message.StructuredDataMessageTest
Tests run: 6, Failures: 0, Errors: 0, Skipped: 0, Time elapsed: 0.024 sec - in org.apache.logging.log4j.message.MapMessageTest
Running org.apache.logging.log4j.message.ObjectArrayMessageTest
Timer MessageFormat stopped. Elapsed time: 0.025457618 seconds Average per iteration: 0.000050915
seconds
Running org.apache.logging.log4j.message.ParameterFormatterTest
Tests run: 2, Failures: 0, Errors: 0, Skipped: 0, Time elapsed: 0.007 sec - in org.apache.logging.log4j.message.ObjectArrayMessageTest
Running org.apache.logging.log4j.message.ReusableMessageFactoryTest
Tests run: 17, Failures: 0, Errors: 0, Skipped: 0, Time elapsed: 0.021 sec - in org.apache.logging.log4j.message.ParameterFormatterTest
Running org.apache.logging.log4j.message.SimpleMessageTest
Tests run: 1, Failures: 0, Errors: 0, Skipped: 0, Time elapsed: 0.002 sec - in org.apache.logging.log4j.message.SimpleMessageTest
Running org.apache.logging.log4j.message.ThreadDumpMessageTest
Tests run: 2, Failures: 0, Errors: 0, Skipped: 0, Time elapsed: 0.445 sec - in org.apache.logging.log4j.TraceLoggingTest
Running org.apache.logging.log4j.message.ReusableSimpleMessageTest
Tests run: 11, Failures: 0, Errors: 0, Skipped: 0, Time elapsed: 0.033 sec - in org.apache.logging.log4j.message.ReusableSimpleMessageTest
Running org.apache.logging.log4j.message.MessageFormatMessageTest
Tests run: 4, Failures: 0, Errors: 0, Skipped: 0, Time elapsed: 0.073 sec - in org.apache.logging.log4j.message.ReusableMessageFactoryTest
Running org.apache.logging.log4j.message.LocalizedMessageFactoryTest
Tests run: 1, Failures: 0, Errors: 0, Skipped: 0, Time elapsed: 0.008 sec - in org.apache.logging.log4j.message.LocalizedMessageFactoryTest
Running org.apache.logging.log4j.message.FormattedMessageTest
Timer StringFormat stopped. Elapsed time: 0.116409954 seconds Average per iteration: 0.000232819
seconds
Parameterized is 32.63 times faster than StringFormat.
Parameterized is 7.14 times faster than MessageFormat.
Parameterized is 8.21 times faster than Formatted.
Tests run: 4, Failures: 0, Errors: 0, Skipped: 0, Time elapsed: 0.2 sec - in org.apache.logging.log4j.message.MessageFormatsPerfTest
Running org.apache.logging.log4j.message.ObjectMessageTest
Tests run: 11, Failures: 0, Errors: 0, Skipped: 0, Time elapsed: 0.053 sec - in org.apache.logging.log4j.message.FormattedMessageTest
Tests run: 7, Failures: 0, Errors: 0, Skipped: 0, Time elapsed: 0.083 sec - in org.apache.logging.log4j.message.MessageFormatMessageTest
Running org.apache.logging.log4j.NoopThreadContextTest
Running org.apache.logging.log4j.message.ReusableObjectMessageTest
Tests run: 11, Failures: 0, Errors: 0, Skipped: 0, Time elapsed: 0.068 sec - in org.apache.logging.log4j.message.ReusableObjectMessageTest
Running org.apache.logging.log4j.status.StatusLoggerSerializationTest
Tests run: 7, Failures: 0, Errors: 0, Skipped: 0, Time elapsed: 0.118 sec - in org.apache.logging.log4j.message.ObjectMessageTest
Running org.apache.logging.log4j.EventLoggerTest
Tests run: 1, Failures: 0, Errors: 0, Skipped: 1, Time elapsed: 0.026 sec - in org.apache.logging.log4j.status.StatusLoggerSerializationTest
Running org.apache.logging.log4j.LoggerSupplierTest
Tests run: 1, Failures: 0, Errors: 0, Skipped: 0, Time elapsed: 0.122 sec - in org.apache.logging.log4j.NoopThreadContextTest
Running org.apache.logging.log4j.ThreadContextTest
Tests run: 1, Failures: 0, Errors: 0, Skipped: 0, Time elapsed: 0.12 sec - in org.apache.logging.log4j.EventLoggerTest
Running org.apache.logging.log4j.LogManagerTest
Tests run: 5, Failures: 0, Errors: 0, Skipped: 0, Time elapsed: 0.378 sec - in org.apache.logging.log4j.message.ThreadDumpMessageTest
Running org.apache.logging.log4j.LambdaLoggerTest
Tests run: 2, Failures: 0, Errors: 0, Skipped: 0, Time elapsed: 0.032 sec - in org.apache.logging.log4j.LogManagerTest
Running org.apache.logging.log4j.LevelTest
Tests run: 9, Failures: 0, Errors: 0, Skipped: 0, Time elapsed: 0.005 sec - in org.apache.logging.log4j.LevelTest
Tests run: 71, Failures: 0, Errors: 0, Skipped: 0, Time elapsed: 0.145 sec - in org.apache.logging.log4j.LambdaLoggerTest
Tests run: 55, Failures: 0, Errors: 0, Skipped: 0, Time elapsed: 1.333 sec - in org.apache.logging.log4j.util.SortedArrayStringMapTest
Timer ThreadContextCopy stopped. Elapsed time: 1.052957398 seconds Average per iteration:
0.000001052 seconds
Timer ThreadContextTest stopped. Elapsed time: 1.053069512 seconds
Tests run: 14, Failures: 0, Errors: 0, Skipped: 0, Time elapsed: 1.097 sec - in org.apache.logging.log4j.ThreadContextTest
Timer ThreadContextCopy stopped. Elapsed time: 1.237265821 seconds Average per iteration:
0.000001237 seconds
Timer ThreadContextTest stopped. Elapsed time: 1.237544690 seconds
Tests run: 12, Failures: 0, Errors: 0, Skipped: 0, Time elapsed: 1.714 sec - in org.apache.logging.log4j.ThreadContextInheritanceTest
Tests run: 53, Failures: 0, Errors: 0, Skipped: 0, Time elapsed: 2.071 sec - in org.apache.logging.log4j.LoggerTest
Tests run: 12, Failures: 0, Errors: 0, Skipped: 0, Time elapsed: 1.43 sec - in org.apache.logging.log4j.LoggerSupplierTest
Java HotSpot(TM) 64-Bit Server VM warning: INFO: os::commit_memory(0x00000007cc200000, 529530880,
0) failed; error='Cannot allocate memory' (errno=12)
#
# There is insufficient memory for the Java Runtime Environment to continue.
# Native memory allocation (malloc) failed to allocate 529530880 bytes for committing reserved
memory.
# An error report file with more information is saved as:
# <https://builds.apache.org/job/Log4j%202.x/ws/log4j-api/hs_err_pid24341.log>

Results :

Tests run: 517, Failures: 0, Errors: 0, Skipped: 3

[JENKINS] Recording test results
[INFO] ------------------------------------------------------------------------
[INFO] Reactor Summary:
[INFO] 
[INFO] Apache Log4j 2 ..................................... SUCCESS [02:27 min]
[INFO] Apache Log4j API ................................... FAILURE [ 35.019 s]
[INFO] Apache Log4j Core .................................. SKIPPED
[INFO] Apache Log4j 1.x Compatibility API ................. SKIPPED
[INFO] Apache Log4j SLF4J Binding ......................... SKIPPED
[INFO] Apache Log4j to SLF4J Adapter ...................... SKIPPED
[INFO] Apache Log4j Commons Logging Bridge ................ SKIPPED
[INFO] Apache Log4j Flume Bridge .......................... SKIPPED
[INFO] Apache Log4j Web ................................... SKIPPED
[INFO] Apache Log4j Tag Library ........................... SKIPPED
[INFO] Apache Log4j JMX GUI ............................... SKIPPED
[INFO] Apache Log4j Samples ............................... SKIPPED
[INFO] Apache Log4j Samples: Flume - Common ............... SKIPPED
[INFO] Apache Log4j Samples: Flume - Remote ............... SKIPPED
[INFO] Apache Log4j Samples: Flume - Embedded ............. SKIPPED
[INFO] Apache Log4j Samples: Configuration ................ SKIPPED
[INFO] Apache Log4j Samples: LoggerProperties ............. SKIPPED
[INFO] Apache Log4j Scala 2.11 wrapper for Log4j API ...... SKIPPED
[INFO] Apache Log4j Samples: Scala API .................... SKIPPED
[INFO] Apache Log4j OSGi .................................. SKIPPED
[INFO] Apache Log4j BOM ................................... SKIPPED
[INFO] Apache Log4j NoSQL ................................. SKIPPED
[INFO] Apache Log4J Performance Tests ..................... SKIPPED
[INFO] Apache Log4j Streaming Interface ................... SKIPPED
[INFO] Apache Log4j JUL Adapter ........................... SKIPPED
[INFO] Apache Log4j Liquibase Binding ..................... SKIPPED
[INFO] Apache Log4j Scala 2.10 wrapper for Log4j API ...... SKIPPED
[INFO] ------------------------------------------------------------------------
[INFO] BUILD FAILURE
[INFO] ------------------------------------------------------------------------
[INFO] Total time: 03:27 min
[INFO] Finished at: 2017-01-29T22:45:00+00:00
[INFO] Final Memory: 95M/812M
[INFO] ------------------------------------------------------------------------
[ERROR] Failed to execute goal org.apache.maven.plugins:maven-surefire-plugin:2.19.1:test
(default-test) on project log4j-api: ExecutionException The forked VM terminated without properly
saying goodbye. VM crash or System.exit called?
[ERROR] Command was /bin/sh -c cd "<https://builds.apache.org/job/Log4j%202.x/ws/log4j-api">
&& /usr/local/asfpackages/java/jdk1.7.0_80/jre/bin/java -XX:MaxPermSize=512m -jar
'<https://builds.apache.org/job/Log4j%202.x/ws/log4j-api/target/surefire/surefirebooter5294871248000411944.jar'>
'<https://builds.apache.org/job/Log4j%202.x/ws/log4j-api/target/surefire/surefire6891633532096258065tmp'>
'<https://builds.apache.org/job/Log4j%202.x/ws/log4j-api/target/surefire/surefire_21311132136675811027tmp'>
[ERROR] -> [Help 1]
[ERROR] 
[ERROR] To see the full stack trace of the errors, re-run Maven with the -e switch.
[ERROR] Re-run Maven using the -X switch to enable full debug logging.
[ERROR] 
[ERROR] For more information about the errors and possible solutions, please read the following
articles:
[ERROR] [Help 1] http://cwiki.apache.org/confluence/display/MAVEN/MojoFailureException
[ERROR] 
[ERROR] After correcting the problems, you can resume the build with the command
[ERROR]   mvn <goals> -rf :log4j-api
[JENKINS] Archiving <https://builds.apache.org/job/Log4j%202.x/ws/log4j-samples/flume-remote/pom.xml>
to org.apache.logging.log4j.samples/log4j-samples-flume-remote/2.8.1-SNAPSHOT/log4j-samples-flume-remote-2.8.1-SNAPSHOT.pom
[JENKINS] Archiving <https://builds.apache.org/job/Log4j%202.x/ws/log4j-jmx-gui/pom.xml>
to org.apache.logging.log4j/log4j-jmx-gui/2.8.1-SNAPSHOT/log4j-jmx-gui-2.8.1-SNAPSHOT.pom
[JENKINS] Archiving <https://builds.apache.org/job/Log4j%202.x/ws/log4j-api/pom.xml>
to org.apache.logging.log4j/log4j-api/2.8.1-SNAPSHOT/log4j-api-2.8.1-SNAPSHOT.pom
[JENKINS] Archiving <https://builds.apache.org/job/Log4j%202.x/ws/log4j-flume-ng/pom.xml>
to org.apache.logging.log4j/log4j-flume-ng/2.8.1-SNAPSHOT/log4j-flume-ng-2.8.1-SNAPSHOT.pom
[JENKINS] Archiving <https://builds.apache.org/job/Log4j%202.x/ws/log4j-samples/pom.xml>
to org.apache.logging.log4j.samples/log4j-samples/2.8.1-SNAPSHOT/log4j-samples-2.8.1-SNAPSHOT.pom
[JENKINS] Archiving <https://builds.apache.org/job/Log4j%202.x/ws/log4j-samples/scala-api/pom.xml>
to org.apache.logging.log4j.samples/log4j-samples-scala-api/2.8.1-SNAPSHOT/log4j-samples-scala-api-2.8.1-SNAPSHOT.pom
[JENKINS] Archiving <https://builds.apache.org/job/Log4j%202.x/ws/log4j-core/pom.xml>
to org.apache.logging.log4j/log4j-core/2.8.1-SNAPSHOT/log4j-core-2.8.1-SNAPSHOT.pom
[JENKINS] Archiving <https://builds.apache.org/job/Log4j%202.x/ws/log4j-perf/pom.xml>
to org.apache.logging.log4j/log4j-perf/2.8.1-SNAPSHOT/log4j-perf-2.8.1-SNAPSHOT.pom
[JENKINS] Archiving <https://builds.apache.org/job/Log4j%202.x/ws/log4j-api-scala_2.10/pom.xml>
to org.apache.logging.log4j/log4j-api-scala_2.10/2.8.1-SNAPSHOT/log4j-api-scala_2.10-2.8.1-SNAPSHOT.pom
[JENKINS] Archiving <https://builds.apache.org/job/Log4j%202.x/ws/log4j-samples/loggerProperties/pom.xml>
to org.apache.logging.log4j.samples/log4j-samples-loggerProperties/2.8.1-SNAPSHOT/log4j-samples-loggerProperties-2.8.1-SNAPSHOT.pom
[JENKINS] Archiving <https://builds.apache.org/job/Log4j%202.x/ws/log4j-samples/flume-embedded/pom.xml>
to org.apache.logging.log4j.samples/log4j-samples-flume-embedded/2.8.1-SNAPSHOT/log4j-samples-flume-embedded-2.8.1-SNAPSHOT.pom
[JENKINS] Archiving <https://builds.apache.org/job/Log4j%202.x/ws/log4j-api-scala_2.11/pom.xml>
to org.apache.logging.log4j/log4j-api-scala_2.11/2.8.1-SNAPSHOT/log4j-api-scala_2.11-2.8.1-SNAPSHOT.pom
[JENKINS] Archiving <https://builds.apache.org/job/Log4j%202.x/ws/log4j-liquibase/pom.xml>
to org.apache.logging.log4j/log4j-liquibase/2.8.1-SNAPSHOT/log4j-liquibase-2.8.1-SNAPSHOT.pom
[JENKINS] Archiving <https://builds.apache.org/job/Log4j%202.x/ws/log4j-web/pom.xml>
to org.apache.logging.log4j/log4j-web/2.8.1-SNAPSHOT/log4j-web-2.8.1-SNAPSHOT.pom
[JENKINS] Archiving <https://builds.apache.org/job/Log4j%202.x/ws/log4j-jcl/pom.xml>
to org.apache.logging.log4j/log4j-jcl/2.8.1-SNAPSHOT/log4j-jcl-2.8.1-SNAPSHOT.pom
[JENKINS] Archiving <https://builds.apache.org/job/Log4j%202.x/ws/log4j-nosql/pom.xml>
to org.apache.logging.log4j/log4j-nosql/2.8.1-SNAPSHOT/log4j-nosql-2.8.1-SNAPSHOT.pom
[JENKINS] Archiving <https://builds.apache.org/job/Log4j%202.x/ws/log4j-taglib/pom.xml>
to org.apache.logging.log4j/log4j-taglib/2.8.1-SNAPSHOT/log4j-taglib-2.8.1-SNAPSHOT.pom
[JENKINS] Archiving <https://builds.apache.org/job/Log4j%202.x/ws/log4j-1.2-api/pom.xml>
to org.apache.logging.log4j/log4j-1.2-api/2.8.1-SNAPSHOT/log4j-1.2-api-2.8.1-SNAPSHOT.pom
[JENKINS] Archiving <https://builds.apache.org/job/Log4j%202.x/ws/log4j-samples/configuration/pom.xml>
to org.apache.logging.log4j.samples/log4j-samples-configuration/2.8.1-SNAPSHOT/log4j-samples-configuration-2.8.1-SNAPSHOT.pom
[JENKINS] Archiving <https://builds.apache.org/job/Log4j%202.x/ws/log4j-osgi/pom.xml>
to org.apache.logging.log4j/log4j-osgi/2.8.1-SNAPSHOT/log4j-osgi-2.8.1-SNAPSHOT.pom
[JENKINS] Archiving <https://builds.apache.org/job/Log4j%202.x/ws/log4j-bom/pom.xml>
to org.apache.logging.log4j/log4j-bom/2.8.1-SNAPSHOT/log4j-bom-2.8.1-SNAPSHOT.pom
[JENKINS] Archiving <https://builds.apache.org/job/Log4j%202.x/ws/log4j-jul/pom.xml>
to org.apache.logging.log4j/log4j-jul/2.8.1-SNAPSHOT/log4j-jul-2.8.1-SNAPSHOT.pom
[JENKINS] Archiving <https://builds.apache.org/job/Log4j%202.x/ws/log4j-slf4j-impl/pom.xml>
to org.apache.logging.log4j/log4j-slf4j-impl/2.8.1-SNAPSHOT/log4j-slf4j-impl-2.8.1-SNAPSHOT.pom
[JENKINS] Archiving <https://builds.apache.org/job/Log4j%202.x/ws/log4j-iostreams/pom.xml>
to org.apache.logging.log4j/log4j-iostreams/2.8.1-SNAPSHOT/log4j-iostreams-2.8.1-SNAPSHOT.pom
[JENKINS] Archiving <https://builds.apache.org/job/Log4j%202.x/ws/pom.xml> to org.apache.logging.log4j/log4j/2.8.1-SNAPSHOT/log4j-2.8.1-SNAPSHOT.pom
[JENKINS] Archiving <https://builds.apache.org/job/Log4j%202.x/ws/target/log4j-2.8.1-SNAPSHOT-site.xml>
to org.apache.logging.log4j/log4j/2.8.1-SNAPSHOT/log4j-2.8.1-SNAPSHOT-site.xml
[JENKINS] Archiving <https://builds.apache.org/job/Log4j%202.x/ws/log4j-to-slf4j/pom.xml>
to org.apache.logging.log4j/log4j-to-slf4j/2.8.1-SNAPSHOT/log4j-to-slf4j-2.8.1-SNAPSHOT.pom
[JENKINS] Archiving <https://builds.apache.org/job/Log4j%202.x/ws/log4j-samples/flume-common/pom.xml>
to org.apache.logging.log4j.samples/log4j-samples-flume-common/2.8.1-SNAPSHOT/log4j-samples-flume-common-2.8.1-SNAPSHOT.pom
channel stopped

---------------------------------------------------------------------
To unsubscribe, e-mail: log4j-dev-unsubscribe@logging.apache.org
For additional commands, e-mail: log4j-dev-help@logging.apache.org


Mime
View raw message