logging-log4j-dev mailing list archives

Site index · List index
Message view « Date » · « Thread »
Top « Date » · « Thread »
From Apache Jenkins Server <jenk...@builds.apache.org>
Subject Build failed in Jenkins: Log4j 2.x #2133
Date Sun, 07 Aug 2016 14:58:10 GMT
See <https://builds.apache.org/job/Log4j%202.x/2133/changes>

Changes:

[rpopma] reverting spelling

[rpopma] LOG4J2-1448 Allow comma separated agents, host list to be passed to

------------------------------------------
[...truncated 3555 lines...]
[INFO] --- maven-failsafe-plugin:2.19.1:integration-test (integration-tests) @ log4j-to-slf4j
---
[JENKINS] Recording test results
[INFO] 
[INFO] --- maven-failsafe-plugin:2.19.1:verify (verify) @ log4j-to-slf4j ---
[JENKINS] Recording test results
[INFO] 
[INFO] --- maven-source-plugin:3.0.1:jar-no-fork (attach-sources) @ log4j-to-slf4j ---
[INFO] Building jar: <https://builds.apache.org/job/Log4j%202.x/ws/log4j-to-slf4j/target/log4j-to-slf4j-2.6.3-SNAPSHOT-sources.jar>
[INFO] 
[INFO] --- maven-install-plugin:2.3.1:install (default-install) @ log4j-to-slf4j ---
[INFO] Installing <https://builds.apache.org/job/Log4j%202.x/ws/log4j-to-slf4j/target/log4j-to-slf4j-2.6.3-SNAPSHOT.jar>
to /home/jenkins/jenkins-slave/maven-repositories/2/org/apache/logging/log4j/log4j-to-slf4j/2.6.3-SNAPSHOT/log4j-to-slf4j-2.6.3-SNAPSHOT.jar
[INFO] Installing <https://builds.apache.org/job/Log4j%202.x/ws/log4j-to-slf4j/pom.xml>
to /home/jenkins/jenkins-slave/maven-repositories/2/org/apache/logging/log4j/log4j-to-slf4j/2.6.3-SNAPSHOT/log4j-to-slf4j-2.6.3-SNAPSHOT.pom
[INFO] Installing <https://builds.apache.org/job/Log4j%202.x/ws/log4j-to-slf4j/target/log4j-to-slf4j-2.6.3-SNAPSHOT-sources.jar>
to /home/jenkins/jenkins-slave/maven-repositories/2/org/apache/logging/log4j/log4j-to-slf4j/2.6.3-SNAPSHOT/log4j-to-slf4j-2.6.3-SNAPSHOT-sources.jar
[INFO]                                                                         
[INFO] ------------------------------------------------------------------------
[INFO] Building Apache Log4j Commons Logging Bridge 2.6.3-SNAPSHOT
[INFO] ------------------------------------------------------------------------
[INFO] 
[INFO] --- maven-clean-plugin:2.4.1:clean (default-clean) @ log4j-jcl ---
[INFO] Deleting <https://builds.apache.org/job/Log4j%202.x/ws/log4j-jcl/target>
[INFO] 
[INFO] --- maven-remote-resources-plugin:1.1:process (default) @ log4j-jcl ---
[INFO] 
[INFO] --- maven-resources-plugin:2.7:resources (default-resources) @ log4j-jcl ---
[INFO] Using 'UTF-8' encoding to copy filtered resources.
[INFO] Copying 1 resource
[INFO] Copying 3 resources
[INFO] 
[INFO] --- maven-compiler-plugin:3.5.1:compile (default-compile) @ log4j-jcl ---
[INFO] Changes detected - recompiling the module!
[INFO] Compiling 4 source files to <https://builds.apache.org/job/Log4j%202.x/ws/log4j-jcl/target/classes>
[INFO] 
[INFO] --- maven-bundle-plugin:2.5.3:manifest (default) @ log4j-jcl ---
[INFO] 
[INFO] --- maven-resources-plugin:2.7:testResources (default-testResources) @ log4j-jcl ---
[INFO] Using 'UTF-8' encoding to copy filtered resources.
[INFO] Copying 1 resource
[INFO] Copying 3 resources
[INFO] 
[INFO] --- maven-compiler-plugin:3.5.1:testCompile (default-testCompile) @ log4j-jcl ---
[INFO] Changes detected - recompiling the module!
[INFO] Compiling 2 source files to <https://builds.apache.org/job/Log4j%202.x/ws/log4j-jcl/target/test-classes>
[INFO] 
[INFO] --- maven-surefire-plugin:2.19.1:test (default-test) @ log4j-jcl ---

-------------------------------------------------------
 T E S T S
-------------------------------------------------------
Running org.apache.logging.log4j.jcl.CallerInformationTest
Running org.apache.logging.log4j.jcl.LoggerTest
Tests run: 2, Failures: 0, Errors: 0, Skipped: 0, Time elapsed: 0.622 sec - in org.apache.logging.log4j.jcl.CallerInformationTest
Tests run: 1, Failures: 0, Errors: 0, Skipped: 0, Time elapsed: 0.667 sec - in org.apache.logging.log4j.jcl.LoggerTest

Results :

Tests run: 3, Failures: 0, Errors: 0, Skipped: 0

[JENKINS] Recording test results
[INFO] 
[INFO] --- maven-jar-plugin:2.3.1:jar (default-jar) @ log4j-jcl ---
[INFO] Building jar: <https://builds.apache.org/job/Log4j%202.x/ws/log4j-jcl/target/log4j-jcl-2.6.3-SNAPSHOT.jar>
[INFO] 
[INFO] --- maven-failsafe-plugin:2.19.1:integration-test (integration-tests) @ log4j-jcl ---
[JENKINS] Recording test results
[INFO] 
[INFO] --- maven-failsafe-plugin:2.19.1:verify (verify) @ log4j-jcl ---
[JENKINS] Recording test results[INFO] 
[INFO] --- maven-source-plugin:3.0.1:jar-no-fork (attach-sources) @ log4j-jcl ---

[INFO] Building jar: <https://builds.apache.org/job/Log4j%202.x/ws/log4j-jcl/target/log4j-jcl-2.6.3-SNAPSHOT-sources.jar>
[INFO] 
[INFO] --- maven-install-plugin:2.3.1:install (default-install) @ log4j-jcl ---
[INFO] Installing <https://builds.apache.org/job/Log4j%202.x/ws/log4j-jcl/target/log4j-jcl-2.6.3-SNAPSHOT.jar>
to /home/jenkins/jenkins-slave/maven-repositories/2/org/apache/logging/log4j/log4j-jcl/2.6.3-SNAPSHOT/log4j-jcl-2.6.3-SNAPSHOT.jar
[INFO] Installing <https://builds.apache.org/job/Log4j%202.x/ws/log4j-jcl/pom.xml> to
/home/jenkins/jenkins-slave/maven-repositories/2/org/apache/logging/log4j/log4j-jcl/2.6.3-SNAPSHOT/log4j-jcl-2.6.3-SNAPSHOT.pom
[INFO] Installing <https://builds.apache.org/job/Log4j%202.x/ws/log4j-jcl/target/log4j-jcl-2.6.3-SNAPSHOT-sources.jar>
to /home/jenkins/jenkins-slave/maven-repositories/2/org/apache/logging/log4j/log4j-jcl/2.6.3-SNAPSHOT/log4j-jcl-2.6.3-SNAPSHOT-sources.jar
[INFO]                                                                         
[INFO] ------------------------------------------------------------------------
[INFO] Building Apache Log4j Flume Bridge 2.6.3-SNAPSHOT
[INFO] ------------------------------------------------------------------------
[INFO] 
[INFO] --- maven-clean-plugin:2.4.1:clean (default-clean) @ log4j-flume-ng ---
[INFO] Deleting <https://builds.apache.org/job/Log4j%202.x/ws/log4j-flume-ng/target>
[INFO] 
[INFO] --- maven-remote-resources-plugin:1.1:process (default) @ log4j-flume-ng ---
[INFO] 
[INFO] --- maven-resources-plugin:2.7:resources (default-resources) @ log4j-flume-ng ---
[INFO] Using 'UTF-8' encoding to copy filtered resources.
[INFO] skip non existing resourceDirectory <https://builds.apache.org/job/Log4j%202.x/ws/log4j-flume-ng/src/main/resources>
[INFO] Copying 3 resources
[INFO] 
[INFO] --- maven-compiler-plugin:3.5.1:compile (default-compile) @ log4j-flume-ng ---
[INFO] Changes detected - recompiling the module!
[INFO] Compiling 11 source files to <https://builds.apache.org/job/Log4j%202.x/ws/log4j-flume-ng/target/classes>
[WARNING] bad path element "/home/jenkins/jenkins-slave/maven-repositories/2/org/apache/derby/derby/10.8.2.2/derbyLocale_zh_TW.jar":
no such file or directory
<https://builds.apache.org/job/Log4j%202.x/ws/log4j-flume-ng/src/main/java/org/apache/logging/log4j/flume/appender/FlumeAppender.java>:[281,40]
non-varargs call of varargs method with inexact argument type for last parameter;
[INFO] 
[INFO] --- maven-bundle-plugin:2.5.3:manifest (default) @ log4j-flume-ng ---
[INFO] 
[INFO] --- maven-resources-plugin:2.7:testResources (default-testResources) @ log4j-flume-ng
---
[INFO] Using 'UTF-8' encoding to copy filtered resources.
[INFO] Copying 3 resources
[INFO] Copying 3 resources
[INFO] 
[INFO] --- maven-compiler-plugin:3.5.1:testCompile (default-testCompile) @ log4j-flume-ng
---
[INFO] Changes detected - recompiling the module!
[INFO] Compiling 6 source files to <https://builds.apache.org/job/Log4j%202.x/ws/log4j-flume-ng/target/test-classes>
[INFO] -------------------------------------------------------------
[ERROR] COMPILATION ERROR : 
[INFO] -------------------------------------------------------------
[ERROR] bad path element "/home/jenkins/jenkins-slave/maven-repositories/2/com/sun/xml/bind/jaxb-impl/2.2.3-1/jaxb1-impl.jar":
no such file or directory
warning: No processor claimed any of these annotations: org.junit.AfterClass,org.junit.Before,org.junit.After,org.junit.BeforeClass,org.junit.Test
<https://builds.apache.org/job/Log4j%202.x/ws/log4j-flume-ng/src/test/java/org/apache/logging/log4j/flume/appender/FlumeAppenderTest.java>:[121,56]
error: method createAppender in class FlumeAppender cannot be applied to given types;
[ERROR] <null>,String,String,<null>,String,String,String,String,String,String,<null>,<null>,<null>,<null>,<null>,String,String,<null>,<null>,<null>,<null>
  reason: actual and formal argument lists differ in length
<https://builds.apache.org/job/Log4j%202.x/ws/log4j-flume-ng/src/test/java/org/apache/logging/log4j/flume/appender/FlumeAppenderTest.java>:[150,56]
error: method createAppender in class FlumeAppender cannot be applied to given types;
[ERROR] <null>,String,String,<null>,String,String,String,String,String,String,<null>,<null>,<null>,String,<null>,String,String,<null>,<null>,<null>,<null>
  reason: actual and formal argument lists differ in length
<https://builds.apache.org/job/Log4j%202.x/ws/log4j-flume-ng/src/test/java/org/apache/logging/log4j/flume/appender/FlumeAppenderTest.java>:[189,56]
error: method createAppender in class FlumeAppender cannot be applied to given types;
[ERROR] <null>,String,String,<null>,String,String,String,String,String,String,<null>,<null>,<null>,<null>,<null>,String,String,<null>,<null>,<null>,<null>
  reason: actual and formal argument lists differ in length
<https://builds.apache.org/job/Log4j%202.x/ws/log4j-flume-ng/src/test/java/org/apache/logging/log4j/flume/appender/FlumeAppenderTest.java>:[224,56]
error: method createAppender in class FlumeAppender cannot be applied to given types;
[ERROR] <null>,String,String,<null>,String,String,String,String,String,String,<null>,<null>,<null>,<null>,<null>,String,String,<null>,<null>,<null>,<null>
  reason: actual and formal argument lists differ in length
<https://builds.apache.org/job/Log4j%202.x/ws/log4j-flume-ng/src/test/java/org/apache/logging/log4j/flume/appender/FlumeAppenderTest.java>:[264,56]
error: method createAppender in class FlumeAppender cannot be applied to given types;
[ERROR] <null>,String,String,<null>,String,String,String,String,String,String,<null>,<null>,<null>,<null>,<null>,String,String,<null>,<null>,<null>,<null>
  reason: actual and formal argument lists differ in length
<https://builds.apache.org/job/Log4j%202.x/ws/log4j-flume-ng/src/test/java/org/apache/logging/log4j/flume/appender/FlumeAppenderTest.java>:[298,56]
error: method createAppender in class FlumeAppender cannot be applied to given types;
[ERROR] <null>,String,String,<null>,String,String,String,String,String,String,<null>,<null>,<null>,<null>,<null>,String,String,<null>,<null>,<null>,<null>
  reason: actual and formal argument lists differ in length
<https://builds.apache.org/job/Log4j%202.x/ws/log4j-flume-ng/src/test/java/org/apache/logging/log4j/flume/appender/FlumeAppenderTest.java>:[332,56]
error: method createAppender in class FlumeAppender cannot be applied to given types;
[ERROR] <null>,String,String,<null>,String,String,String,String,String,String,<null>,<null>,<null>,<null>,<null>,String,String,<null>,<null>,<null>,<null>
  reason: actual and formal argument lists differ in length
<https://builds.apache.org/job/Log4j%202.x/ws/log4j-flume-ng/src/test/java/org/apache/logging/log4j/flume/appender/FlumeAppenderTest.java>:[362,56]
error: method createAppender in class FlumeAppender cannot be applied to given types;
[ERROR] <null>,String,String,<null>,String,String,String,String,String,String,<null>,<null>,<null>,<null>,<null>,String,String,<null>,<null>,<null>,<null>
  reason: actual and formal argument lists differ in length
<https://builds.apache.org/job/Log4j%202.x/ws/log4j-flume-ng/src/test/java/org/apache/logging/log4j/flume/appender/FlumeAppenderTest.java>:[410,56]
error: method createAppender in class FlumeAppender cannot be applied to given types;
[INFO] 9 errors 
[INFO] -------------------------------------------------------------
[INFO] ------------------------------------------------------------------------
[INFO] Reactor Summary:
[INFO] 
[INFO] Apache Log4j 2 .................................... SUCCESS [  6.527 s]
[INFO] Apache Log4j API .................................. SUCCESS [ 19.502 s]
[INFO] Apache Log4j Core ................................. SUCCESS [15:25 min]
[INFO] Apache Log4j 1.x Compatibility API ................ SUCCESS [ 10.323 s]
[INFO] Apache Log4j SLF4J Binding ........................ SUCCESS [  6.833 s]
[INFO] Apache Log4j to SLF4J Adapter ..................... SUCCESS [  4.682 s]
[INFO] Apache Log4j Commons Logging Bridge ............... SUCCESS [  4.157 s]
[INFO] Apache Log4j Flume Bridge ......................... FAILURE [  7.996 s]
[INFO] Apache Log4j Web .................................. SKIPPED
[INFO] Apache Log4j Tag Library .......................... SKIPPED
[INFO] Apache Log4j JMX GUI .............................. SKIPPED
[INFO] Apache Log4j Samples .............................. SKIPPED
[INFO] Apache Log4j Samples: Flume - Common .............. SKIPPED
[INFO] Apache Log4j Samples: Flume - Remote .............. SKIPPED
[INFO] Apache Log4j Samples: Flume - Embedded ............ SKIPPED
[INFO] Apache Log4j Samples: Configuration ............... SKIPPED
[INFO] Apache Log4j Samples: LoggerProperties ............ SKIPPED
[INFO] Apache Log4j BOM .................................. SKIPPED
[INFO] Apache Log4j NoSQL ................................ SKIPPED
[INFO] Apache Log4J Performance Tests .................... SKIPPED
[INFO] Apache Log4j Streaming Interface .................. SKIPPED
[INFO] Apache Log4j JUL Adapter .......................... SKIPPED
[INFO] Apache Log4j Liquibase Binding .................... SKIPPED
[INFO] ------------------------------------------------------------------------
[INFO] BUILD FAILURE
[INFO] ------------------------------------------------------------------------
[INFO] Total time: 16:35 min
[INFO] Finished at: 2016-08-07T14:58:00+00:00
[INFO] Final Memory: 49M/556M
[INFO] ------------------------------------------------------------------------
Waiting for Jenkins to finish collecting data
[ERROR] Failed to execute goal org.apache.maven.plugins:maven-compiler-plugin:3.5.1:testCompile
(default-testCompile) on project log4j-flume-ng: Compilation failure: Compilation failure:
[ERROR] bad path element "/home/jenkins/jenkins-slave/maven-repositories/2/com/sun/xml/bind/jaxb-impl/2.2.3-1/jaxb1-impl.jar":
no such file or directory
[ERROR] warning: No processor claimed any of these annotations: org.junit.AfterClass,org.junit.Before,org.junit.After,org.junit.BeforeClass,org.junit.Test
[ERROR] <https://builds.apache.org/job/Log4j%202.x/ws/log4j-flume-ng/src/test/java/org/apache/logging/log4j/flume/appender/FlumeAppenderTest.java>:[121,56]
error: method createAppender in class FlumeAppender cannot be applied to given types;
[ERROR] <null>,String,String,<null>,String,String,String,String,String,String,<null>,<null>,<null>,<null>,<null>,String,String,<null>,<null>,<null>,<null>
[ERROR] reason: actual and formal argument lists differ in length
[ERROR] <https://builds.apache.org/job/Log4j%202.x/ws/log4j-flume-ng/src/test/java/org/apache/logging/log4j/flume/appender/FlumeAppenderTest.java>:[150,56]
error: method createAppender in class FlumeAppender cannot be applied to given types;
[ERROR] <null>,String,String,<null>,String,String,String,String,String,String,<null>,<null>,<null>,String,<null>,String,String,<null>,<null>,<null>,<null>
[ERROR] reason: actual and formal argument lists differ in length
[ERROR] <https://builds.apache.org/job/Log4j%202.x/ws/log4j-flume-ng/src/test/java/org/apache/logging/log4j/flume/appender/FlumeAppenderTest.java>:[189,56]
error: method createAppender in class FlumeAppender cannot be applied to given types;
[ERROR] <null>,String,String,<null>,String,String,String,String,String,String,<null>,<null>,<null>,<null>,<null>,String,String,<null>,<null>,<null>,<null>
[ERROR] reason: actual and formal argument lists differ in length
[ERROR] <https://builds.apache.org/job/Log4j%202.x/ws/log4j-flume-ng/src/test/java/org/apache/logging/log4j/flume/appender/FlumeAppenderTest.java>:[224,56]
error: method createAppender in class FlumeAppender cannot be applied to given types;
[ERROR] <null>,String,String,<null>,String,String,String,String,String,String,<null>,<null>,<null>,<null>,<null>,String,String,<null>,<null>,<null>,<null>
[ERROR] reason: actual and formal argument lists differ in length
[ERROR] <https://builds.apache.org/job/Log4j%202.x/ws/log4j-flume-ng/src/test/java/org/apache/logging/log4j/flume/appender/FlumeAppenderTest.java>:[264,56]
error: method createAppender in class FlumeAppender cannot be applied to given types;
[ERROR] <null>,String,String,<null>,String,String,String,String,String,String,<null>,<null>,<null>,<null>,<null>,String,String,<null>,<null>,<null>,<null>
[ERROR] reason: actual and formal argument lists differ in length
[ERROR] <https://builds.apache.org/job/Log4j%202.x/ws/log4j-flume-ng/src/test/java/org/apache/logging/log4j/flume/appender/FlumeAppenderTest.java>:[298,56]
error: method createAppender in class FlumeAppender cannot be applied to given types;
[ERROR] <null>,String,String,<null>,String,String,String,String,String,String,<null>,<null>,<null>,<null>,<null>,String,String,<null>,<null>,<null>,<null>
[ERROR] reason: actual and formal argument lists differ in length
[ERROR] <https://builds.apache.org/job/Log4j%202.x/ws/log4j-flume-ng/src/test/java/org/apache/logging/log4j/flume/appender/FlumeAppenderTest.java>:[332,56]
error: method createAppender in class FlumeAppender cannot be applied to given types;
[ERROR] <null>,String,String,<null>,String,String,String,String,String,String,<null>,<null>,<null>,<null>,<null>,String,String,<null>,<null>,<null>,<null>
[ERROR] reason: actual and formal argument lists differ in length
[ERROR] <https://builds.apache.org/job/Log4j%202.x/ws/log4j-flume-ng/src/test/java/org/apache/logging/log4j/flume/appender/FlumeAppenderTest.java>:[362,56]
error: method createAppender in class FlumeAppender cannot be applied to given types;
[ERROR] <null>,String,String,<null>,String,String,String,String,String,String,<null>,<null>,<null>,<null>,<null>,String,String,<null>,<null>,<null>,<null>
[ERROR] reason: actual and formal argument lists differ in length
[ERROR] <https://builds.apache.org/job/Log4j%202.x/ws/log4j-flume-ng/src/test/java/org/apache/logging/log4j/flume/appender/FlumeAppenderTest.java>:[410,56]
error: method createAppender in class FlumeAppender cannot be applied to given types;
[ERROR] -> [Help 1]
[ERROR] 
[ERROR] To see the full stack trace of the errors, re-run Maven with the -e switch.
[ERROR] Re-run Maven using the -X switch to enable full debug logging.
[ERROR] 
[ERROR] For more information about the errors and possible solutions, please read the following
articles:
[ERROR] [Help 1] http://cwiki.apache.org/confluence/display/MAVEN/MojoFailureException
[ERROR] 
[ERROR] After correcting the problems, you can resume the build with the command
[ERROR]   mvn <goals> -rf :log4j-flume-ng
[JENKINS] Archiving <https://builds.apache.org/job/Log4j%202.x/ws/log4j-taglib/pom.xml>
to org.apache.logging.log4j/log4j-taglib/2.6.3-SNAPSHOT/log4j-taglib-2.6.3-SNAPSHOT.pom
[JENKINS] Archiving <https://builds.apache.org/job/Log4j%202.x/ws/log4j-1.2-api/pom.xml>
to org.apache.logging.log4j/log4j-1.2-api/2.6.3-SNAPSHOT/log4j-1.2-api-2.6.3-SNAPSHOT.pom
[JENKINS] Archiving <https://builds.apache.org/job/Log4j%202.x/ws/log4j-1.2-api/target/log4j-1.2-api-2.6.3-SNAPSHOT.jar>
to org.apache.logging.log4j/log4j-1.2-api/2.6.3-SNAPSHOT/log4j-1.2-api-2.6.3-SNAPSHOT.jar
[JENKINS] Archiving <https://builds.apache.org/job/Log4j%202.x/ws/log4j-1.2-api/target/log4j-1.2-api-2.6.3-SNAPSHOT-sources.jar>
to org.apache.logging.log4j/log4j-1.2-api/2.6.3-SNAPSHOT/log4j-1.2-api-2.6.3-SNAPSHOT-sources.jar
[JENKINS] Archiving <https://builds.apache.org/job/Log4j%202.x/ws/log4j-samples/loggerProperties/pom.xml>
to org.apache.logging.log4j.samples/log4j-samples-loggerProperties/2.6.3-SNAPSHOT/log4j-samples-loggerProperties-2.6.3-SNAPSHOT.pom
[JENKINS] Archiving <https://builds.apache.org/job/Log4j%202.x/ws/log4j-jmx-gui/pom.xml>
to org.apache.logging.log4j/log4j-jmx-gui/2.6.3-SNAPSHOT/log4j-jmx-gui-2.6.3-SNAPSHOT.pom
[JENKINS] Archiving <https://builds.apache.org/job/Log4j%202.x/ws/log4j-nosql/pom.xml>
to org.apache.logging.log4j/log4j-nosql/2.6.3-SNAPSHOT/log4j-nosql-2.6.3-SNAPSHOT.pom
[JENKINS] Archiving <https://builds.apache.org/job/Log4j%202.x/ws/log4j-samples/configuration/pom.xml>
to org.apache.logging.log4j.samples/log4j-samples-configuration/2.6.3-SNAPSHOT/log4j-samples-configuration-2.6.3-SNAPSHOT.pom
[JENKINS] Archiving <https://builds.apache.org/job/Log4j%202.x/ws/log4j-core/pom.xml>
to org.apache.logging.log4j/log4j-core/2.6.3-SNAPSHOT/log4j-core-2.6.3-SNAPSHOT.pom
[JENKINS] Archiving <https://builds.apache.org/job/Log4j%202.x/ws/log4j-core/target/log4j-core-2.6.3-SNAPSHOT.jar>
to org.apache.logging.log4j/log4j-core/2.6.3-SNAPSHOT/log4j-core-2.6.3-SNAPSHOT.jar
[JENKINS] Archiving <https://builds.apache.org/job/Log4j%202.x/ws/log4j-core/target/log4j-core-2.6.3-SNAPSHOT-tests.jar>
to org.apache.logging.log4j/log4j-core/2.6.3-SNAPSHOT/log4j-core-2.6.3-SNAPSHOT-tests.jar
[JENKINS] Archiving <https://builds.apache.org/job/Log4j%202.x/ws/log4j-core/target/log4j-core-2.6.3-SNAPSHOT-sources.jar>
to org.apache.logging.log4j/log4j-core/2.6.3-SNAPSHOT/log4j-core-2.6.3-SNAPSHOT-sources.jar
[JENKINS] Archiving <https://builds.apache.org/job/Log4j%202.x/ws/log4j-samples/flume-embedded/pom.xml>
to org.apache.logging.log4j.samples/log4j-samples-flume-embedded/2.6.3-SNAPSHOT/log4j-samples-flume-embedded-2.6.3-SNAPSHOT.pom
[JENKINS] Archiving <https://builds.apache.org/job/Log4j%202.x/ws/log4j-jcl/pom.xml>
to org.apache.logging.log4j/log4j-jcl/2.6.3-SNAPSHOT/log4j-jcl-2.6.3-SNAPSHOT.pom
[JENKINS] Archiving <https://builds.apache.org/job/Log4j%202.x/ws/log4j-jcl/target/log4j-jcl-2.6.3-SNAPSHOT.jar>
to org.apache.logging.log4j/log4j-jcl/2.6.3-SNAPSHOT/log4j-jcl-2.6.3-SNAPSHOT.jar
[JENKINS] Archiving <https://builds.apache.org/job/Log4j%202.x/ws/log4j-jcl/target/log4j-jcl-2.6.3-SNAPSHOT-sources.jar>
to org.apache.logging.log4j/log4j-jcl/2.6.3-SNAPSHOT/log4j-jcl-2.6.3-SNAPSHOT-sources.jar
[JENKINS] Archiving <https://builds.apache.org/job/Log4j%202.x/ws/log4j-liquibase/pom.xml>
to org.apache.logging.log4j/log4j-liquibase/2.6.3-SNAPSHOT/log4j-liquibase-2.6.3-SNAPSHOT.pom
[JENKINS] Archiving <https://builds.apache.org/job/Log4j%202.x/ws/log4j-perf/pom.xml>
to org.apache.logging.log4j/log4j-perf/2.6.3-SNAPSHOT/log4j-perf-2.6.3-SNAPSHOT.pom
[JENKINS] Archiving <https://builds.apache.org/job/Log4j%202.x/ws/log4j-jul/pom.xml>
to org.apache.logging.log4j/log4j-jul/2.6.3-SNAPSHOT/log4j-jul-2.6.3-SNAPSHOT.pom
[JENKINS] Archiving <https://builds.apache.org/job/Log4j%202.x/ws/log4j-slf4j-impl/pom.xml>
to org.apache.logging.log4j/log4j-slf4j-impl/2.6.3-SNAPSHOT/log4j-slf4j-impl-2.6.3-SNAPSHOT.pom
[JENKINS] Archiving <https://builds.apache.org/job/Log4j%202.x/ws/log4j-slf4j-impl/target/log4j-slf4j-impl-2.6.3-SNAPSHOT.jar>
to org.apache.logging.log4j/log4j-slf4j-impl/2.6.3-SNAPSHOT/log4j-slf4j-impl-2.6.3-SNAPSHOT.jar
[JENKINS] Archiving <https://builds.apache.org/job/Log4j%202.x/ws/log4j-slf4j-impl/target/log4j-slf4j-impl-2.6.3-SNAPSHOT-sources.jar>
to org.apache.logging.log4j/log4j-slf4j-impl/2.6.3-SNAPSHOT/log4j-slf4j-impl-2.6.3-SNAPSHOT-sources.jar
[JENKINS] Archiving <https://builds.apache.org/job/Log4j%202.x/ws/log4j-samples/flume-common/pom.xml>
to org.apache.logging.log4j.samples/log4j-samples-flume-common/2.6.3-SNAPSHOT/log4j-samples-flume-common-2.6.3-SNAPSHOT.pom
[JENKINS] Archiving <https://builds.apache.org/job/Log4j%202.x/ws/log4j-web/pom.xml>
to org.apache.logging.log4j/log4j-web/2.6.3-SNAPSHOT/log4j-web-2.6.3-SNAPSHOT.pom
[JENKINS] Archiving <https://builds.apache.org/job/Log4j%202.x/ws/log4j-bom/pom.xml>
to org.apache.logging.log4j/log4j-bom/2.6.3-SNAPSHOT/log4j-bom-2.6.3-SNAPSHOT.pom
[JENKINS] Archiving <https://builds.apache.org/job/Log4j%202.x/ws/pom.xml> to org.apache.logging.log4j/log4j/2.6.3-SNAPSHOT/log4j-2.6.3-SNAPSHOT.pom
Compressed 51.13 KB of artifacts by 62.6% relative to #2132
[JENKINS] Archiving <https://builds.apache.org/job/Log4j%202.x/ws/log4j-iostreams/pom.xml>
to org.apache.logging.log4j/log4j-iostreams/2.6.3-SNAPSHOT/log4j-iostreams-2.6.3-SNAPSHOT.pom
[JENKINS] Archiving <https://builds.apache.org/job/Log4j%202.x/ws/log4j-to-slf4j/pom.xml>
to org.apache.logging.log4j/log4j-to-slf4j/2.6.3-SNAPSHOT/log4j-to-slf4j-2.6.3-SNAPSHOT.pom
[JENKINS] Archiving <https://builds.apache.org/job/Log4j%202.x/ws/log4j-to-slf4j/target/log4j-to-slf4j-2.6.3-SNAPSHOT.jar>
to org.apache.logging.log4j/log4j-to-slf4j/2.6.3-SNAPSHOT/log4j-to-slf4j-2.6.3-SNAPSHOT.jar
[JENKINS] Archiving <https://builds.apache.org/job/Log4j%202.x/ws/log4j-to-slf4j/target/log4j-to-slf4j-2.6.3-SNAPSHOT-sources.jar>
to org.apache.logging.log4j/log4j-to-slf4j/2.6.3-SNAPSHOT/log4j-to-slf4j-2.6.3-SNAPSHOT-sources.jar
[JENKINS] Archiving <https://builds.apache.org/job/Log4j%202.x/ws/log4j-flume-ng/pom.xml>
to org.apache.logging.log4j/log4j-flume-ng/2.6.3-SNAPSHOT/log4j-flume-ng-2.6.3-SNAPSHOT.pom
[JENKINS] Archiving <https://builds.apache.org/job/Log4j%202.x/ws/log4j-api/pom.xml>
to org.apache.logging.log4j/log4j-api/2.6.3-SNAPSHOT/log4j-api-2.6.3-SNAPSHOT.pom
[JENKINS] Archiving <https://builds.apache.org/job/Log4j%202.x/ws/log4j-api/target/log4j-api-2.6.3-SNAPSHOT.jar>
to org.apache.logging.log4j/log4j-api/2.6.3-SNAPSHOT/log4j-api-2.6.3-SNAPSHOT.jar
[JENKINS] Archiving <https://builds.apache.org/job/Log4j%202.x/ws/log4j-api/target/log4j-api-2.6.3-SNAPSHOT-tests.jar>
to org.apache.logging.log4j/log4j-api/2.6.3-SNAPSHOT/log4j-api-2.6.3-SNAPSHOT-tests.jar
[JENKINS] Archiving <https://builds.apache.org/job/Log4j%202.x/ws/log4j-api/target/log4j-api-2.6.3-SNAPSHOT-sources.jar>
to org.apache.logging.log4j/log4j-api/2.6.3-SNAPSHOT/log4j-api-2.6.3-SNAPSHOT-sources.jar
[JENKINS] Archiving <https://builds.apache.org/job/Log4j%202.x/ws/log4j-samples/flume-remote/pom.xml>
to org.apache.logging.log4j.samples/log4j-samples-flume-remote/2.6.3-SNAPSHOT/log4j-samples-flume-remote-2.6.3-SNAPSHOT.pom
[JENKINS] Archiving <https://builds.apache.org/job/Log4j%202.x/ws/log4j-samples/pom.xml>
to org.apache.logging.log4j.samples/log4j-samples/2.6.3-SNAPSHOT/log4j-samples-2.6.3-SNAPSHOT.pom
channel stopped

---------------------------------------------------------------------
To unsubscribe, e-mail: log4j-dev-unsubscribe@logging.apache.org
For additional commands, e-mail: log4j-dev-help@logging.apache.org


Mime
View raw message