logging-log4j-dev mailing list archives

Site index · List index
Message view « Date » · « Thread »
Top « Date » · « Thread »
From Apache Jenkins Server <jenk...@builds.apache.org>
Subject Build failed in Jenkins: Log4j 2.x #1699
Date Sun, 21 Feb 2016 03:57:21 GMT
See <https://builds.apache.org/job/Log4j%202.x/1699/changes>

Changes:

[rpopma] javadoc fix

[rpopma] LOG4J2-1274 add ByteBufferDestination interface

[rpopma] LOG4J2-1274 add Encoder interface

[rpopma] LOG4J2-1274 let Layout extend Encoder, with backwards compatible default

------------------------------------------
[...truncated 14501 lines...]
<https://builds.apache.org/job/Log4j%202.x/ws/log4j-perf/target/generated-sources/annotations/org/apache/logging/log4j/perf/jmh/generated/ThreadsafeDateFormatBenchmark_fixedDateFormat.java>:[91,55]
[rawtypes] found raw type: Result
[WARNING]   missing type arguments for generic class Result<T>
  where T is a type-variable:
    T extends Result<T> declared in class Result
<https://builds.apache.org/job/Log4j%202.x/ws/log4j-perf/target/generated-sources/annotations/org/apache/logging/log4j/perf/jmh/generated/ThreadsafeDateFormatBenchmark_fixedDateFormat.java>:[112,32]
[rawtypes] found raw type: Result
[WARNING]   missing type arguments for generic class Result<T>
  where T is a type-variable:
    T extends Result<T> declared in class Result
<https://builds.apache.org/job/Log4j%202.x/ws/log4j-perf/target/generated-sources/annotations/org/apache/logging/log4j/perf/jmh/generated/ThreadsafeDateFormatBenchmark_fixedDateFormat.java>:[150,23]
[rawtypes] found raw type: Result
[WARNING]   missing type arguments for generic class Result<T>
  where T is a type-variable:
    T extends Result<T> declared in class Result
<https://builds.apache.org/job/Log4j%202.x/ws/log4j-perf/target/generated-sources/annotations/org/apache/logging/log4j/perf/jmh/generated/ThreadsafeDateFormatBenchmark_fixedDateFormat.java>:[150,55]
[rawtypes] found raw type: Result
[WARNING]   missing type arguments for generic class Result<T>
  where T is a type-variable:
    T extends Result<T> declared in class Result
<https://builds.apache.org/job/Log4j%202.x/ws/log4j-perf/target/generated-sources/annotations/org/apache/logging/log4j/perf/jmh/generated/ThreadsafeDateFormatBenchmark_fixedDateFormat.java>:[171,32]
[rawtypes] found raw type: Result
[WARNING]   missing type arguments for generic class Result<T>
  where T is a type-variable:
    T extends Result<T> declared in class Result
<https://builds.apache.org/job/Log4j%202.x/ws/log4j-perf/target/generated-sources/annotations/org/apache/logging/log4j/perf/jmh/generated/ThreadsafeDateFormatBenchmark_fixedDateFormat.java>:[210,23]
[rawtypes] found raw type: Result
[WARNING]   missing type arguments for generic class Result<T>
  where T is a type-variable:
    T extends Result<T> declared in class Result
<https://builds.apache.org/job/Log4j%202.x/ws/log4j-perf/target/generated-sources/annotations/org/apache/logging/log4j/perf/jmh/generated/ThreadsafeDateFormatBenchmark_fixedDateFormat.java>:[210,55]
[rawtypes] found raw type: Result
[WARNING]   missing type arguments for generic class Result<T>
  where T is a type-variable:
    T extends Result<T> declared in class Result
<https://builds.apache.org/job/Log4j%202.x/ws/log4j-perf/target/generated-sources/annotations/org/apache/logging/log4j/perf/jmh/generated/ThreadsafeDateFormatBenchmark_fixedDateFormat.java>:[246,32]
[rawtypes] found raw type: Result
[WARNING]   missing type arguments for generic class Result<T>
  where T is a type-variable:
    T extends Result<T> declared in class Result
<https://builds.apache.org/job/Log4j%202.x/ws/log4j-perf/target/generated-sources/annotations/org/apache/logging/log4j/perf/jmh/generated/ThreadsafeDateFormatBenchmark_fixedDateFormat.java>:[271,23]
[rawtypes] found raw type: Result
[WARNING]   missing type arguments for generic class Result<T>
  where T is a type-variable:
    T extends Result<T> declared in class Result
<https://builds.apache.org/job/Log4j%202.x/ws/log4j-perf/target/generated-sources/annotations/org/apache/logging/log4j/perf/jmh/generated/ThreadsafeDateFormatBenchmark_fixedDateFormat.java>:[271,55]
[rawtypes] found raw type: Result
[WARNING]   missing type arguments for generic class Result<T>
  where T is a type-variable:
    T extends Result<T> declared in class Result
<https://builds.apache.org/job/Log4j%202.x/ws/log4j-perf/target/generated-sources/annotations/org/apache/logging/log4j/perf/jmh/generated/ThreadsafeDateFormatBenchmark_synchronizedSimpleDateFmt.java>:[53,32]
[rawtypes] found raw type: Result
[WARNING]   missing type arguments for generic class Result<T>
  where T is a type-variable:
    T extends Result<T> declared in class Result
<https://builds.apache.org/job/Log4j%202.x/ws/log4j-perf/target/generated-sources/annotations/org/apache/logging/log4j/perf/jmh/generated/ThreadsafeDateFormatBenchmark_synchronizedSimpleDateFmt.java>:[91,23]
[rawtypes] found raw type: Result
[WARNING]   missing type arguments for generic class Result<T>
  where T is a type-variable:
    T extends Result<T> declared in class Result
<https://builds.apache.org/job/Log4j%202.x/ws/log4j-perf/target/generated-sources/annotations/org/apache/logging/log4j/perf/jmh/generated/ThreadsafeDateFormatBenchmark_synchronizedSimpleDateFmt.java>:[91,55]
[rawtypes] found raw type: Result
[WARNING]   missing type arguments for generic class Result<T>
  where T is a type-variable:
    T extends Result<T> declared in class Result
<https://builds.apache.org/job/Log4j%202.x/ws/log4j-perf/target/generated-sources/annotations/org/apache/logging/log4j/perf/jmh/generated/ThreadsafeDateFormatBenchmark_synchronizedSimpleDateFmt.java>:[112,32]
[rawtypes] found raw type: Result
[WARNING]   missing type arguments for generic class Result<T>
  where T is a type-variable:
    T extends Result<T> declared in class Result
<https://builds.apache.org/job/Log4j%202.x/ws/log4j-perf/target/generated-sources/annotations/org/apache/logging/log4j/perf/jmh/generated/ThreadsafeDateFormatBenchmark_synchronizedSimpleDateFmt.java>:[150,23]
[rawtypes] found raw type: Result
[WARNING]   missing type arguments for generic class Result<T>
  where T is a type-variable:
    T extends Result<T> declared in class Result
<https://builds.apache.org/job/Log4j%202.x/ws/log4j-perf/target/generated-sources/annotations/org/apache/logging/log4j/perf/jmh/generated/ThreadsafeDateFormatBenchmark_synchronizedSimpleDateFmt.java>:[150,55]
[rawtypes] found raw type: Result
[WARNING]   missing type arguments for generic class Result<T>
  where T is a type-variable:
    T extends Result<T> declared in class Result
<https://builds.apache.org/job/Log4j%202.x/ws/log4j-perf/target/generated-sources/annotations/org/apache/logging/log4j/perf/jmh/generated/ThreadsafeDateFormatBenchmark_synchronizedSimpleDateFmt.java>:[171,32]
[rawtypes] found raw type: Result
[WARNING]   missing type arguments for generic class Result<T>
  where T is a type-variable:
    T extends Result<T> declared in class Result
<https://builds.apache.org/job/Log4j%202.x/ws/log4j-perf/target/generated-sources/annotations/org/apache/logging/log4j/perf/jmh/generated/ThreadsafeDateFormatBenchmark_synchronizedSimpleDateFmt.java>:[210,23]
[rawtypes] found raw type: Result
[WARNING]   missing type arguments for generic class Result<T>
  where T is a type-variable:
    T extends Result<T> declared in class Result
<https://builds.apache.org/job/Log4j%202.x/ws/log4j-perf/target/generated-sources/annotations/org/apache/logging/log4j/perf/jmh/generated/ThreadsafeDateFormatBenchmark_synchronizedSimpleDateFmt.java>:[210,55]
[rawtypes] found raw type: Result
[WARNING]   missing type arguments for generic class Result<T>
  where T is a type-variable:
    T extends Result<T> declared in class Result
<https://builds.apache.org/job/Log4j%202.x/ws/log4j-perf/target/generated-sources/annotations/org/apache/logging/log4j/perf/jmh/generated/ThreadsafeDateFormatBenchmark_synchronizedSimpleDateFmt.java>:[246,32]
[rawtypes] found raw type: Result
[WARNING]   missing type arguments for generic class Result<T>
  where T is a type-variable:
    T extends Result<T> declared in class Result
<https://builds.apache.org/job/Log4j%202.x/ws/log4j-perf/target/generated-sources/annotations/org/apache/logging/log4j/perf/jmh/generated/ThreadsafeDateFormatBenchmark_synchronizedSimpleDateFmt.java>:[271,23]
[rawtypes] found raw type: Result
[WARNING]   missing type arguments for generic class Result<T>
  where T is a type-variable:
    T extends Result<T> declared in class Result
<https://builds.apache.org/job/Log4j%202.x/ws/log4j-perf/target/generated-sources/annotations/org/apache/logging/log4j/perf/jmh/generated/ThreadsafeDateFormatBenchmark_synchronizedSimpleDateFmt.java>:[271,55]
[rawtypes] found raw type: Result
[WARNING]   missing type arguments for generic class Result<T>
  where T is a type-variable:
    T extends Result<T> declared in class Result
<https://builds.apache.org/job/Log4j%202.x/ws/log4j-perf/target/generated-sources/annotations/org/apache/logging/log4j/perf/jmh/generated/ThreadsafeDateFormatBenchmark_threadLocalSimpleDateFmt.java>:[53,32]
[rawtypes] found raw type: Result
[WARNING]   missing type arguments for generic class Result<T>
  where T is a type-variable:
    T extends Result<T> declared in class Result
<https://builds.apache.org/job/Log4j%202.x/ws/log4j-perf/target/generated-sources/annotations/org/apache/logging/log4j/perf/jmh/generated/ThreadsafeDateFormatBenchmark_threadLocalSimpleDateFmt.java>:[91,23]
[rawtypes] found raw type: Result
[WARNING]   missing type arguments for generic class Result<T>
  where T is a type-variable:
    T extends Result<T> declared in class Result
<https://builds.apache.org/job/Log4j%202.x/ws/log4j-perf/target/generated-sources/annotations/org/apache/logging/log4j/perf/jmh/generated/ThreadsafeDateFormatBenchmark_threadLocalSimpleDateFmt.java>:[91,55]
[rawtypes] found raw type: Result
[WARNING]   missing type arguments for generic class Result<T>
  where T is a type-variable:
    T extends Result<T> declared in class Result
<https://builds.apache.org/job/Log4j%202.x/ws/log4j-perf/target/generated-sources/annotations/org/apache/logging/log4j/perf/jmh/generated/ThreadsafeDateFormatBenchmark_threadLocalSimpleDateFmt.java>:[112,32]
[rawtypes] found raw type: Result
[WARNING]   missing type arguments for generic class Result<T>
  where T is a type-variable:
    T extends Result<T> declared in class Result
<https://builds.apache.org/job/Log4j%202.x/ws/log4j-perf/target/generated-sources/annotations/org/apache/logging/log4j/perf/jmh/generated/ThreadsafeDateFormatBenchmark_threadLocalSimpleDateFmt.java>:[150,23]
[rawtypes] found raw type: Result
[WARNING]   missing type arguments for generic class Result<T>
  where T is a type-variable:
    T extends Result<T> declared in class Result
<https://builds.apache.org/job/Log4j%202.x/ws/log4j-perf/target/generated-sources/annotations/org/apache/logging/log4j/perf/jmh/generated/ThreadsafeDateFormatBenchmark_threadLocalSimpleDateFmt.java>:[150,55]
[rawtypes] found raw type: Result
[WARNING]   missing type arguments for generic class Result<T>
  where T is a type-variable:
    T extends Result<T> declared in class Result
<https://builds.apache.org/job/Log4j%202.x/ws/log4j-perf/target/generated-sources/annotations/org/apache/logging/log4j/perf/jmh/generated/ThreadsafeDateFormatBenchmark_threadLocalSimpleDateFmt.java>:[171,32]
[rawtypes] found raw type: Result
[WARNING]   missing type arguments for generic class Result<T>
  where T is a type-variable:
    T extends Result<T> declared in class Result
<https://builds.apache.org/job/Log4j%202.x/ws/log4j-perf/target/generated-sources/annotations/org/apache/logging/log4j/perf/jmh/generated/ThreadsafeDateFormatBenchmark_threadLocalSimpleDateFmt.java>:[210,23]
[rawtypes] found raw type: Result
[WARNING]   missing type arguments for generic class Result<T>
  where T is a type-variable:
    T extends Result<T> declared in class Result
<https://builds.apache.org/job/Log4j%202.x/ws/log4j-perf/target/generated-sources/annotations/org/apache/logging/log4j/perf/jmh/generated/ThreadsafeDateFormatBenchmark_threadLocalSimpleDateFmt.java>:[210,55]
[rawtypes] found raw type: Result
[WARNING]   missing type arguments for generic class Result<T>
  where T is a type-variable:
    T extends Result<T> declared in class Result
<https://builds.apache.org/job/Log4j%202.x/ws/log4j-perf/target/generated-sources/annotations/org/apache/logging/log4j/perf/jmh/generated/ThreadsafeDateFormatBenchmark_threadLocalSimpleDateFmt.java>:[246,32]
[rawtypes] found raw type: Result
[WARNING]   missing type arguments for generic class Result<T>
  where T is a type-variable:
    T extends Result<T> declared in class Result
<https://builds.apache.org/job/Log4j%202.x/ws/log4j-perf/target/generated-sources/annotations/org/apache/logging/log4j/perf/jmh/generated/ThreadsafeDateFormatBenchmark_threadLocalSimpleDateFmt.java>:[271,23]
[rawtypes] found raw type: Result
[WARNING]   missing type arguments for generic class Result<T>
  where T is a type-variable:
    T extends Result<T> declared in class Result
<https://builds.apache.org/job/Log4j%202.x/ws/log4j-perf/target/generated-sources/annotations/org/apache/logging/log4j/perf/jmh/generated/ThreadsafeDateFormatBenchmark_threadLocalSimpleDateFmt.java>:[271,55]
[rawtypes] found raw type: Result
[INFO] 2793 warnings 
[INFO] -------------------------------------------------------------
[INFO] -------------------------------------------------------------
[ERROR] COMPILATION ERROR : 
[INFO] -------------------------------------------------------------
[ERROR] <https://builds.apache.org/job/Log4j%202.x/ws/log4j-perf/src/main/java/org/apache/logging/log4j/perf/nogc/NoGcLayout.java>:[36,7]
error: NoGcLayout is not abstract and does not override abstract method encode(LogEvent,ByteBufferDestination)
in Encoder
[INFO] 1 error
[INFO] -------------------------------------------------------------
[INFO] ------------------------------------------------------------------------
[INFO] Reactor Summary:
[INFO] 
[INFO] Apache Log4j 2 .................................... SUCCESS [ 11.341 s]
[INFO] Apache Log4j API .................................. SUCCESS [ 19.018 s]
[INFO] Apache Log4j Core ................................. SUCCESS [12:38 min]
[INFO] Apache Log4j 1.x Compatibility API ................ SUCCESS [ 13.206 s]
[INFO] Apache Log4j SLF4J Binding ........................ SUCCESS [  7.445 s]
[INFO] Apache Log4j to SLF4J Adapter ..................... SUCCESS [  5.052 s]
[INFO] Apache Log4j Commons Logging Bridge ............... SUCCESS [  4.612 s]
[INFO] Apache Log4j Flume Bridge ......................... SUCCESS [ 19.502 s]
[INFO] Apache Log4j Web .................................. SUCCESS [  6.061 s]
[INFO] Apache Log4j Tag Library .......................... SUCCESS [ 18.846 s]
[INFO] Apache Log4j JMX GUI .............................. SUCCESS [  2.869 s]
[INFO] Apache Log4j Samples .............................. SUCCESS [  0.694 s]
[INFO] Apache Log4j Samples: Flume - Common .............. SUCCESS [  2.944 s]
[INFO] Apache Log4j Samples: Flume - Remote .............. SUCCESS [  3.630 s]
[INFO] Apache Log4j Samples: Flume - Embedded ............ SUCCESS [  5.702 s]
[INFO] Apache Log4j Samples: Configuration ............... SUCCESS [  4.217 s]
[INFO] Apache Log4j Samples: LoggerProperties ............ SUCCESS [  4.866 s]
[INFO] Apache Log4j BOM .................................. SUCCESS [  0.576 s]
[INFO] Apache Log4j NoSQL ................................ SUCCESS [  5.613 s]
[INFO] Apache Log4J Performance Tests .................... FAILURE [ 14.307 s]
[INFO] Apache Log4j Streaming Interface .................. SKIPPED
[INFO] Apache Log4j JUL Adapter .......................... SKIPPED
[INFO] Apache Log4j Liquibase Binding .................... SKIPPED
[INFO] ------------------------------------------------------------------------
[INFO] BUILD FAILURE
[INFO] ------------------------------------------------------------------------
[INFO] Total time: 15:26 min
[INFO] Finished at: 2016-02-21T03:57:18+00:00
[INFO] Final Memory: 57M/814M
[INFO] ------------------------------------------------------------------------
Waiting for Jenkins to finish collecting data[ERROR] Failed to execute goal org.apache.maven.plugins:maven-compiler-plugin:3.5.1:compile
(default-compile) on project log4j-perf: Compilation failure
[ERROR] <https://builds.apache.org/job/Log4j%202.x/ws/log4j-perf/src/main/java/org/apache/logging/log4j/perf/nogc/NoGcLayout.java>:[36,7]
error: NoGcLayout is not abstract and does not override abstract method encode(LogEvent,ByteBufferDestination)
in Encoder
[ERROR] -> [Help 1]
[ERROR] 
[ERROR] To see the full stack trace of the errors, re-run Maven with the -e switch.
[ERROR] Re-run Maven using the -X switch to enable full debug logging.
[ERROR] 
[ERROR] For more information about the errors and possible solutions, please read the following
articles:
[ERROR] [Help 1] http://cwiki.apache.org/confluence/display/MAVEN/MojoFailureException
[ERROR] 
[ERROR] After correcting the problems, you can resume the build with the command
[ERROR]   mvn <goals> -rf :log4j-perf

[JENKINS] Archiving <https://builds.apache.org/job/Log4j%202.x/ws/log4j-taglib/pom.xml>
to org.apache.logging.log4j/log4j-taglib/2.6-SNAPSHOT/log4j-taglib-2.6-SNAPSHOT.pom
[JENKINS] Archiving <https://builds.apache.org/job/Log4j%202.x/ws/log4j-taglib/target/log4j-taglib-2.6-SNAPSHOT.jar>
to org.apache.logging.log4j/log4j-taglib/2.6-SNAPSHOT/log4j-taglib-2.6-SNAPSHOT.jar
[JENKINS] Archiving <https://builds.apache.org/job/Log4j%202.x/ws/log4j-taglib/target/log4j-taglib-2.6-SNAPSHOT-sources.jar>
to org.apache.logging.log4j/log4j-taglib/2.6-SNAPSHOT/log4j-taglib-2.6-SNAPSHOT-sources.jar
[JENKINS] Archiving <https://builds.apache.org/job/Log4j%202.x/ws/log4j-1.2-api/pom.xml>
to org.apache.logging.log4j/log4j-1.2-api/2.6-SNAPSHOT/log4j-1.2-api-2.6-SNAPSHOT.pom
[JENKINS] Archiving <https://builds.apache.org/job/Log4j%202.x/ws/log4j-1.2-api/target/log4j-1.2-api-2.6-SNAPSHOT.jar>
to org.apache.logging.log4j/log4j-1.2-api/2.6-SNAPSHOT/log4j-1.2-api-2.6-SNAPSHOT.jar
[JENKINS] Archiving <https://builds.apache.org/job/Log4j%202.x/ws/log4j-1.2-api/target/log4j-1.2-api-2.6-SNAPSHOT-sources.jar>
to org.apache.logging.log4j/log4j-1.2-api/2.6-SNAPSHOT/log4j-1.2-api-2.6-SNAPSHOT-sources.jar
[JENKINS] Archiving <https://builds.apache.org/job/Log4j%202.x/ws/log4j-samples/loggerProperties/pom.xml>
to org.apache.logging.log4j.samples/log4j-samples-loggerProperties/2.6-SNAPSHOT/log4j-samples-loggerProperties-2.6-SNAPSHOT.pom
[JENKINS] Archiving <https://builds.apache.org/job/Log4j%202.x/ws/log4j-samples/loggerProperties/target/log4j-samples-loggerProperties-2.6-SNAPSHOT.jar>
to org.apache.logging.log4j.samples/log4j-samples-loggerProperties/2.6-SNAPSHOT/log4j-samples-loggerProperties-2.6-SNAPSHOT.jar
[JENKINS] Archiving <https://builds.apache.org/job/Log4j%202.x/ws/log4j-samples/loggerProperties/target/log4j-samples-loggerProperties-2.6-SNAPSHOT-sources.jar>
to org.apache.logging.log4j.samples/log4j-samples-loggerProperties/2.6-SNAPSHOT/log4j-samples-loggerProperties-2.6-SNAPSHOT-sources.jar
[JENKINS] Archiving <https://builds.apache.org/job/Log4j%202.x/ws/log4j-jmx-gui/pom.xml>
to org.apache.logging.log4j/log4j-jmx-gui/2.6-SNAPSHOT/log4j-jmx-gui-2.6-SNAPSHOT.pom
[JENKINS] Archiving <https://builds.apache.org/job/Log4j%202.x/ws/log4j-jmx-gui/target/log4j-jmx-gui-2.6-SNAPSHOT.jar>
to org.apache.logging.log4j/log4j-jmx-gui/2.6-SNAPSHOT/log4j-jmx-gui-2.6-SNAPSHOT.jar
[JENKINS] Archiving <https://builds.apache.org/job/Log4j%202.x/ws/log4j-jmx-gui/target/log4j-jmx-gui-2.6-SNAPSHOT-sources.jar>
to org.apache.logging.log4j/log4j-jmx-gui/2.6-SNAPSHOT/log4j-jmx-gui-2.6-SNAPSHOT-sources.jar
[JENKINS] Archiving <https://builds.apache.org/job/Log4j%202.x/ws/log4j-nosql/pom.xml>
to org.apache.logging.log4j/log4j-nosql/2.6-SNAPSHOT/log4j-nosql-2.6-SNAPSHOT.pom
[JENKINS] Archiving <https://builds.apache.org/job/Log4j%202.x/ws/log4j-nosql/target/log4j-nosql-2.6-SNAPSHOT.jar>
to org.apache.logging.log4j/log4j-nosql/2.6-SNAPSHOT/log4j-nosql-2.6-SNAPSHOT.jar
[JENKINS] Archiving <https://builds.apache.org/job/Log4j%202.x/ws/log4j-nosql/target/log4j-nosql-2.6-SNAPSHOT-sources.jar>
to org.apache.logging.log4j/log4j-nosql/2.6-SNAPSHOT/log4j-nosql-2.6-SNAPSHOT-sources.jar
[JENKINS] Archiving <https://builds.apache.org/job/Log4j%202.x/ws/log4j-samples/configuration/pom.xml>
to org.apache.logging.log4j.samples/log4j-samples-configuration/2.6-SNAPSHOT/log4j-samples-configuration-2.6-SNAPSHOT.pom
[JENKINS] Archiving <https://builds.apache.org/job/Log4j%202.x/ws/log4j-samples/configuration/target/log4j-samples-configuration-2.6-SNAPSHOT.jar>
to org.apache.logging.log4j.samples/log4j-samples-configuration/2.6-SNAPSHOT/log4j-samples-configuration-2.6-SNAPSHOT.jar
[JENKINS] Archiving <https://builds.apache.org/job/Log4j%202.x/ws/log4j-samples/configuration/target/log4j-samples-configuration-2.6-SNAPSHOT-sources.jar>
to org.apache.logging.log4j.samples/log4j-samples-configuration/2.6-SNAPSHOT/log4j-samples-configuration-2.6-SNAPSHOT-sources.jar
[JENKINS] Archiving <https://builds.apache.org/job/Log4j%202.x/ws/log4j-core/pom.xml>
to org.apache.logging.log4j/log4j-core/2.6-SNAPSHOT/log4j-core-2.6-SNAPSHOT.pom
[JENKINS] Archiving <https://builds.apache.org/job/Log4j%202.x/ws/log4j-core/target/log4j-core-2.6-SNAPSHOT.jar>
to org.apache.logging.log4j/log4j-core/2.6-SNAPSHOT/log4j-core-2.6-SNAPSHOT.jar
[JENKINS] Archiving <https://builds.apache.org/job/Log4j%202.x/ws/log4j-core/target/log4j-core-2.6-SNAPSHOT-tests.jar>
to org.apache.logging.log4j/log4j-core/2.6-SNAPSHOT/log4j-core-2.6-SNAPSHOT-tests.jar
[JENKINS] Archiving <https://builds.apache.org/job/Log4j%202.x/ws/log4j-core/target/log4j-core-2.6-SNAPSHOT-sources.jar>
to org.apache.logging.log4j/log4j-core/2.6-SNAPSHOT/log4j-core-2.6-SNAPSHOT-sources.jar
[JENKINS] Archiving <https://builds.apache.org/job/Log4j%202.x/ws/log4j-samples/flume-embedded/pom.xml>
to org.apache.logging.log4j.samples/log4j-samples-flume-embedded/2.6-SNAPSHOT/log4j-samples-flume-embedded-2.6-SNAPSHOT.pom
[JENKINS] Archiving <https://builds.apache.org/job/Log4j%202.x/ws/log4j-samples/flume-embedded/target/log4j-samples-flume-embedded-2.6-SNAPSHOT.war>
to org.apache.logging.log4j.samples/log4j-samples-flume-embedded/2.6-SNAPSHOT/log4j-samples-flume-embedded-2.6-SNAPSHOT.war
[JENKINS] Archiving <https://builds.apache.org/job/Log4j%202.x/ws/log4j-samples/flume-embedded/target/log4j-samples-flume-embedded-2.6-SNAPSHOT-sources.jar>
to org.apache.logging.log4j.samples/log4j-samples-flume-embedded/2.6-SNAPSHOT/log4j-samples-flume-embedded-2.6-SNAPSHOT-sources.jar
Compressed 36.50 MB of artifacts by 89.1% relative to #1698
[JENKINS] Archiving <https://builds.apache.org/job/Log4j%202.x/ws/log4j-jcl/pom.xml>
to org.apache.logging.log4j/log4j-jcl/2.6-SNAPSHOT/log4j-jcl-2.6-SNAPSHOT.pom
[JENKINS] Archiving <https://builds.apache.org/job/Log4j%202.x/ws/log4j-jcl/target/log4j-jcl-2.6-SNAPSHOT.jar>
to org.apache.logging.log4j/log4j-jcl/2.6-SNAPSHOT/log4j-jcl-2.6-SNAPSHOT.jar
[JENKINS] Archiving <https://builds.apache.org/job/Log4j%202.x/ws/log4j-jcl/target/log4j-jcl-2.6-SNAPSHOT-sources.jar>
to org.apache.logging.log4j/log4j-jcl/2.6-SNAPSHOT/log4j-jcl-2.6-SNAPSHOT-sources.jar
[JENKINS] Archiving <https://builds.apache.org/job/Log4j%202.x/ws/log4j-liquibase/pom.xml>
to org.apache.logging.log4j/log4j-liquibase/2.6-SNAPSHOT/log4j-liquibase-2.6-SNAPSHOT.pom
[JENKINS] Archiving <https://builds.apache.org/job/Log4j%202.x/ws/log4j-perf/pom.xml>
to org.apache.logging.log4j/log4j-perf/2.6-SNAPSHOT/log4j-perf-2.6-SNAPSHOT.pom
[JENKINS] Archiving <https://builds.apache.org/job/Log4j%202.x/ws/log4j-jul/pom.xml>
to org.apache.logging.log4j/log4j-jul/2.6-SNAPSHOT/log4j-jul-2.6-SNAPSHOT.pom
[JENKINS] Archiving <https://builds.apache.org/job/Log4j%202.x/ws/log4j-slf4j-impl/pom.xml>
to org.apache.logging.log4j/log4j-slf4j-impl/2.6-SNAPSHOT/log4j-slf4j-impl-2.6-SNAPSHOT.pom
[JENKINS] Archiving <https://builds.apache.org/job/Log4j%202.x/ws/log4j-slf4j-impl/target/log4j-slf4j-impl-2.6-SNAPSHOT.jar>
to org.apache.logging.log4j/log4j-slf4j-impl/2.6-SNAPSHOT/log4j-slf4j-impl-2.6-SNAPSHOT.jar
[JENKINS] Archiving <https://builds.apache.org/job/Log4j%202.x/ws/log4j-slf4j-impl/target/log4j-slf4j-impl-2.6-SNAPSHOT-sources.jar>
to org.apache.logging.log4j/log4j-slf4j-impl/2.6-SNAPSHOT/log4j-slf4j-impl-2.6-SNAPSHOT-sources.jar
[JENKINS] Archiving <https://builds.apache.org/job/Log4j%202.x/ws/log4j-samples/flume-common/pom.xml>
to org.apache.logging.log4j.samples/log4j-samples-flume-common/2.6-SNAPSHOT/log4j-samples-flume-common-2.6-SNAPSHOT.pom
[JENKINS] Archiving <https://builds.apache.org/job/Log4j%202.x/ws/log4j-samples/flume-common/target/log4j-samples-flume-common-2.6-SNAPSHOT.jar>
to org.apache.logging.log4j.samples/log4j-samples-flume-common/2.6-SNAPSHOT/log4j-samples-flume-common-2.6-SNAPSHOT.jar
[JENKINS] Archiving <https://builds.apache.org/job/Log4j%202.x/ws/log4j-samples/flume-common/target/log4j-samples-flume-common-2.6-SNAPSHOT-sources.jar>
to org.apache.logging.log4j.samples/log4j-samples-flume-common/2.6-SNAPSHOT/log4j-samples-flume-common-2.6-SNAPSHOT-sources.jar
[JENKINS] Archiving <https://builds.apache.org/job/Log4j%202.x/ws/log4j-web/pom.xml>
to org.apache.logging.log4j/log4j-web/2.6-SNAPSHOT/log4j-web-2.6-SNAPSHOT.pom
[JENKINS] Archiving <https://builds.apache.org/job/Log4j%202.x/ws/log4j-web/target/log4j-web-2.6-SNAPSHOT.jar>
to org.apache.logging.log4j/log4j-web/2.6-SNAPSHOT/log4j-web-2.6-SNAPSHOT.jar
[JENKINS] Archiving <https://builds.apache.org/job/Log4j%202.x/ws/log4j-web/target/log4j-web-2.6-SNAPSHOT-sources.jar>
to org.apache.logging.log4j/log4j-web/2.6-SNAPSHOT/log4j-web-2.6-SNAPSHOT-sources.jar
[JENKINS] Archiving <https://builds.apache.org/job/Log4j%202.x/ws/log4j-bom/pom.xml>
to org.apache.logging.log4j/log4j-bom/2.6-SNAPSHOT/log4j-bom-2.6-SNAPSHOT.pom
[JENKINS] Archiving <https://builds.apache.org/job/Log4j%202.x/ws/pom.xml> to org.apache.logging.log4j/log4j/2.6-SNAPSHOT/log4j-2.6-SNAPSHOT.pom
Compressed 49.04 KB of artifacts by 65.3% relative to #1698
[JENKINS] Archiving <https://builds.apache.org/job/Log4j%202.x/ws/log4j-iostreams/pom.xml>
to org.apache.logging.log4j/log4j-iostreams/2.6-SNAPSHOT/log4j-iostreams-2.6-SNAPSHOT.pom
[JENKINS] Archiving <https://builds.apache.org/job/Log4j%202.x/ws/log4j-to-slf4j/pom.xml>
to org.apache.logging.log4j/log4j-to-slf4j/2.6-SNAPSHOT/log4j-to-slf4j-2.6-SNAPSHOT.pom
[JENKINS] Archiving <https://builds.apache.org/job/Log4j%202.x/ws/log4j-to-slf4j/target/log4j-to-slf4j-2.6-SNAPSHOT.jar>
to org.apache.logging.log4j/log4j-to-slf4j/2.6-SNAPSHOT/log4j-to-slf4j-2.6-SNAPSHOT.jar
[JENKINS] Archiving <https://builds.apache.org/job/Log4j%202.x/ws/log4j-to-slf4j/target/log4j-to-slf4j-2.6-SNAPSHOT-sources.jar>
to org.apache.logging.log4j/log4j-to-slf4j/2.6-SNAPSHOT/log4j-to-slf4j-2.6-SNAPSHOT-sources.jar
[JENKINS] Archiving <https://builds.apache.org/job/Log4j%202.x/ws/log4j-flume-ng/pom.xml>
to org.apache.logging.log4j/log4j-flume-ng/2.6-SNAPSHOT/log4j-flume-ng-2.6-SNAPSHOT.pom
[JENKINS] Archiving <https://builds.apache.org/job/Log4j%202.x/ws/log4j-flume-ng/target/log4j-flume-ng-2.6-SNAPSHOT.jar>
to org.apache.logging.log4j/log4j-flume-ng/2.6-SNAPSHOT/log4j-flume-ng-2.6-SNAPSHOT.jar
[JENKINS] Archiving <https://builds.apache.org/job/Log4j%202.x/ws/log4j-flume-ng/target/log4j-flume-ng-2.6-SNAPSHOT-tests.jar>
to org.apache.logging.log4j/log4j-flume-ng/2.6-SNAPSHOT/log4j-flume-ng-2.6-SNAPSHOT-tests.jar
[JENKINS] Archiving <https://builds.apache.org/job/Log4j%202.x/ws/log4j-flume-ng/target/log4j-flume-ng-2.6-SNAPSHOT-sources.jar>
to org.apache.logging.log4j/log4j-flume-ng/2.6-SNAPSHOT/log4j-flume-ng-2.6-SNAPSHOT-sources.jar
[JENKINS] Archiving <https://builds.apache.org/job/Log4j%202.x/ws/log4j-api/pom.xml>
to org.apache.logging.log4j/log4j-api/2.6-SNAPSHOT/log4j-api-2.6-SNAPSHOT.pom
[JENKINS] Archiving <https://builds.apache.org/job/Log4j%202.x/ws/log4j-api/target/log4j-api-2.6-SNAPSHOT.jar>
to org.apache.logging.log4j/log4j-api/2.6-SNAPSHOT/log4j-api-2.6-SNAPSHOT.jar
[JENKINS] Archiving <https://builds.apache.org/job/Log4j%202.x/ws/log4j-api/target/log4j-api-2.6-SNAPSHOT-tests.jar>
to org.apache.logging.log4j/log4j-api/2.6-SNAPSHOT/log4j-api-2.6-SNAPSHOT-tests.jar
[JENKINS] Archiving <https://builds.apache.org/job/Log4j%202.x/ws/log4j-api/target/log4j-api-2.6-SNAPSHOT-sources.jar>
to org.apache.logging.log4j/log4j-api/2.6-SNAPSHOT/log4j-api-2.6-SNAPSHOT-sources.jar
[JENKINS] Archiving <https://builds.apache.org/job/Log4j%202.x/ws/log4j-samples/flume-remote/pom.xml>
to org.apache.logging.log4j.samples/log4j-samples-flume-remote/2.6-SNAPSHOT/log4j-samples-flume-remote-2.6-SNAPSHOT.pom
[JENKINS] Archiving <https://builds.apache.org/job/Log4j%202.x/ws/log4j-samples/flume-remote/target/log4j-samples-flume-remote-2.6-SNAPSHOT.war>
to org.apache.logging.log4j.samples/log4j-samples-flume-remote/2.6-SNAPSHOT/log4j-samples-flume-remote-2.6-SNAPSHOT.war
[JENKINS] Archiving <https://builds.apache.org/job/Log4j%202.x/ws/log4j-samples/flume-remote/target/log4j-samples-flume-remote-2.6-SNAPSHOT-sources.jar>
to org.apache.logging.log4j.samples/log4j-samples-flume-remote/2.6-SNAPSHOT/log4j-samples-flume-remote-2.6-SNAPSHOT-sources.jar
Compressed 14.10 MB of artifacts by 84.2% relative to #1698
[JENKINS] Archiving <https://builds.apache.org/job/Log4j%202.x/ws/log4j-samples/pom.xml>
to org.apache.logging.log4j.samples/log4j-samples/2.6-SNAPSHOT/log4j-samples-2.6-SNAPSHOT.pom
channel stopped

---------------------------------------------------------------------
To unsubscribe, e-mail: log4j-dev-unsubscribe@logging.apache.org
For additional commands, e-mail: log4j-dev-help@logging.apache.org


Mime
View raw message