logging-log4j-dev mailing list archives

Site index · List index
Message view « Date » · « Thread »
Top « Date » · « Thread »
From Gary Gregory <garydgreg...@gmail.com>
Subject Fwd: Build failed in Jenkins: Log4j 2.x #1518
Date Mon, 02 Nov 2015 01:36:03 GMT
Ha, crud, that's probably my fault. Looking...

Gary
---------- Forwarded message ----------
From: Apache Jenkins Server <jenkins@builds.apache.org>
Date: Sun, Nov 1, 2015 at 4:58 PM
Subject: Build failed in Jenkins: Log4j 2.x #1518
To: log4j-dev@logging.apache.org


See <https://builds.apache.org/job/Log4j%202.x/1518/changes>

Changes:

[ggregory] Minor local refactoring.

------------------------------------------
[...truncated 135 lines...]
[WARNING] <
https://builds.apache.org/job/Log4j%202.x/ws/log4j-api/src/test/java/org/apache/logging/log4j/util/ReflectionUtilTest.java>:[51,38]
Reflection is internal proprietary API and may be removed in a future
release
[WARNING] <
https://builds.apache.org/job/Log4j%202.x/ws/log4j-api/src/test/java/org/apache/logging/log4j/util/ReflectionUtilTest.java>:[51,48]
[deprecation] getCallerClass(int) in Reflection has been deprecated
[WARNING] <
https://builds.apache.org/job/Log4j%202.x/ws/log4j-api/src/test/java/org/apache/logging/log4j/util/LambdaUtilTest.java>:[119,44]
[rawtypes] found raw type: Supplier
[INFO]
[INFO] --- maven-surefire-plugin:2.19:test (default-test) @ log4j-api ---

-------------------------------------------------------
 T E S T S
-------------------------------------------------------
Running org.apache.logging.log4j.util.ReflectionUtilTest
Running org.apache.logging.log4j.spi.DefaultThreadContextMapTest
Running org.apache.logging.log4j.message.ParameterizedMessageTest
Running org.apache.logging.log4j.message.StructuredDataMessageTest
Running org.apache.logging.log4j.message.MapMessageTest
Running org.apache.logging.log4j.ThreadContextInheritanceTest
Running org.apache.logging.log4j.LoggerTest
Running org.apache.logging.log4j.message.MessageFormatsPerfTest
Running org.apache.logging.log4j.message.MessageFormatMessageTest
Running org.apache.logging.log4j.osgi.felix.FelixLoadApiBundleTest
Running org.apache.logging.log4j.spi.MutableThreadContextStackTest
Running org.apache.logging.log4j.message.LocalizedMessageTest
Running org.apache.logging.log4j.LogManagerTest
Running org.apache.logging.log4j.message.FormattedMessageTest
Running org.apache.logging.log4j.message.StringFormattedMessageTest
Running org.apache.logging.log4j.message.ThreadDumpMessageTest
Running org.apache.logging.log4j.message.ObjectMessageTest
Running org.apache.logging.log4j.spi.DefaultThreadContextStackTest
Running org.apache.logging.log4j.util.LambdaUtilTest
Running org.apache.logging.log4j.NoopThreadContextTest
Running org.apache.logging.log4j.status.StatusLoggerSerializationTest
Running
org.apache.logging.log4j.message.MessageFormatMessageSerializationTest
Running org.apache.logging.log4j.util.StringsTest
Running org.apache.logging.log4j.ThreadContextTest
Running org.apache.logging.log4j.LevelTest
Running org.apache.logging.log4j.EventLoggerTest
Running org.apache.logging.log4j.osgi.equinox.EquinoxLoadApiBundleTest
Running org.apache.logging.log4j.message.ObjectArrayMessageTest
Running org.apache.logging.log4j.AbstractLoggerTest
Running org.apache.logging.log4j.LambdaLoggerTest
Running org.apache.logging.log4j.MarkerTest
Tests run: 1, Failures: 0, Errors: 0, Skipped: 1, Time elapsed: 0.145 sec -
in org.apache.logging.log4j.status.StatusLoggerSerializationTest
Tests run: 9, Failures: 0, Errors: 0, Skipped: 0, Time elapsed: 0.169 sec -
in org.apache.logging.log4j.LevelTest
Tests run: 1, Failures: 0, Errors: 0, Skipped: 0, Time elapsed: 0.238 sec -
in org.apache.logging.log4j.LogManagerTest
Running org.apache.logging.log4j.simple.SimpleLoggerTest
Running org.apache.log4j.util.StringsTest
Tests run: 2, Failures: 0, Errors: 0, Skipped: 0, Time elapsed: 0.237 sec -
in org.apache.logging.log4j.message.ObjectArrayMessageTest
Timer Parameterized stopped. Elapsed time: 0.024936922 seconds Average per
iteration: 0.000049873 seconds
Tests run: 1, Failures: 0, Errors: 0, Skipped: 0, Time elapsed: 0.015 sec -
in org.apache.log4j.util.StringsTest
Tests run: 14, Failures: 0, Errors: 0, Skipped: 0, Time elapsed: 0.378 sec
- in org.apache.logging.log4j.spi.DefaultThreadContextMapTest
Tests run: 6, Failures: 0, Errors: 0, Skipped: 0, Time elapsed: 0.385 sec -
in org.apache.logging.log4j.message.MessageFormatMessageSerializationTest
Tests run: 7, Failures: 0, Errors: 0, Skipped: 0, Time elapsed: 0.159 sec -
in org.apache.logging.log4j.MarkerTest
Tests run: 1, Failures: 0, Errors: 0, Skipped: 0, Time elapsed: 0.397 sec -
in org.apache.logging.log4j.util.StringsTest
Tests run: 10, Failures: 0, Errors: 0, Skipped: 0, Time elapsed: 0.405 sec
- in org.apache.logging.log4j.util.LambdaUtilTest
Timer ThreadContextCopy stopped. Elapsed time: 0.046094567 seconds Average
per iteration: 0.000000046 seconds
Timer ThreadContextTest stopped. Elapsed time: 0.046446488 seconds
Tests run: 9, Failures: 0, Errors: 0, Skipped: 0, Time elapsed: 0.41 sec -
in org.apache.logging.log4j.message.ParameterizedMessageTest
Tests run: 4, Failures: 0, Errors: 0, Skipped: 0, Time elapsed: 0.415 sec -
in org.apache.logging.log4j.message.StructuredDataMessageTest
Tests run: 7, Failures: 0, Errors: 0, Skipped: 0, Time elapsed: 0.413 sec -
in org.apache.logging.log4j.message.FormattedMessageTest
Tests run: 6, Failures: 0, Errors: 0, Skipped: 0, Time elapsed: 0.44 sec -
in org.apache.logging.log4j.message.MapMessageTest
Tests run: 6, Failures: 0, Errors: 0, Skipped: 0, Time elapsed: 0.438 sec -
in org.apache.logging.log4j.message.StringFormattedMessageTest
Timer FormattedParameterized stopped. Elapsed time: 0.109754722 seconds
Average per iteration: 0.000219509 seconds
Tests run: 7, Failures: 0, Errors: 0, Skipped: 0, Time elapsed: 0.444 sec -
in org.apache.logging.log4j.util.ReflectionUtilTest
Tests run: 32, Failures: 0, Errors: 0, Skipped: 0, Time elapsed: 0.429 sec
- in org.apache.logging.log4j.spi.MutableThreadContextStackTest
Tests run: 12, Failures: 0, Errors: 0, Skipped: 0, Time elapsed: 0.445 sec
- in org.apache.logging.log4j.ThreadContextInheritanceTest
Tests run: 5, Failures: 0, Errors: 0, Skipped: 0, Time elapsed: 0.461 sec -
in org.apache.logging.log4j.message.MessageFormatMessageTest
Tests run: 6, Failures: 0, Errors: 0, Skipped: 0, Time elapsed: 0.462 sec -
in org.apache.logging.log4j.message.LocalizedMessageTest
Tests run: 12, Failures: 0, Errors: 0, Skipped: 0, Time elapsed: 0.46 sec -
in org.apache.logging.log4j.AbstractLoggerTest
Tests run: 6, Failures: 0, Errors: 0, Skipped: 0, Time elapsed: 0.473 sec -
in org.apache.logging.log4j.message.ObjectMessageTest
ERROR TestError [Ljava.lang.Object;@3941622d
ERROR TestError Logging with a size 1 Object[] only one param {}
ERROR TestError Logging with an empty Object[] {} {}
ERROR TestError Logging without args {}
ERROR TestError Logging without args
Tests run: 5, Failures: 0, Errors: 0, Skipped: 0, Time elapsed: 0.173 sec -
in org.apache.logging.log4j.simple.SimpleLoggerTest
Tests run: 1, Failures: 0, Errors: 0, Skipped: 0, Time elapsed: 0.487 sec -
in org.apache.logging.log4j.NoopThreadContextTest
Tests run: 25, Failures: 0, Errors: 0, Skipped: 0, Time elapsed: 0.504 sec
- in org.apache.logging.log4j.spi.DefaultThreadContextStackTest
Timer MessageFormat stopped. Elapsed time: 0.062349190 seconds Average per
iteration: 0.000124698 seconds
Tests run: 1, Failures: 0, Errors: 0, Skipped: 0, Time elapsed: 0.528 sec -
in org.apache.logging.log4j.EventLoggerTest
Tests run: 36, Failures: 0, Errors: 0, Skipped: 0, Time elapsed: 0.54 sec -
in org.apache.logging.log4j.LoggerTest
Timer ThreadContextCopy stopped. Elapsed time: 0.044347773 seconds Average
per iteration: 0.000000044 seconds
Timer ThreadContextTest stopped. Elapsed time: 0.044709633 seconds
Tests run: 4, Failures: 0, Errors: 0, Skipped: 0, Time elapsed: 0.552 sec -
in org.apache.logging.log4j.message.ThreadDumpMessageTest
Tests run: 12, Failures: 0, Errors: 0, Skipped: 0, Time elapsed: 0.555 sec
- in org.apache.logging.log4j.ThreadContextTest
Timer StringFormat stopped. Elapsed time: 0.054505202 seconds Average per
iteration: 0.000109010 seconds
Parameterized is 2.19 times faster than StringFormat.
Parameterized is 2.50 times faster than MessageFormat.
Parameterized is 4.40 times faster than Formatted.
Tests run: 4, Failures: 0, Errors: 0, Skipped: 0, Time elapsed: 0.571 sec -
in org.apache.logging.log4j.message.MessageFormatsPerfTest
Tests run: 70, Failures: 0, Errors: 0, Skipped: 0, Time elapsed: 0.572 sec
- in org.apache.logging.log4j.LambdaLoggerTest
Tests run: 1, Failures: 0, Errors: 0, Skipped: 1, Time elapsed: 0.777 sec -
in org.apache.logging.log4j.osgi.felix.FelixLoadApiBundleTest
Tests run: 1, Failures: 0, Errors: 0, Skipped: 1, Time elapsed: 1.143 sec -
in org.apache.logging.log4j.osgi.equinox.EquinoxLoadApiBundleTest

Results :

Tests run: 324, Failures: 0, Errors: 0, Skipped: 3

[JENKINS] Recording test results
[INFO]
[INFO] --- maven-jar-plugin:2.3.1:jar (default-jar) @ log4j-api ---
[INFO] Building jar: <
https://builds.apache.org/job/Log4j%202.x/ws/log4j-api/target/log4j-api-2.5-SNAPSHOT.jar
>
[INFO]
[INFO] --- maven-jar-plugin:2.3.1:test-jar (default) @ log4j-api ---
[INFO] Building jar: <
https://builds.apache.org/job/Log4j%202.x/ws/log4j-api/target/log4j-api-2.5-SNAPSHOT-tests.jar
>
[INFO]
[INFO] --- maven-failsafe-plugin:2.19:integration-test (integration-tests)
@ log4j-api ---
[JENKINS] Recording test results
[INFO]
[INFO] --- maven-failsafe-plugin:2.19:verify (verify) @ log4j-api ---
[JENKINS] Recording test results[INFO]
[INFO] --- maven-source-plugin:2.4:jar-no-fork (attach-sources) @ log4j-api
---

[INFO] Building jar: <
https://builds.apache.org/job/Log4j%202.x/ws/log4j-api/target/log4j-api-2.5-SNAPSHOT-sources.jar
>
[INFO]
[INFO] --- maven-install-plugin:2.3.1:install (default-install) @ log4j-api
---
[INFO] Installing <
https://builds.apache.org/job/Log4j%202.x/ws/log4j-api/target/log4j-api-2.5-SNAPSHOT.jar>
to
/home/jenkins/jenkins-slave/maven-repositories/0/org/apache/logging/log4j/log4j-api/2.5-SNAPSHOT/log4j-api-2.5-SNAPSHOT.jar
[INFO] Installing <
https://builds.apache.org/job/Log4j%202.x/ws/log4j-api/pom.xml> to
/home/jenkins/jenkins-slave/maven-repositories/0/org/apache/logging/log4j/log4j-api/2.5-SNAPSHOT/log4j-api-2.5-SNAPSHOT.pom
[INFO] Installing <
https://builds.apache.org/job/Log4j%202.x/ws/log4j-api/target/log4j-api-2.5-SNAPSHOT-tests.jar>
to
/home/jenkins/jenkins-slave/maven-repositories/0/org/apache/logging/log4j/log4j-api/2.5-SNAPSHOT/log4j-api-2.5-SNAPSHOT-tests.jar
[INFO] Installing <
https://builds.apache.org/job/Log4j%202.x/ws/log4j-api/target/log4j-api-2.5-SNAPSHOT-sources.jar>
to
/home/jenkins/jenkins-slave/maven-repositories/0/org/apache/logging/log4j/log4j-api/2.5-SNAPSHOT/log4j-api-2.5-SNAPSHOT-sources.jar
[INFO]
[INFO]
------------------------------------------------------------------------
[INFO] Building Apache Log4j Core 2.5-SNAPSHOT
[INFO]
------------------------------------------------------------------------
[INFO]
[INFO] --- maven-clean-plugin:2.4.1:clean (default-clean) @ log4j-core ---
[INFO] Deleting <
https://builds.apache.org/job/Log4j%202.x/ws/log4j-core/target>
[INFO]
[INFO] --- maven-remote-resources-plugin:1.1:process (default) @ log4j-core
---
[INFO]
[INFO] --- maven-resources-plugin:2.7:resources (default-resources) @
log4j-core ---
[INFO] Using 'UTF-8' encoding to copy filtered resources.
[INFO] Copying 8 resources
[INFO]
[INFO] --- maven-compiler-plugin:3.3:compile (default-compile) @ log4j-core
---
[INFO] Changes detected - recompiling the module!
[INFO] Compiling 509 source files to <
https://builds.apache.org/job/Log4j%202.x/ws/log4j-core/target/classes>
[INFO] -------------------------------------------------------------
[WARNING] COMPILATION WARNING :
[INFO] -------------------------------------------------------------
[WARNING] <
https://builds.apache.org/job/Log4j%202.x/ws/log4j-core/src/main/java/org/apache/logging/log4j/core/config/builder/impl/DefaultComponentBuilder.java>:[119,19]
[unchecked] unchecked cast
[WARNING]   required: T
  found:    DefaultComponentBuilder<T,CB>
  where T,CB are type-variables:
    T extends ComponentBuilder<T> declared in class DefaultComponentBuilder
    CB extends ConfigurationBuilder<? extends Configuration> declared in
class DefaultComponentBuilder
<
https://builds.apache.org/job/Log4j%202.x/ws/log4j-core/src/main/java/org/apache/logging/log4j/core/config/builder/impl/DefaultConfigurationBuilder.java>:[66,42]
[unchecked] unchecked cast
[WARNING]   required: String
  found: String,MessageFactory
  reason: actual and formal argument lists differ in length
<
https://builds.apache.org/job/Log4j%202.x/ws/log4j-core/src/main/java/org/apache/logging/log4j/core/appender/rolling/RollingFileManager.java>:[145,23]
[unchecked] unchecked cast
[WARNING]   required: T
  found:    TriggeringPolicy
  where T is a type-variable:
    T extends TriggeringPolicy declared in method <T>getTriggeringPolicy()
<
https://builds.apache.org/job/Log4j%202.x/ws/log4j-core/src/main/java/org/apache/logging/log4j/core/util/datetime/FastDateParser.java>:[631,72]
[rawtypes] found raw type: ConcurrentMap
[WARNING]   missing type arguments for generic class ConcurrentMap<K,V>
  where K,V are type-variables:
    K extends Object declared in interface ConcurrentMap
    V extends Object declared in interface ConcurrentMap
<
https://builds.apache.org/job/Log4j%202.x/ws/log4j-core/src/main/java/org/apache/logging/log4j/core/lookup/MainMapLookup.java>:[74,23]
[deprecation] setMainArguments(String...) in MapLookup has been deprecated
[INFO] 5 warnings
[INFO] -------------------------------------------------------------
[INFO] -------------------------------------------------------------
[ERROR] COMPILATION ERROR :
[INFO] -------------------------------------------------------------
[ERROR]   required: Class<T>
  found:    Class<BuiltConfiguration>
  where T is a type-variable:
    T extends BuiltConfiguration declared in class
DefaultConfigurationBuilder
<
https://builds.apache.org/job/Log4j%202.x/ws/log4j-core/src/main/java/org/apache/logging/log4j/core/Logger.java>:[94,19]
error: method hasLogger in class LoggerContext cannot be applied to given
types;
[INFO] 1 error
[INFO] -------------------------------------------------------------
[INFO]
------------------------------------------------------------------------
[INFO] Reactor Summary:
[INFO]
[INFO] Apache Log4j 2 .................................... SUCCESS [ 10.071
s]
[INFO] Apache Log4j API .................................. SUCCESS [ 14.022
s]
[INFO] Apache Log4j Core ................................. FAILURE [  5.298
s]
[INFO] Apache Log4j 1.x Compatibility API ................ SKIPPED
[INFO] Apache Log4j SLF4J Binding ........................ SKIPPED
[INFO] Apache Log4j to SLF4J Adapter ..................... SKIPPED
[INFO] Apache Log4j Commons Logging Bridge ............... SKIPPED
[INFO] Apache Log4j Flume Bridge ......................... SKIPPED
[INFO] Apache Log4j Web .................................. SKIPPED
[INFO] Apache Log4j Tag Library .......................... SKIPPED
[INFO] Apache Log4j JMX GUI .............................. SKIPPED
[INFO] Apache Log4j Samples .............................. SKIPPED
[INFO] Apache Log4j Samples: Flume - Common .............. SKIPPED
[INFO] Apache Log4j Samples: Flume - Remote .............. SKIPPED
[INFO] Apache Log4j Samples: Flume - Embedded ............ SKIPPED
[INFO] Apache Log4j Samples: Configuration ............... SKIPPED
[INFO] Apache Log4j Samples: LoggerProperties ............ SKIPPED
[INFO] Apache Log4j BOM .................................. SKIPPED
[INFO] Apache Log4j NoSQL ................................ SKIPPED
[INFO] Apache Log4J Performance Tests .................... SKIPPED
[INFO] Apache Log4j Streaming Interface .................. SKIPPED
[INFO] Apache Log4j JUL Adapter .......................... SKIPPED
[INFO] Apache Log4j Liquibase Binding .................... SKIPPED
[INFO]
------------------------------------------------------------------------
[INFO] BUILD FAILURE
[INFO]
------------------------------------------------------------------------
[INFO] Total time: 35.737 s
[INFO] Finished at: 2015-11-02T00:57:43+00:00
[INFO] Final Memory: 39M/424M
[INFO]
------------------------------------------------------------------------
Waiting for Jenkins to finish collecting data
[ERROR] Failed to execute goal
org.apache.maven.plugins:maven-compiler-plugin:3.3:compile
(default-compile) on project log4j-core: Compilation failure
[ERROR] required: Class<T>
[ERROR] found:    Class<BuiltConfiguration>
[ERROR] where T is a type-variable:
[ERROR] T extends BuiltConfiguration declared in class
DefaultConfigurationBuilder
[ERROR] <
https://builds.apache.org/job/Log4j%202.x/ws/log4j-core/src/main/java/org/apache/logging/log4j/core/Logger.java>:[94,19]
error: method hasLogger in class LoggerContext cannot be applied to given
types;
[ERROR] -> [Help 1]
[ERROR]
[ERROR] To see the full stack trace of the errors, re-run Maven with the -e
switch.
[ERROR] Re-run Maven using the -X switch to enable full debug logging.
[ERROR]
[ERROR] For more information about the errors and possible solutions,
please read the following articles:
[ERROR] [Help 1]
http://cwiki.apache.org/confluence/display/MAVEN/MojoFailureException
[ERROR]
[ERROR] After correcting the problems, you can resume the build with the
command
[ERROR]   mvn <goals> -rf :log4j-core
[JENKINS] Archiving <
https://builds.apache.org/job/Log4j%202.x/ws/log4j-taglib/pom.xml> to
org.apache.logging.log4j/log4j-taglib/2.5-SNAPSHOT/log4j-taglib-2.5-SNAPSHOT.pom
[JENKINS] Archiving <
https://builds.apache.org/job/Log4j%202.x/ws/log4j-1.2-api/pom.xml> to
org.apache.logging.log4j/log4j-1.2-api/2.5-SNAPSHOT/log4j-1.2-api-2.5-SNAPSHOT.pom
[JENKINS] Archiving <
https://builds.apache.org/job/Log4j%202.x/ws/log4j-samples/loggerProperties/pom.xml>
to
org.apache.logging.log4j.samples/log4j-samples-loggerProperties/2.5-SNAPSHOT/log4j-samples-loggerProperties-2.5-SNAPSHOT.pom
[JENKINS] Archiving <
https://builds.apache.org/job/Log4j%202.x/ws/log4j-jmx-gui/pom.xml> to
org.apache.logging.log4j/log4j-jmx-gui/2.5-SNAPSHOT/log4j-jmx-gui-2.5-SNAPSHOT.pom
[JENKINS] Archiving <
https://builds.apache.org/job/Log4j%202.x/ws/log4j-nosql/pom.xml> to
org.apache.logging.log4j/log4j-nosql/2.5-SNAPSHOT/log4j-nosql-2.5-SNAPSHOT.pom
[JENKINS] Archiving <
https://builds.apache.org/job/Log4j%202.x/ws/log4j-samples/configuration/pom.xml>
to
org.apache.logging.log4j.samples/log4j-samples-configuration/2.5-SNAPSHOT/log4j-samples-configuration-2.5-SNAPSHOT.pom
[JENKINS] Archiving <
https://builds.apache.org/job/Log4j%202.x/ws/log4j-core/pom.xml> to
org.apache.logging.log4j/log4j-core/2.5-SNAPSHOT/log4j-core-2.5-SNAPSHOT.pom
[JENKINS] Archiving <
https://builds.apache.org/job/Log4j%202.x/ws/log4j-samples/flume-embedded/pom.xml>
to
org.apache.logging.log4j.samples/log4j-samples-flume-embedded/2.5-SNAPSHOT/log4j-samples-flume-embedded-2.5-SNAPSHOT.pom
[JENKINS] Archiving <
https://builds.apache.org/job/Log4j%202.x/ws/log4j-jcl/pom.xml> to
org.apache.logging.log4j/log4j-jcl/2.5-SNAPSHOT/log4j-jcl-2.5-SNAPSHOT.pom
[JENKINS] Archiving <
https://builds.apache.org/job/Log4j%202.x/ws/log4j-liquibase/pom.xml> to
org.apache.logging.log4j/log4j-liquibase/2.5-SNAPSHOT/log4j-liquibase-2.5-SNAPSHOT.pom
[JENKINS] Archiving <
https://builds.apache.org/job/Log4j%202.x/ws/log4j-perf/pom.xml> to
org.apache.logging.log4j/log4j-perf/2.5-SNAPSHOT/log4j-perf-2.5-SNAPSHOT.pom
[JENKINS] Archiving <
https://builds.apache.org/job/Log4j%202.x/ws/log4j-jul/pom.xml> to
org.apache.logging.log4j/log4j-jul/2.5-SNAPSHOT/log4j-jul-2.5-SNAPSHOT.pom
[JENKINS] Archiving <
https://builds.apache.org/job/Log4j%202.x/ws/log4j-slf4j-impl/pom.xml> to
org.apache.logging.log4j/log4j-slf4j-impl/2.5-SNAPSHOT/log4j-slf4j-impl-2.5-SNAPSHOT.pom
[JENKINS] Archiving <
https://builds.apache.org/job/Log4j%202.x/ws/log4j-samples/flume-common/pom.xml>
to
org.apache.logging.log4j.samples/log4j-samples-flume-common/2.5-SNAPSHOT/log4j-samples-flume-common-2.5-SNAPSHOT.pom
[JENKINS] Archiving <
https://builds.apache.org/job/Log4j%202.x/ws/log4j-web/pom.xml> to
org.apache.logging.log4j/log4j-web/2.5-SNAPSHOT/log4j-web-2.5-SNAPSHOT.pom
[JENKINS] Archiving <
https://builds.apache.org/job/Log4j%202.x/ws/log4j-bom/pom.xml> to
org.apache.logging.log4j/log4j-bom/2.5-SNAPSHOT/log4j-bom-2.5-SNAPSHOT.pom
[JENKINS] Archiving <https://builds.apache.org/job/Log4j%202.x/ws/pom.xml>
to org.apache.logging.log4j/log4j/2.5-SNAPSHOT/log4j-2.5-SNAPSHOT.pom
Compressed 48.29 KB of artifacts by 66.3% relative to #1517
[JENKINS] Archiving <
https://builds.apache.org/job/Log4j%202.x/ws/log4j-iostreams/pom.xml> to
org.apache.logging.log4j/log4j-iostreams/2.5-SNAPSHOT/log4j-iostreams-2.5-SNAPSHOT.pom
[JENKINS] Archiving <
https://builds.apache.org/job/Log4j%202.x/ws/log4j-to-slf4j/pom.xml> to
org.apache.logging.log4j/log4j-to-slf4j/2.5-SNAPSHOT/log4j-to-slf4j-2.5-SNAPSHOT.pom
[JENKINS] Archiving <
https://builds.apache.org/job/Log4j%202.x/ws/log4j-flume-ng/pom.xml> to
org.apache.logging.log4j/log4j-flume-ng/2.5-SNAPSHOT/log4j-flume-ng-2.5-SNAPSHOT.pom
[JENKINS] Archiving <
https://builds.apache.org/job/Log4j%202.x/ws/log4j-api/pom.xml> to
org.apache.logging.log4j/log4j-api/2.5-SNAPSHOT/log4j-api-2.5-SNAPSHOT.pom
[JENKINS] Archiving <
https://builds.apache.org/job/Log4j%202.x/ws/log4j-api/target/log4j-api-2.5-SNAPSHOT.jar>
to
org.apache.logging.log4j/log4j-api/2.5-SNAPSHOT/log4j-api-2.5-SNAPSHOT.jar
[JENKINS] Archiving <
https://builds.apache.org/job/Log4j%202.x/ws/log4j-api/target/log4j-api-2.5-SNAPSHOT-tests.jar>
to
org.apache.logging.log4j/log4j-api/2.5-SNAPSHOT/log4j-api-2.5-SNAPSHOT-tests.jar
[JENKINS] Archiving <
https://builds.apache.org/job/Log4j%202.x/ws/log4j-api/target/log4j-api-2.5-SNAPSHOT-sources.jar>
to
org.apache.logging.log4j/log4j-api/2.5-SNAPSHOT/log4j-api-2.5-SNAPSHOT-sources.jar
[JENKINS] Archiving <
https://builds.apache.org/job/Log4j%202.x/ws/log4j-samples/flume-remote/pom.xml>
to
org.apache.logging.log4j.samples/log4j-samples-flume-remote/2.5-SNAPSHOT/log4j-samples-flume-remote-2.5-SNAPSHOT.pom
[JENKINS] Archiving <
https://builds.apache.org/job/Log4j%202.x/ws/log4j-samples/pom.xml> to
org.apache.logging.log4j.samples/log4j-samples/2.5-SNAPSHOT/log4j-samples-2.5-SNAPSHOT.pom
channel stopped

---------------------------------------------------------------------
To unsubscribe, e-mail: log4j-dev-unsubscribe@logging.apache.org
For additional commands, e-mail: log4j-dev-help@logging.apache.org




-- 
E-Mail: garydgregory@gmail.com | ggregory@apache.org
Java Persistence with Hibernate, Second Edition
<http://www.manning.com/bauer3/>
JUnit in Action, Second Edition <http://www.manning.com/tahchiev/>
Spring Batch in Action <http://www.manning.com/templier/>
Blog: http://garygregory.wordpress.com
Home: http://garygregory.com/
Tweet! http://twitter.com/GaryGregory

Mime
View raw message