logging-log4j-dev mailing list archives

Site index · List index
Message view « Date » · « Thread »
Top « Date » · « Thread »
From Remko Popma <remko.po...@gmail.com>
Subject Re: Build errors in Flume
Date Fri, 19 Sep 2014 15:27:01 GMT
Sorry, it's my bed time soon...
I actually was not aware we were maintaining snapshots anywhere...
Perhaps in the future this can automatically be updated by a buildbot or
something?

On Fri, Sep 19, 2014 at 9:58 PM, Gary Gregory <garydgregory@gmail.com>
wrote:

> Hm... Darn, bad luck for me, my machine must be too busy...
>
> Can you upload a SNAPSHOT build, I hear we have an old one up there?
>
> Gary
>
> On Fri, Sep 19, 2014 at 8:12 AM, Remko Popma <remko.popma@gmail.com>
> wrote:
>
>> No I was able to build without issues on win7.
>>
>> Sent from my iPhone
>>
>> On 2014/09/19, at 20:35, Gary Gregory <garydgregory@gmail.com> wrote:
>>
>> Is anyone else seeing this with the master branch?
>>
>> Tests run: 3, Failures: 3, Errors: 0, Skipped: 0, Time elapsed: 102.332
>> sec <<< FAILURE! - in
>> org.apache.logging.log4j.flume.appender.FlumeEmbeddedAppenderTest
>> testMultiple(org.apache.logging.log4j.flume.appender.FlumeEmbeddedAppenderTest)
>> Time elapsed: 35.683 sec  <<< FAILURE!
>> java.lang.AssertionError: null
>>         at org.junit.Assert.fail(Assert.java:86)
>>         at org.junit.Assert.assertTrue(Assert.java:41)
>>         at org.junit.Assert.assertNotNull(Assert.java:621)
>>         at org.junit.Assert.assertNotNull(Assert.java:631)
>>         at
>> org.apache.logging.log4j.flume.appender.FlumeEmbeddedAppenderTest.testMultiple(FlumeEmbeddedAppenderTest.java:150)
>>
>> testFailover(org.apache.logging.log4j.flume.appender.FlumeEmbeddedAppenderTest)
>> Time elapsed: 33.355 sec  <<< FAILURE!
>> java.lang.AssertionError: null
>>         at org.junit.Assert.fail(Assert.java:86)
>>         at org.junit.Assert.assertTrue(Assert.java:41)
>>         at org.junit.Assert.assertNotNull(Assert.java:621)
>>         at org.junit.Assert.assertNotNull(Assert.java:631)
>>         at
>> org.apache.logging.log4j.flume.appender.FlumeEmbeddedAppenderTest.testFailover(FlumeEmbeddedAppenderTest.java:169)
>>
>> testLog4Event(org.apache.logging.log4j.flume.appender.FlumeEmbeddedAppenderTest)
>> Time elapsed: 33.102 sec  <<< FAILURE!
>> java.lang.AssertionError: null
>>         at org.junit.Assert.fail(Assert.java:86)
>>         at org.junit.Assert.assertTrue(Assert.java:41)
>>         at org.junit.Assert.assertNotNull(Assert.java:621)
>>         at org.junit.Assert.assertNotNull(Assert.java:631)
>>         at
>> org.apache.logging.log4j.flume.appender.FlumeEmbeddedAppenderTest.testLog4Event(FlumeEmbeddedAppenderTest.java:135)
>>
>> Tests run: 3, Failures: 3, Errors: 0, Skipped: 0, Time elapsed: 102.318
>> sec <<< FAILURE! - in
>> org.apache.logging.log4j.flume.appender.FlumeEmbeddedAgentTest
>> testMultiple(org.apache.logging.log4j.flume.appender.FlumeEmbeddedAgentTest)
>> Time elapsed: 35.896 sec  <<< FAILURE!
>> java.lang.AssertionError: null
>>         at org.junit.Assert.fail(Assert.java:86)
>>         at org.junit.Assert.assertTrue(Assert.java:41)
>>         at org.junit.Assert.assertNotNull(Assert.java:621)
>>         at org.junit.Assert.assertNotNull(Assert.java:631)
>>         at
>> org.apache.logging.log4j.flume.appender.FlumeEmbeddedAgentTest.testMultiple(FlumeEmbeddedAgentTest.java:150)
>>
>> testFailover(org.apache.logging.log4j.flume.appender.FlumeEmbeddedAgentTest)
>> Time elapsed: 33.299 sec  <<< FAILURE!
>> java.lang.AssertionError: null
>>         at org.junit.Assert.fail(Assert.java:86)
>>         at org.junit.Assert.assertTrue(Assert.java:41)
>>         at org.junit.Assert.assertNotNull(Assert.java:621)
>>         at org.junit.Assert.assertNotNull(Assert.java:631)
>>         at
>> org.apache.logging.log4j.flume.appender.FlumeEmbeddedAgentTest.testFailover(FlumeEmbeddedAgentTest.java:169)
>>
>> testLog4Event(org.apache.logging.log4j.flume.appender.FlumeEmbeddedAgentTest)
>> Time elapsed: 32.92 sec  <<< FAILURE!
>> java.lang.AssertionError: null
>>         at org.junit.Assert.fail(Assert.java:86)
>>         at org.junit.Assert.assertTrue(Assert.java:41)
>>         at org.junit.Assert.assertNotNull(Assert.java:621)
>>         at org.junit.Assert.assertNotNull(Assert.java:631)
>>         at
>> org.apache.logging.log4j.flume.appender.FlumeEmbeddedAgentTest.testLog4Event(FlumeEmbeddedAgentTest.java:135)
>>
>> No Event returned
>> No Event returned
>> No Event returned
>> No Event returned
>> No Event returned
>> No Event returned
>> No Event returned
>>
>> Using:
>>
>> Apache Maven 3.2.3 (33f8c3e1027c3ddde99d3cdebad2656a31e8fdf4;
>> 2014-08-11T16:58:10-04:00)
>> Maven home: C:\Java\apache-maven-3.2.3
>> Java version: 1.7.0_67, vendor: Oracle Corporation
>> Java home: C:\Program Files\Java\jdk1.7.0_67\jre
>> Default locale: en_US, platform encoding: Cp1252
>> OS name: "windows 7", version: "6.1", arch: "amd64", family: "windows"
>>
>> Gary
>>
>> --
>> E-Mail: garydgregory@gmail.com | ggregory@apache.org
>> Java Persistence with Hibernate, Second Edition
>> <http://www.manning.com/bauer3/>
>> JUnit in Action, Second Edition <http://www.manning.com/tahchiev/>
>> Spring Batch in Action <http://www.manning.com/templier/>
>> Blog: http://garygregory.wordpress.com
>> Home: http://garygregory.com/
>> Tweet! http://twitter.com/GaryGregory
>>
>>
>
>
> --
> E-Mail: garydgregory@gmail.com | ggregory@apache.org
> Java Persistence with Hibernate, Second Edition
> <http://www.manning.com/bauer3/>
> JUnit in Action, Second Edition <http://www.manning.com/tahchiev/>
> Spring Batch in Action <http://www.manning.com/templier/>
> Blog: http://garygregory.wordpress.com
> Home: http://garygregory.com/
> Tweet! http://twitter.com/GaryGregory
>

Mime
View raw message