logging-log4j-dev mailing list archives

Site index · List index
Message view « Date » · « Thread »
Top « Date » · « Thread »
From Matt Sicker <boa...@gmail.com>
Subject Re: Unit test failures
Date Fri, 28 Mar 2014 16:26:54 GMT
And by hours, I meant minutes. Tests fixed.


On 28 March 2014 11:08, Matt Sicker <boards@gmail.com> wrote:

> No, but I'll be looking into it in the next few hours.
>
>
> On 27 March 2014 22:21, Ralph Goers <rgoers@apache.org> wrote:
>
>> Have you fixed the problem yet?
>>
>> Ralph
>>
>> On Mar 27, 2014, at 1:54 PM, Matt Sicker <boards@gmail.com> wrote:
>>
>> I was running the unit tests individually in IntelliJ. Sorry about the
>> problems. I think I might have uncovered a bug in the failing unit tests;
>> it might not actually be the fault of the tests! It depends on the expected
>> behavior of those appenders.
>>
>>
>> On 27 March 2014 12:46, Ralph Goers <ralph.goers@dslextreme.com> wrote:
>>
>>> Well, that is a little odd. I install it but everything still says it is
>>> 1.6.0_51.
>>>
>>> Ralph
>>>
>>> On Mar 27, 2014, at 9:48 AM, Gary Gregory <garydgregory@gmail.com>
>>> wrote:
>>>
>>> This page: http://support.apple.com/kb/dl1572
>>>
>>> talks about a _65 version, do you still get a compile error with that?
>>>
>>> Gary
>>>
>>>
>>> On Thu, Mar 27, 2014 at 12:45 PM, Gary Gregory <garydgregory@gmail.com>wrote:
>>>
>>>> The compiler failure sounds like an Apple feature then ;)
>>>>
>>>> Gary
>>>>
>>>>
>>>>
>>>> On Thu, Mar 27, 2014 at 12:43 PM, Ralph Goers <
>>>> ralph.goers@dslextreme.com> wrote:
>>>>
>>>>> Apache Maven 3.0.5 (r01de14724cdef164cd33c7c8c2fe155faf9602da;
>>>>> 2013-02-19 05:51:28-0800)
>>>>> Maven home: /opt/maven
>>>>> Java version: 1.6.0_51, vendor: Apple Inc.
>>>>> Java home:
>>>>> /Library/Java/JavaVirtualMachines/1.6.0_51-b11-457.jdk/Contents/Home
>>>>> Default locale: en_US, platform encoding: MacRoman
>>>>> OS name: "mac os x", version: "10.9.2", arch: "x86_64", family: "mac"
>>>>>
>>>>>
>>>>> On Mar 27, 2014, at 8:53 AM, Gary Gregory <garydgregory@gmail.com>
>>>>> wrote:
>>>>>
>>>>> What version of Java 6? Maybe you have an older version with a buggy
>>>>> compiler?
>>>>>
>>>>> It works for me:
>>>>>
>>>>> Apache Maven 3.2.1 (ea8b2b07643dbb1b84b6d16e1f08391b666bc1e9;
>>>>> 2014-02-14T12:37:52-05:00)
>>>>> Maven home: C:\Java\apache-maven-3.2.1\bin\..
>>>>> Java version: 1.6.0_45, vendor: Sun Microsystems Inc.
>>>>> Java home: C:\Program Files\Java\jdk1.6.0_45\jre
>>>>> Default locale: en_US, platform encoding: Cp1252
>>>>> OS name: "windows 7", version: "6.1", arch: "amd64", family: "windows"
>>>>>
>>>>> Gary
>>>>>
>>>>>
>>>>> On Thu, Mar 27, 2014 at 11:43 AM, Ralph Goers <
>>>>> ralph.goers@dslextreme.com> wrote:
>>>>>
>>>>>> The compile error was due to you making a variable final. Java 6
>>>>>> didn’t like it.
>>>>>>
>>>>>> Ralph
>>>>>>
>>>>>> On Mar 27, 2014, at 8:37 AM, Ralph Goers <ralph.goers@dslextreme.com>
>>>>>> wrote:
>>>>>>
>>>>>> No.  I didn’t get that far. I got a compile error:
>>>>>>
>>>>>> [ERROR] COMPILATION ERROR :
>>>>>> [INFO] -------------------------------------------------------------
>>>>>> [ERROR]
>>>>>> /Users/rgoers/projects/apache/logging/log4j/log4j2/trunk/log4j-core/src/test/java/org/apache/logging/log4j/core/async/perftest/PerfTestDriver.java:[177,13]
>>>>>> variable _averageOpsPerSec might already have been assigned
>>>>>> [INFO] 1 error
>>>>>>
>>>>>> Ralph
>>>>>>
>>>>>> On Mar 27, 2014, at 7:56 AM, Gary Gregory <garydgregory@gmail.com>
>>>>>> wrote:
>>>>>>
>>>>>> Is anyone else seeing these failures?
>>>>>>
>>>>>> ConfigurationTest
>>>>>> org.apache.logging.log4j.core.config.ConfigurationTest
>>>>>> [0]
>>>>>>
>>>>>> testLogToFile[0](org.apache.logging.log4j.core.config.ConfigurationTest)
>>>>>> java.lang.AssertionError
>>>>>>
>>>>>>     at org.junit.Assert.fail(Assert.java:86)
>>>>>>
>>>>>>     at org.junit.Assert.assertTrue(Assert.java:41)
>>>>>>
>>>>>>     at org.junit.Assert.assertTrue(Assert.java:52)
>>>>>>
>>>>>>     at
>>>>>> org.apache.logging.log4j.junit.CleanFiles.delete(CleanFiles.java:53)
>>>>>>
>>>>>>     at
>>>>>> org.apache.logging.log4j.junit.CleanFiles.clean(CleanFiles.java:47)
>>>>>>
>>>>>>     at
>>>>>> org.apache.logging.log4j.junit.CleanFiles.before(CleanFiles.java:59)
>>>>>>
>>>>>>     at
>>>>>> org.junit.rules.ExternalResource$1.evaluate(ExternalResource.java:46)
>>>>>>
>>>>>>     at
>>>>>> org.apache.logging.log4j.junit.InitialLoggerContext$1.evaluate(InitialLoggerContext.java:52)
>>>>>>
>>>>>>     at org.junit.rules.RunRules.evaluate(RunRules.java:20)
>>>>>>
>>>>>>     at org.junit.runners.ParentRunner.runLeaf(ParentRunner.java:271)
>>>>>>
>>>>>>     at
>>>>>> org.junit.runners.BlockJUnit4ClassRunner.runChild(BlockJUnit4ClassRunner.java:70)
>>>>>>
>>>>>>     at
>>>>>> org.junit.runners.BlockJUnit4ClassRunner.runChild(BlockJUnit4ClassRunner.java:50)
>>>>>>
>>>>>>     at org.junit.runners.ParentRunner$3.run(ParentRunner.java:238)
>>>>>>
>>>>>>     at org.junit.runners.ParentRunner$1.schedule(ParentRunner.java:63)
>>>>>>
>>>>>>     at
>>>>>> org.junit.runners.ParentRunner.runChildren(ParentRunner.java:236)
>>>>>>
>>>>>>     at org.junit.runners.ParentRunner.access$000(ParentRunner.java:53)
>>>>>>
>>>>>>     at
>>>>>> org.junit.runners.ParentRunner$2.evaluate(ParentRunner.java:229)
>>>>>>
>>>>>>     at org.junit.runners.ParentRunner.run(ParentRunner.java:309)
>>>>>>
>>>>>>     at org.junit.runners.Suite.runChild(Suite.java:127)
>>>>>>
>>>>>>     at org.junit.runners.Suite.runChild(Suite.java:26)
>>>>>>
>>>>>>     at org.junit.runners.ParentRunner$3.run(ParentRunner.java:238)
>>>>>>
>>>>>>     at org.junit.runners.ParentRunner$1.schedule(ParentRunner.java:63)
>>>>>>
>>>>>>     at
>>>>>> org.junit.runners.ParentRunner.runChildren(ParentRunner.java:236)
>>>>>>
>>>>>>     at org.junit.runners.ParentRunner.access$000(ParentRunner.java:53)
>>>>>>
>>>>>>     at
>>>>>> org.junit.runners.ParentRunner$2.evaluate(ParentRunner.java:229)
>>>>>>
>>>>>>     at org.junit.runners.ParentRunner.run(ParentRunner.java:309)
>>>>>>
>>>>>>     at
>>>>>> org.eclipse.jdt.internal.junit4.runner.JUnit4TestReference.run(JUnit4TestReference.java:50)
>>>>>>
>>>>>>     at
>>>>>> org.eclipse.jdt.internal.junit.runner.TestExecution.run(TestExecution.java:38)
>>>>>>
>>>>>>     at
>>>>>> org.eclipse.jdt.internal.junit.runner.RemoteTestRunner.runTests(RemoteTestRunner.java:467)
>>>>>>
>>>>>>     at
>>>>>> org.eclipse.jdt.internal.junit.runner.RemoteTestRunner.runTests(RemoteTestRunner.java:683)
>>>>>>
>>>>>>     at
>>>>>> org.eclipse.jdt.internal.junit.runner.RemoteTestRunner.run(RemoteTestRunner.java:390)
>>>>>>
>>>>>>     at
>>>>>> org.eclipse.jdt.internal.junit.runner.RemoteTestRunner.main(RemoteTestRunner.java:197)
>>>>>>
>>>>>>
>>>>>>
>>>>>>
>>>>>> testConfiguredAppenders[0](org.apache.logging.log4j.core.config.ConfigurationTest)
>>>>>> java.lang.AssertionError
>>>>>>
>>>>>>     at org.junit.Assert.fail(Assert.java:86)
>>>>>>
>>>>>>     at org.junit.Assert.assertTrue(Assert.java:41)
>>>>>>
>>>>>>     at org.junit.Assert.assertTrue(Assert.java:52)
>>>>>>
>>>>>>     at
>>>>>> org.apache.logging.log4j.junit.CleanFiles.delete(CleanFiles.java:53)
>>>>>>
>>>>>>     at
>>>>>> org.apache.logging.log4j.junit.CleanFiles.clean(CleanFiles.java:47)
>>>>>>
>>>>>>     at
>>>>>> org.apache.logging.log4j.junit.CleanFiles.before(CleanFiles.java:59)
>>>>>>
>>>>>>     at
>>>>>> org.junit.rules.ExternalResource$1.evaluate(ExternalResource.java:46)
>>>>>>
>>>>>>     at
>>>>>> org.apache.logging.log4j.junit.InitialLoggerContext$1.evaluate(InitialLoggerContext.java:52)
>>>>>>
>>>>>>     at org.junit.rules.RunRules.evaluate(RunRules.java:20)
>>>>>>
>>>>>>     at org.junit.runners.ParentRunner.runLeaf(ParentRunner.java:271)
>>>>>>
>>>>>>     at
>>>>>> org.junit.runners.BlockJUnit4ClassRunner.runChild(BlockJUnit4ClassRunner.java:70)
>>>>>>
>>>>>>     at
>>>>>> org.junit.runners.BlockJUnit4ClassRunner.runChild(BlockJUnit4ClassRunner.java:50)
>>>>>>
>>>>>>     at org.junit.runners.ParentRunner$3.run(ParentRunner.java:238)
>>>>>>
>>>>>>     at org.junit.runners.ParentRunner$1.schedule(ParentRunner.java:63)
>>>>>>
>>>>>>     at
>>>>>> org.junit.runners.ParentRunner.runChildren(ParentRunner.java:236)
>>>>>>
>>>>>>     at org.junit.runners.ParentRunner.access$000(ParentRunner.java:53)
>>>>>>
>>>>>>     at
>>>>>> org.junit.runners.ParentRunner$2.evaluate(ParentRunner.java:229)
>>>>>>
>>>>>>     at org.junit.runners.ParentRunner.run(ParentRunner.java:309)
>>>>>>
>>>>>>     at org.junit.runners.Suite.runChild(Suite.java:127)
>>>>>>
>>>>>>     at org.junit.runners.Suite.runChild(Suite.java:26)
>>>>>>
>>>>>>     at org.junit.runners.ParentRunner$3.run(ParentRunner.java:238)
>>>>>>
>>>>>>     at org.junit.runners.ParentRunner$1.schedule(ParentRunner.java:63)
>>>>>>
>>>>>>     at
>>>>>> org.junit.runners.ParentRunner.runChildren(ParentRunner.java:236)
>>>>>>
>>>>>>     at org.junit.runners.ParentRunner.access$000(ParentRunner.java:53)
>>>>>>
>>>>>>     at
>>>>>> org.junit.runners.ParentRunner$2.evaluate(ParentRunner.java:229)
>>>>>>
>>>>>>     at org.junit.runners.ParentRunner.run(ParentRunner.java:309)
>>>>>>
>>>>>>     at
>>>>>> org.eclipse.jdt.internal.junit4.runner.JUnit4TestReference.run(JUnit4TestReference.java:50)
>>>>>>
>>>>>>     at
>>>>>> org.eclipse.jdt.internal.junit.runner.TestExecution.run(TestExecution.java:38)
>>>>>>
>>>>>>     at
>>>>>> org.eclipse.jdt.internal.junit.runner.RemoteTestRunner.runTests(RemoteTestRunner.java:467)
>>>>>>
>>>>>>     at
>>>>>> org.eclipse.jdt.internal.junit.runner.RemoteTestRunner.runTests(RemoteTestRunner.java:683)
>>>>>>
>>>>>>     at
>>>>>> org.eclipse.jdt.internal.junit.runner.RemoteTestRunner.run(RemoteTestRunner.java:390)
>>>>>>
>>>>>>     at
>>>>>> org.eclipse.jdt.internal.junit.runner.RemoteTestRunner.main(RemoteTestRunner.java:197)
>>>>>>
>>>>>>
>>>>>>
>>>>>> testLogger[0](org.apache.logging.log4j.core.config.ConfigurationTest)
>>>>>> java.lang.AssertionError
>>>>>>
>>>>>>     at org.junit.Assert.fail(Assert.java:86)
>>>>>>
>>>>>>     at org.junit.Assert.assertTrue(Assert.java:41)
>>>>>>
>>>>>>     at org.junit.Assert.assertTrue(Assert.java:52)
>>>>>>
>>>>>>     at
>>>>>> org.apache.logging.log4j.junit.CleanFiles.delete(CleanFiles.java:53)
>>>>>>
>>>>>>     at
>>>>>> org.apache.logging.log4j.junit.CleanFiles.clean(CleanFiles.java:47)
>>>>>>
>>>>>>     at
>>>>>> org.apache.logging.log4j.junit.CleanFiles.before(CleanFiles.java:59)
>>>>>>
>>>>>>     at
>>>>>> org.junit.rules.ExternalResource$1.evaluate(ExternalResource.java:46)
>>>>>>
>>>>>>     at
>>>>>> org.apache.logging.log4j.junit.InitialLoggerContext$1.evaluate(InitialLoggerContext.java:52)
>>>>>>
>>>>>>     at org.junit.rules.RunRules.evaluate(RunRules.java:20)
>>>>>>
>>>>>>     at org.junit.runners.ParentRunner.runLeaf(ParentRunner.java:271)
>>>>>>
>>>>>>     at
>>>>>> org.junit.runners.BlockJUnit4ClassRunner.runChild(BlockJUnit4ClassRunner.java:70)
>>>>>>
>>>>>>     at
>>>>>> org.junit.runners.BlockJUnit4ClassRunner.runChild(BlockJUnit4ClassRunner.java:50)
>>>>>>
>>>>>>     at org.junit.runners.ParentRunner$3.run(ParentRunner.java:238)
>>>>>>
>>>>>>     at org.junit.runners.ParentRunner$1.schedule(ParentRunner.java:63)
>>>>>>
>>>>>>     at
>>>>>> org.junit.runners.ParentRunner.runChildren(ParentRunner.java:236)
>>>>>>
>>>>>>     at org.junit.runners.ParentRunner.access$000(ParentRunner.java:53)
>>>>>>
>>>>>>     at
>>>>>> org.junit.runners.ParentRunner$2.evaluate(ParentRunner.java:229)
>>>>>>
>>>>>>     at org.junit.runners.ParentRunner.run(ParentRunner.java:309)
>>>>>>
>>>>>>     at org.junit.runners.Suite.runChild(Suite.java:127)
>>>>>>
>>>>>>     at org.junit.runners.Suite.runChild(Suite.java:26)
>>>>>>
>>>>>>     at org.junit.runners.ParentRunner$3.run(ParentRunner.java:238)
>>>>>>
>>>>>>     at org.junit.runners.ParentRunner$1.schedule(ParentRunner.java:63)
>>>>>>
>>>>>>     at
>>>>>> org.junit.runners.ParentRunner.runChildren(ParentRunner.java:236)
>>>>>>
>>>>>>     at org.junit.runners.ParentRunner.access$000(ParentRunner.java:53)
>>>>>>
>>>>>>     at
>>>>>> org.junit.runners.ParentRunner$2.evaluate(ParentRunner.java:229)
>>>>>>
>>>>>>     at org.junit.runners.ParentRunner.run(ParentRunner.java:309)
>>>>>>
>>>>>>     at
>>>>>> org.eclipse.jdt.internal.junit4.runner.JUnit4TestReference.run(JUnit4TestReference.java:50)
>>>>>>
>>>>>>     at
>>>>>> org.eclipse.jdt.internal.junit.runner.TestExecution.run(TestExecution.java:38)
>>>>>>
>>>>>>     at
>>>>>> org.eclipse.jdt.internal.junit.runner.RemoteTestRunner.runTests(RemoteTestRunner.java:467)
>>>>>>
>>>>>>     at
>>>>>> org.eclipse.jdt.internal.junit.runner.RemoteTestRunner.runTests(RemoteTestRunner.java:683)
>>>>>>
>>>>>>     at
>>>>>> org.eclipse.jdt.internal.junit.runner.RemoteTestRunner.run(RemoteTestRunner.java:390)
>>>>>>
>>>>>>     at
>>>>>> org.eclipse.jdt.internal.junit.runner.RemoteTestRunner.main(RemoteTestRunner.java:197)
>>>>>>
>>>>>>
>>>>>>
>>>>>> [1]
>>>>>>
>>>>>> testLogToFile[1](org.apache.logging.log4j.core.config.ConfigurationTest)
>>>>>> java.lang.AssertionError
>>>>>>
>>>>>>     at org.junit.Assert.fail(Assert.java:86)
>>>>>>
>>>>>>     at org.junit.Assert.assertTrue(Assert.java:41)
>>>>>>
>>>>>>     at org.junit.Assert.assertTrue(Assert.java:52)
>>>>>>
>>>>>>     at
>>>>>> org.apache.logging.log4j.junit.CleanFiles.delete(CleanFiles.java:53)
>>>>>>
>>>>>>     at
>>>>>> org.apache.logging.log4j.junit.CleanFiles.clean(CleanFiles.java:47)
>>>>>>
>>>>>>     at
>>>>>> org.apache.logging.log4j.junit.CleanFiles.before(CleanFiles.java:59)
>>>>>>
>>>>>>     at
>>>>>> org.junit.rules.ExternalResource$1.evaluate(ExternalResource.java:46)
>>>>>>
>>>>>>     at
>>>>>> org.apache.logging.log4j.junit.InitialLoggerContext$1.evaluate(InitialLoggerContext.java:52)
>>>>>>
>>>>>>     at org.junit.rules.RunRules.evaluate(RunRules.java:20)
>>>>>>
>>>>>>     at org.junit.runners.ParentRunner.runLeaf(ParentRunner.java:271)
>>>>>>
>>>>>>     at
>>>>>> org.junit.runners.BlockJUnit4ClassRunner.runChild(BlockJUnit4ClassRunner.java:70)
>>>>>>
>>>>>>     at
>>>>>> org.junit.runners.BlockJUnit4ClassRunner.runChild(BlockJUnit4ClassRunner.java:50)
>>>>>>
>>>>>>     at org.junit.runners.ParentRunner$3.run(ParentRunner.java:238)
>>>>>>
>>>>>>     at org.junit.runners.ParentRunner$1.schedule(ParentRunner.java:63)
>>>>>>
>>>>>>     at
>>>>>> org.junit.runners.ParentRunner.runChildren(ParentRunner.java:236)
>>>>>>
>>>>>>     at org.junit.runners.ParentRunner.access$000(ParentRunner.java:53)
>>>>>>
>>>>>>     at
>>>>>> org.junit.runners.ParentRunner$2.evaluate(ParentRunner.java:229)
>>>>>>
>>>>>>     at org.junit.runners.ParentRunner.run(ParentRunner.java:309)
>>>>>>
>>>>>>     at org.junit.runners.Suite.runChild(Suite.java:127)
>>>>>>
>>>>>>     at org.junit.runners.Suite.runChild(Suite.java:26)
>>>>>>
>>>>>>     at org.junit.runners.ParentRunner$3.run(ParentRunner.java:238)
>>>>>>
>>>>>>     at org.junit.runners.ParentRunner$1.schedule(ParentRunner.java:63)
>>>>>>
>>>>>>     at
>>>>>> org.junit.runners.ParentRunner.runChildren(ParentRunner.java:236)
>>>>>>
>>>>>>     at org.junit.runners.ParentRunner.access$000(ParentRunner.java:53)
>>>>>>
>>>>>>     at
>>>>>> org.junit.runners.ParentRunner$2.evaluate(ParentRunner.java:229)
>>>>>>
>>>>>>     at org.junit.runners.ParentRunner.run(ParentRunner.java:309)
>>>>>>
>>>>>>     at
>>>>>> org.eclipse.jdt.internal.junit4.runner.JUnit4TestReference.run(JUnit4TestReference.java:50)
>>>>>>
>>>>>>     at
>>>>>> org.eclipse.jdt.internal.junit.runner.TestExecution.run(TestExecution.java:38)
>>>>>>
>>>>>>     at
>>>>>> org.eclipse.jdt.internal.junit.runner.RemoteTestRunner.runTests(RemoteTestRunner.java:467)
>>>>>>
>>>>>>     at
>>>>>> org.eclipse.jdt.internal.junit.runner.RemoteTestRunner.runTests(RemoteTestRunner.java:683)
>>>>>>
>>>>>>     at
>>>>>> org.eclipse.jdt.internal.junit.runner.RemoteTestRunner.run(RemoteTestRunner.java:390)
>>>>>>
>>>>>>     at
>>>>>> org.eclipse.jdt.internal.junit.runner.RemoteTestRunner.main(RemoteTestRunner.java:197)
>>>>>>
>>>>>>
>>>>>>
>>>>>>
>>>>>> testConfiguredAppenders[1](org.apache.logging.log4j.core.config.ConfigurationTest)
>>>>>> java.lang.AssertionError
>>>>>>
>>>>>>     at org.junit.Assert.fail(Assert.java:86)
>>>>>>
>>>>>>     at org.junit.Assert.assertTrue(Assert.java:41)
>>>>>>
>>>>>>     at org.junit.Assert.assertTrue(Assert.java:52)
>>>>>>
>>>>>>     at
>>>>>> org.apache.logging.log4j.junit.CleanFiles.delete(CleanFiles.java:53)
>>>>>>
>>>>>>     at
>>>>>> org.apache.logging.log4j.junit.CleanFiles.clean(CleanFiles.java:47)
>>>>>>
>>>>>>     at
>>>>>> org.apache.logging.log4j.junit.CleanFiles.before(CleanFiles.java:59)
>>>>>>
>>>>>>     at
>>>>>> org.junit.rules.ExternalResource$1.evaluate(ExternalResource.java:46)
>>>>>>
>>>>>>     at
>>>>>> org.apache.logging.log4j.junit.InitialLoggerContext$1.evaluate(InitialLoggerContext.java:52)
>>>>>>
>>>>>>     at org.junit.rules.RunRules.evaluate(RunRules.java:20)
>>>>>>
>>>>>>     at org.junit.runners.ParentRunner.runLeaf(ParentRunner.java:271)
>>>>>>
>>>>>>     at
>>>>>> org.junit.runners.BlockJUnit4ClassRunner.runChild(BlockJUnit4ClassRunner.java:70)
>>>>>>
>>>>>>     at
>>>>>> org.junit.runners.BlockJUnit4ClassRunner.runChild(BlockJUnit4ClassRunner.java:50)
>>>>>>
>>>>>>     at org.junit.runners.ParentRunner$3.run(ParentRunner.java:238)
>>>>>>
>>>>>>     at org.junit.runners.ParentRunner$1.schedule(ParentRunner.java:63)
>>>>>>
>>>>>>     at
>>>>>> org.junit.runners.ParentRunner.runChildren(ParentRunner.java:236)
>>>>>>
>>>>>>     at org.junit.runners.ParentRunner.access$000(ParentRunner.java:53)
>>>>>>
>>>>>>     at
>>>>>> org.junit.runners.ParentRunner$2.evaluate(ParentRunner.java:229)
>>>>>>
>>>>>>     at org.junit.runners.ParentRunner.run(ParentRunner.java:309)
>>>>>>
>>>>>>     at org.junit.runners.Suite.runChild(Suite.java:127)
>>>>>>
>>>>>>     at org.junit.runners.Suite.runChild(Suite.java:26)
>>>>>>
>>>>>>     at org.junit.runners.ParentRunner$3.run(ParentRunner.java:238)
>>>>>>
>>>>>>     at org.junit.runners.ParentRunner$1.schedule(ParentRunner.java:63)
>>>>>>
>>>>>>     at
>>>>>> org.junit.runners.ParentRunner.runChildren(ParentRunner.java:236)
>>>>>>
>>>>>>     at org.junit.runners.ParentRunner.access$000(ParentRunner.java:53)
>>>>>>
>>>>>>     at
>>>>>> org.junit.runners.ParentRunner$2.evaluate(ParentRunner.java:229)
>>>>>>
>>>>>>     at org.junit.runners.ParentRunner.run(ParentRunner.java:309)
>>>>>>
>>>>>>     at
>>>>>> org.eclipse.jdt.internal.junit4.runner.JUnit4TestReference.run(JUnit4TestReference.java:50)
>>>>>>
>>>>>>     at
>>>>>> org.eclipse.jdt.internal.junit.runner.TestExecution.run(TestExecution.java:38)
>>>>>>
>>>>>>     at
>>>>>> org.eclipse.jdt.internal.junit.runner.RemoteTestRunner.runTests(RemoteTestRunner.java:467)
>>>>>>
>>>>>>     at
>>>>>> org.eclipse.jdt.internal.junit.runner.RemoteTestRunner.runTests(RemoteTestRunner.java:683)
>>>>>>
>>>>>>     at
>>>>>> org.eclipse.jdt.internal.junit.runner.RemoteTestRunner.run(RemoteTestRunner.java:390)
>>>>>>
>>>>>>     at
>>>>>> org.eclipse.jdt.internal.junit.runner.RemoteTestRunner.main(RemoteTestRunner.java:197)
>>>>>>
>>>>>>
>>>>>>
>>>>>> testLogger[1](org.apache.logging.log4j.core.config.ConfigurationTest)
>>>>>> java.lang.AssertionError
>>>>>>
>>>>>>     at org.junit.Assert.fail(Assert.java:86)
>>>>>>
>>>>>>     at org.junit.Assert.assertTrue(Assert.java:41)
>>>>>>
>>>>>>     at org.junit.Assert.assertTrue(Assert.java:52)
>>>>>>
>>>>>>     at
>>>>>> org.apache.logging.log4j.junit.CleanFiles.delete(CleanFiles.java:53)
>>>>>>
>>>>>>     at
>>>>>> org.apache.logging.log4j.junit.CleanFiles.clean(CleanFiles.java:47)
>>>>>>
>>>>>>     at
>>>>>> org.apache.logging.log4j.junit.CleanFiles.before(CleanFiles.java:59)
>>>>>>
>>>>>>     at
>>>>>> org.junit.rules.ExternalResource$1.evaluate(ExternalResource.java:46)
>>>>>>
>>>>>>     at
>>>>>> org.apache.logging.log4j.junit.InitialLoggerContext$1.evaluate(InitialLoggerContext.java:52)
>>>>>>
>>>>>>     at org.junit.rules.RunRules.evaluate(RunRules.java:20)
>>>>>>
>>>>>>     at org.junit.runners.ParentRunner.runLeaf(ParentRunner.java:271)
>>>>>>
>>>>>>     at
>>>>>> org.junit.runners.BlockJUnit4ClassRunner.runChild(BlockJUnit4ClassRunner.java:70)
>>>>>>
>>>>>>     at
>>>>>> org.junit.runners.BlockJUnit4ClassRunner.runChild(BlockJUnit4ClassRunner.java:50)
>>>>>>
>>>>>>     at org.junit.runners.ParentRunner$3.run(ParentRunner.java:238)
>>>>>>
>>>>>>     at org.junit.runners.ParentRunner$1.schedule(ParentRunner.java:63)
>>>>>>
>>>>>>     at
>>>>>> org.junit.runners.ParentRunner.runChildren(ParentRunner.java:236)
>>>>>>
>>>>>>     at org.junit.runners.ParentRunner.access$000(ParentRunner.java:53)
>>>>>>
>>>>>>     at
>>>>>> org.junit.runners.ParentRunner$2.evaluate(ParentRunner.java:229)
>>>>>>
>>>>>>     at org.junit.runners.ParentRunner.run(ParentRunner.java:309)
>>>>>>
>>>>>>     at org.junit.runners.Suite.runChild(Suite.java:127)
>>>>>>
>>>>>>     at org.junit.runners.Suite.runChild(Suite.java:26)
>>>>>>
>>>>>>     at org.junit.runners.ParentRunner$3.run(ParentRunner.java:238)
>>>>>>
>>>>>>     at org.junit.runners.ParentRunner$1.schedule(ParentRunner.java:63)
>>>>>>
>>>>>>     at
>>>>>> org.junit.runners.ParentRunner.runChildren(ParentRunner.java:236)
>>>>>>
>>>>>>     at org.junit.runners.ParentRunner.access$000(ParentRunner.java:53)
>>>>>>
>>>>>>     at
>>>>>> org.junit.runners.ParentRunner$2.evaluate(ParentRunner.java:229)
>>>>>>
>>>>>>     at org.junit.runners.ParentRunner.run(ParentRunner.java:309)
>>>>>>
>>>>>>     at
>>>>>> org.eclipse.jdt.internal.junit4.runner.JUnit4TestReference.run(JUnit4TestReference.java:50)
>>>>>>
>>>>>>     at
>>>>>> org.eclipse.jdt.internal.junit.runner.TestExecution.run(TestExecution.java:38)
>>>>>>
>>>>>>     at
>>>>>> org.eclipse.jdt.internal.junit.runner.RemoteTestRunner.runTests(RemoteTestRunner.java:467)
>>>>>>
>>>>>>     at
>>>>>> org.eclipse.jdt.internal.junit.runner.RemoteTestRunner.runTests(RemoteTestRunner.java:683)
>>>>>>
>>>>>>     at
>>>>>> org.eclipse.jdt.internal.junit.runner.RemoteTestRunner.run(RemoteTestRunner.java:390)
>>>>>>
>>>>>>     at
>>>>>> org.eclipse.jdt.internal.junit.runner.RemoteTestRunner.main(RemoteTestRunner.java:197)
>>>>>>
>>>>>>
>>>>>>
>>>>>> [2]
>>>>>>
>>>>>> testLogToFile[2](org.apache.logging.log4j.core.config.ConfigurationTest)
>>>>>> java.lang.AssertionError
>>>>>>
>>>>>>     at org.junit.Assert.fail(Assert.java:86)
>>>>>>
>>>>>>     at org.junit.Assert.assertTrue(Assert.java:41)
>>>>>>
>>>>>>     at org.junit.Assert.assertTrue(Assert.java:52)
>>>>>>
>>>>>>     at
>>>>>> org.apache.logging.log4j.junit.CleanFiles.delete(CleanFiles.java:53)
>>>>>>
>>>>>>     at
>>>>>> org.apache.logging.log4j.junit.CleanFiles.clean(CleanFiles.java:47)
>>>>>>
>>>>>>     at
>>>>>> org.apache.logging.log4j.junit.CleanFiles.before(CleanFiles.java:59)
>>>>>>
>>>>>>     at
>>>>>> org.junit.rules.ExternalResource$1.evaluate(ExternalResource.java:46)
>>>>>>
>>>>>>     at
>>>>>> org.apache.logging.log4j.junit.InitialLoggerContext$1.evaluate(InitialLoggerContext.java:52)
>>>>>>
>>>>>>     at org.junit.rules.RunRules.evaluate(RunRules.java:20)
>>>>>>
>>>>>>     at org.junit.runners.ParentRunner.runLeaf(ParentRunner.java:271)
>>>>>>
>>>>>>     at
>>>>>> org.junit.runners.BlockJUnit4ClassRunner.runChild(BlockJUnit4ClassRunner.java:70)
>>>>>>
>>>>>>     at
>>>>>> org.junit.runners.BlockJUnit4ClassRunner.runChild(BlockJUnit4ClassRunner.java:50)
>>>>>>
>>>>>>     at org.junit.runners.ParentRunner$3.run(ParentRunner.java:238)
>>>>>>
>>>>>>     at org.junit.runners.ParentRunner$1.schedule(ParentRunner.java:63)
>>>>>>
>>>>>>     at
>>>>>> org.junit.runners.ParentRunner.runChildren(ParentRunner.java:236)
>>>>>>
>>>>>>     at org.junit.runners.ParentRunner.access$000(ParentRunner.java:53)
>>>>>>
>>>>>>     at
>>>>>> org.junit.runners.ParentRunner$2.evaluate(ParentRunner.java:229)
>>>>>>
>>>>>>     at org.junit.runners.ParentRunner.run(ParentRunner.java:309)
>>>>>>
>>>>>>     at org.junit.runners.Suite.runChild(Suite.java:127)
>>>>>>
>>>>>>     at org.junit.runners.Suite.runChild(Suite.java:26)
>>>>>>
>>>>>>     at org.junit.runners.ParentRunner$3.run(ParentRunner.java:238)
>>>>>>
>>>>>>     at org.junit.runners.ParentRunner$1.schedule(ParentRunner.java:63)
>>>>>>
>>>>>>     at
>>>>>> org.junit.runners.ParentRunner.runChildren(ParentRunner.java:236)
>>>>>>
>>>>>>     at org.junit.runners.ParentRunner.access$000(ParentRunner.java:53)
>>>>>>
>>>>>>     at
>>>>>> org.junit.runners.ParentRunner$2.evaluate(ParentRunner.java:229)
>>>>>>
>>>>>>     at org.junit.runners.ParentRunner.run(ParentRunner.java:309)
>>>>>>
>>>>>>     at
>>>>>> org.eclipse.jdt.internal.junit4.runner.JUnit4TestReference.run(JUnit4TestReference.java:50)
>>>>>>
>>>>>>     at
>>>>>> org.eclipse.jdt.internal.junit.runner.TestExecution.run(TestExecution.java:38)
>>>>>>
>>>>>>     at
>>>>>> org.eclipse.jdt.internal.junit.runner.RemoteTestRunner.runTests(RemoteTestRunner.java:467)
>>>>>>
>>>>>>     at
>>>>>> org.eclipse.jdt.internal.junit.runner.RemoteTestRunner.runTests(RemoteTestRunner.java:683)
>>>>>>
>>>>>>     at
>>>>>> org.eclipse.jdt.internal.junit.runner.RemoteTestRunner.run(RemoteTestRunner.java:390)
>>>>>>
>>>>>>     at
>>>>>> org.eclipse.jdt.internal.junit.runner.RemoteTestRunner.main(RemoteTestRunner.java:197)
>>>>>>
>>>>>>
>>>>>>
>>>>>>
>>>>>> testConfiguredAppenders[2](org.apache.logging.log4j.core.config.ConfigurationTest)
>>>>>> java.lang.AssertionError
>>>>>>
>>>>>>     at org.junit.Assert.fail(Assert.java:86)
>>>>>>
>>>>>>     at org.junit.Assert.assertTrue(Assert.java:41)
>>>>>>
>>>>>>     at org.junit.Assert.assertTrue(Assert.java:52)
>>>>>>
>>>>>>     at
>>>>>> org.apache.logging.log4j.junit.CleanFiles.delete(CleanFiles.java:53)
>>>>>>
>>>>>>     at
>>>>>> org.apache.logging.log4j.junit.CleanFiles.clean(CleanFiles.java:47)
>>>>>>
>>>>>>     at
>>>>>> org.apache.logging.log4j.junit.CleanFiles.before(CleanFiles.java:59)
>>>>>>
>>>>>>     at
>>>>>> org.junit.rules.ExternalResource$1.evaluate(ExternalResource.java:46)
>>>>>>
>>>>>>     at
>>>>>> org.apache.logging.log4j.junit.InitialLoggerContext$1.evaluate(InitialLoggerContext.java:52)
>>>>>>
>>>>>>     at org.junit.rules.RunRules.evaluate(RunRules.java:20)
>>>>>>
>>>>>>     at org.junit.runners.ParentRunner.runLeaf(ParentRunner.java:271)
>>>>>>
>>>>>>     at
>>>>>> org.junit.runners.BlockJUnit4ClassRunner.runChild(BlockJUnit4ClassRunner.java:70)
>>>>>>
>>>>>>     at
>>>>>> org.junit.runners.BlockJUnit4ClassRunner.runChild(BlockJUnit4ClassRunner.java:50)
>>>>>>
>>>>>>     at org.junit.runners.ParentRunner$3.run(ParentRunner.java:238)
>>>>>>
>>>>>>     at org.junit.runners.ParentRunner$1.schedule(ParentRunner.java:63)
>>>>>>
>>>>>>     at
>>>>>> org.junit.runners.ParentRunner.runChildren(ParentRunner.java:236)
>>>>>>
>>>>>>     at org.junit.runners.ParentRunner.access$000(ParentRunner.java:53)
>>>>>>
>>>>>>     at
>>>>>> org.junit.runners.ParentRunner$2.evaluate(ParentRunner.java:229)
>>>>>>
>>>>>>     at org.junit.runners.ParentRunner.run(ParentRunner.java:309)
>>>>>>
>>>>>>     at org.junit.runners.Suite.runChild(Suite.java:127)
>>>>>>
>>>>>>     at org.junit.runners.Suite.runChild(Suite.java:26)
>>>>>>
>>>>>>     at org.junit.runners.ParentRunner$3.run(ParentRunner.java:238)
>>>>>>
>>>>>>     at org.junit.runners.ParentRunner$1.schedule(ParentRunner.java:63)
>>>>>>
>>>>>>     at
>>>>>> org.junit.runners.ParentRunner.runChildren(ParentRunner.java:236)
>>>>>>
>>>>>>     at org.junit.runners.ParentRunner.access$000(ParentRunner.java:53)
>>>>>>
>>>>>>     at
>>>>>> org.junit.runners.ParentRunner$2.evaluate(ParentRunner.java:229)
>>>>>>
>>>>>>     at org.junit.runners.ParentRunner.run(ParentRunner.java:309)
>>>>>>
>>>>>>     at
>>>>>> org.eclipse.jdt.internal.junit4.runner.JUnit4TestReference.run(JUnit4TestReference.java:50)
>>>>>>
>>>>>>     at
>>>>>> org.eclipse.jdt.internal.junit.runner.TestExecution.run(TestExecution.java:38)
>>>>>>
>>>>>>     at
>>>>>> org.eclipse.jdt.internal.junit.runner.RemoteTestRunner.runTests(RemoteTestRunner.java:467)
>>>>>>
>>>>>>     at
>>>>>> org.eclipse.jdt.internal.junit.runner.RemoteTestRunner.runTests(RemoteTestRunner.java:683)
>>>>>>
>>>>>>     at
>>>>>> org.eclipse.jdt.internal.junit.runner.RemoteTestRunner.run(RemoteTestRunner.java:390)
>>>>>>
>>>>>>     at
>>>>>> org.eclipse.jdt.internal.junit.runner.RemoteTestRunner.main(RemoteTestRunner.java:197)
>>>>>>
>>>>>>
>>>>>>
>>>>>> testLogger[2](org.apache.logging.log4j.core.config.ConfigurationTest)
>>>>>> java.lang.AssertionError
>>>>>>
>>>>>>     at org.junit.Assert.fail(Assert.java:86)
>>>>>>
>>>>>>     at org.junit.Assert.assertTrue(Assert.java:41)
>>>>>>
>>>>>>     at org.junit.Assert.assertTrue(Assert.java:52)
>>>>>>
>>>>>>     at
>>>>>> org.apache.logging.log4j.junit.CleanFiles.delete(CleanFiles.java:53)
>>>>>>
>>>>>>     at
>>>>>> org.apache.logging.log4j.junit.CleanFiles.clean(CleanFiles.java:47)
>>>>>>
>>>>>>     at
>>>>>> org.apache.logging.log4j.junit.CleanFiles.before(CleanFiles.java:59)
>>>>>>
>>>>>>     at
>>>>>> org.junit.rules.ExternalResource$1.evaluate(ExternalResource.java:46)
>>>>>>
>>>>>>     at
>>>>>> org.apache.logging.log4j.junit.InitialLoggerContext$1.evaluate(InitialLoggerContext.java:52)
>>>>>>
>>>>>>     at org.junit.rules.RunRules.evaluate(RunRules.java:20)
>>>>>>
>>>>>>     at org.junit.runners.ParentRunner.runLeaf(ParentRunner.java:271)
>>>>>>
>>>>>>     at
>>>>>> org.junit.runners.BlockJUnit4ClassRunner.runChild(BlockJUnit4ClassRunner.java:70)
>>>>>>
>>>>>>     at
>>>>>> org.junit.runners.BlockJUnit4ClassRunner.runChild(BlockJUnit4ClassRunner.java:50)
>>>>>>
>>>>>>     at org.junit.runners.ParentRunner$3.run(ParentRunner.java:238)
>>>>>>
>>>>>>     at org.junit.runners.ParentRunner$1.schedule(ParentRunner.java:63)
>>>>>>
>>>>>>     at
>>>>>> org.junit.runners.ParentRunner.runChildren(ParentRunner.java:236)
>>>>>>
>>>>>>     at org.junit.runners.ParentRunner.access$000(ParentRunner.java:53)
>>>>>>
>>>>>>     at
>>>>>> org.junit.runners.ParentRunner$2.evaluate(ParentRunner.java:229)
>>>>>>
>>>>>>     at org.junit.runners.ParentRunner.run(ParentRunner.java:309)
>>>>>>
>>>>>>     at org.junit.runners.Suite.runChild(Suite.java:127)
>>>>>>
>>>>>>     at org.junit.runners.Suite.runChild(Suite.java:26)
>>>>>>
>>>>>>     at org.junit.runners.ParentRunner$3.run(ParentRunner.java:238)
>>>>>>
>>>>>>     at org.junit.runners.ParentRunner$1.schedule(ParentRunner.java:63)
>>>>>>
>>>>>>     at
>>>>>> org.junit.runners.ParentRunner.runChildren(ParentRunner.java:236)
>>>>>>
>>>>>>     at org.junit.runners.ParentRunner.access$000(ParentRunner.java:53)
>>>>>>
>>>>>>     at
>>>>>> org.junit.runners.ParentRunner$2.evaluate(ParentRunner.java:229)
>>>>>>
>>>>>>     at org.junit.runners.ParentRunner.run(ParentRunner.java:309)
>>>>>>
>>>>>>     at
>>>>>> org.eclipse.jdt.internal.junit4.runner.JUnit4TestReference.run(JUnit4TestReference.java:50)
>>>>>>
>>>>>>     at
>>>>>> org.eclipse.jdt.internal.junit.runner.TestExecution.run(TestExecution.java:38)
>>>>>>
>>>>>>     at
>>>>>> org.eclipse.jdt.internal.junit.runner.RemoteTestRunner.runTests(RemoteTestRunner.java:467)
>>>>>>
>>>>>>     at
>>>>>> org.eclipse.jdt.internal.junit.runner.RemoteTestRunner.runTests(RemoteTestRunner.java:683)
>>>>>>
>>>>>>     at
>>>>>> org.eclipse.jdt.internal.junit.runner.RemoteTestRunner.run(RemoteTestRunner.java:390)
>>>>>>
>>>>>>     at
>>>>>> org.eclipse.jdt.internal.junit.runner.RemoteTestRunner.main(RemoteTestRunner.java:197)
>>>>>>
>>>>>>
>>>>>> ?
>>>>>>
>>>>>> Gary
>>>>>>
>>>>>> --
>>>>>> E-Mail: garydgregory@gmail.com | ggregory@apache.org
>>>>>> Java Persistence with Hibernate, Second Edition<http://www.manning.com/bauer3/>
>>>>>> JUnit in Action, Second Edition <http://www.manning.com/tahchiev/>
>>>>>> Spring Batch in Action <http://www.manning.com/templier/>
>>>>>> Blog: http://garygregory.wordpress.com
>>>>>> Home: http://garygregory.com/
>>>>>> Tweet! http://twitter.com/GaryGregory
>>>>>>
>>>>>>
>>>>>>
>>>>>>
>>>>>
>>>>>
>>>>> --
>>>>> E-Mail: garydgregory@gmail.com | ggregory@apache.org
>>>>> Java Persistence with Hibernate, Second Edition<http://www.manning.com/bauer3/>
>>>>> JUnit in Action, Second Edition <http://www.manning.com/tahchiev/>
>>>>> Spring Batch in Action <http://www.manning.com/templier/>
>>>>> Blog: http://garygregory.wordpress.com
>>>>> Home: http://garygregory.com/
>>>>> Tweet! http://twitter.com/GaryGregory
>>>>>
>>>>>
>>>>>
>>>>
>>>>
>>>> --
>>>> E-Mail: garydgregory@gmail.com | ggregory@apache.org
>>>> Java Persistence with Hibernate, Second Edition<http://www.manning.com/bauer3/>
>>>> JUnit in Action, Second Edition <http://www.manning.com/tahchiev/>
>>>> Spring Batch in Action <http://www.manning.com/templier/>
>>>> Blog: http://garygregory.wordpress.com
>>>> Home: http://garygregory.com/
>>>> Tweet! http://twitter.com/GaryGregory
>>>>
>>>
>>>
>>>
>>> --
>>> E-Mail: garydgregory@gmail.com | ggregory@apache.org
>>> Java Persistence with Hibernate, Second Edition<http://www.manning.com/bauer3/>
>>> JUnit in Action, Second Edition <http://www.manning.com/tahchiev/>
>>> Spring Batch in Action <http://www.manning.com/templier/>
>>> Blog: http://garygregory.wordpress.com
>>> Home: http://garygregory.com/
>>> Tweet! http://twitter.com/GaryGregory
>>>
>>>
>>>
>>
>>
>> --
>> Matt Sicker <boards@gmail.com>
>>
>>
>
>
> --
> Matt Sicker <boards@gmail.com>
>



-- 
Matt Sicker <boards@gmail.com>

Mime
View raw message