logging-log4j-dev mailing list archives

Site index · List index
Message view « Date » · « Thread »
Top « Date » · « Thread »
From Gary Gregory <garydgreg...@gmail.com>
Subject Core test hangs
Date Mon, 25 Mar 2013 03:14:29 GMT
Hi All:

The latest from trunk hangs this test:

Tests run: 1, Failures: 0, Errors: 0, Skipped: 0, Time elapsed: 1.635 sec
Running org.apache.logging.log4j.core.net.SocketReconnectTest

My set up:

Apache Maven 3.0.5 (r01de14724cdef164cd33c7c8c2fe155faf9602da; 2013-02-19
08:51:28-0500)
Maven home: C:\Java\apache-maven-3.0.5\bin\..
Java version: 1.6.0_39, vendor: Sun Microsystems Inc.
Java home: C:\Program Files\Java\jdk1.6.0_39\jre
Default locale: en_US, platform encoding: Cp1252
OS name: "windows 7", version: "6.1", arch: "amd64", family: "windows"

Maven output:

-------------------------------------------------------
 T E S T S
-------------------------------------------------------
Running org.apache.logging.log4j.core.appender.AsynchAppenderTest
Tests run: 2, Failures: 0, Errors: 0, Skipped: 0, Time elapsed: 0.907 sec
Running org.apache.logging.log4j.core.appender.ConsoleAppenderTest
Tests run: 1, Failures: 0, Errors: 0, Skipped: 0, Time elapsed: 0.405 sec
Running org.apache.logging.log4j.core.appender.FailoverAppenderTest
2013-03-24 23:06:11,364 ERROR logger contains an invalid element or
attribute "additvity"
2013-03-24 23:06:11,404 ERROR An exception occurred processing Appender
Fail org.apache.logging.log4j.LoggingException: Always fail
        at
org.apache.logging.log4j.test.appender.AlwaysFailAppender.append(AlwaysFailAppender.java:37)
        at
org.apache.logging.log4j.core.config.AppenderControl.callAppender(AppenderControl.java:102)
        at
org.apache.logging.log4j.core.appender.FailoverAppender.callAppender(FailoverAppender.java:122)
        at
org.apache.logging.log4j.core.appender.FailoverAppender.append(FailoverAppender.java:109)
        at
org.apache.logging.log4j.core.config.AppenderControl.callAppender(AppenderControl.java:102)
        at
org.apache.logging.log4j.core.config.LoggerConfig.callAppenders(LoggerConfig.java:335)
        at
org.apache.logging.log4j.core.config.LoggerConfig.log(LoggerConfig.java:316)
        at
org.apache.logging.log4j.core.config.LoggerConfig.log(LoggerConfig.java:281)
        at org.apache.logging.log4j.core.Logger.log(Logger.java:108)
        at
org.apache.logging.log4j.spi.AbstractLogger.error(AbstractLogger.java:530)
        at
org.apache.logging.log4j.core.appender.FailoverAppenderTest.testFailover(FailoverAppenderTest.java:75)
        at sun.reflect.NativeMethodAccessorImpl.invoke0(Native Method)
        at
sun.reflect.NativeMethodAccessorImpl.invoke(NativeMethodAccessorImpl.java:39)
        at
sun.reflect.DelegatingMethodAccessorImpl.invoke(DelegatingMethodAccessorImpl.java:25)
        at java.lang.reflect.Method.invoke(Method.java:597)
        at
org.junit.runners.model.FrameworkMethod$1.runReflectiveCall(FrameworkMethod.java:44)
        at
org.junit.internal.runners.model.ReflectiveCallable.run(ReflectiveCallable.java:15)
        at
org.junit.runners.model.FrameworkMethod.invokeExplosively(FrameworkMethod.java:41)
        at
org.junit.internal.runners.statements.InvokeMethod.evaluate(InvokeMethod.java:20)
        at
org.junit.runners.BlockJUnit4ClassRunner.runChild(BlockJUnit4ClassRunner.java:76)
        at
org.junit.runners.BlockJUnit4ClassRunner.runChild(BlockJUnit4ClassRunner.java:50)
        at org.junit.runners.ParentRunner$3.run(ParentRunner.java:193)
        at org.junit.runners.ParentRunner$1.schedule(ParentRunner.java:52)
        at org.junit.runners.ParentRunner.runChildren(ParentRunner.java:191)
        at org.junit.runners.ParentRunner.access$000(ParentRunner.java:42)
        at org.junit.runners.ParentRunner$2.evaluate(ParentRunner.java:184)
        at
org.junit.internal.runners.statements.RunBefores.evaluate(RunBefores.java:28)
        at
org.junit.internal.runners.statements.RunAfters.evaluate(RunAfters.java:31)
        at org.junit.runners.ParentRunner.run(ParentRunner.java:236)
        at
org.apache.maven.surefire.junit4.JUnit4Provider.execute(JUnit4Provider.java:252)
        at
org.apache.maven.surefire.junit4.JUnit4Provider.executeTestSet(JUnit4Provider.java:141)
        at
org.apache.maven.surefire.junit4.JUnit4Provider.invoke(JUnit4Provider.java:112)
        at sun.reflect.NativeMethodAccessorImpl.invoke0(Native Method)
        at
sun.reflect.NativeMethodAccessorImpl.invoke(NativeMethodAccessorImpl.java:39)
        at
sun.reflect.DelegatingMethodAccessorImpl.invoke(DelegatingMethodAccessorImpl.java:25)
        at java.lang.reflect.Method.invoke(Method.java:597)
        at
org.apache.maven.surefire.util.ReflectionUtils.invokeMethodWithArray(ReflectionUtils.java:189)
        at
org.apache.maven.surefire.booter.ProviderFactory$ProviderProxy.invoke(ProviderFactory.java:165)
        at
org.apache.maven.surefire.booter.ProviderFactory.invokeProvider(ProviderFactory.java:85)
        at
org.apache.maven.surefire.booter.ForkedBooter.runSuitesInProcess(ForkedBooter.java:115)
        at
org.apache.maven.surefire.booter.ForkedBooter.main(ForkedBooter.java:75)

2013-03-24 23:06:11,414 ERROR An exception occurred processing Appender
Once org.apache.logging.log4j.LoggingException: Always fail
        at
org.apache.logging.log4j.test.appender.FailOnceAppender.append(FailOnceAppender.java:46)
        at
org.apache.logging.log4j.core.config.AppenderControl.callAppender(AppenderControl.java:102)
        at
org.apache.logging.log4j.core.appender.FailoverAppender.callAppender(FailoverAppender.java:122)
        at
org.apache.logging.log4j.core.appender.FailoverAppender.append(FailoverAppender.java:109)
        at
org.apache.logging.log4j.core.config.AppenderControl.callAppender(AppenderControl.java:102)
        at
org.apache.logging.log4j.core.config.LoggerConfig.callAppenders(LoggerConfig.java:335)
        at
org.apache.logging.log4j.core.config.LoggerConfig.log(LoggerConfig.java:316)
        at
org.apache.logging.log4j.core.config.LoggerConfig.log(LoggerConfig.java:281)
        at org.apache.logging.log4j.core.Logger.log(Logger.java:108)
        at
org.apache.logging.log4j.spi.AbstractLogger.error(AbstractLogger.java:530)
        at
org.apache.logging.log4j.core.appender.FailoverAppenderTest.testRecovery(FailoverAppenderTest.java:89)
        at sun.reflect.NativeMethodAccessorImpl.invoke0(Native Method)
        at
sun.reflect.NativeMethodAccessorImpl.invoke(NativeMethodAccessorImpl.java:39)
        at
sun.reflect.DelegatingMethodAccessorImpl.invoke(DelegatingMethodAccessorImpl.java:25)
        at java.lang.reflect.Method.invoke(Method.java:597)
        at
org.junit.runners.model.FrameworkMethod$1.runReflectiveCall(FrameworkMethod.java:44)
        at
org.junit.internal.runners.model.ReflectiveCallable.run(ReflectiveCallable.java:15)
        at
org.junit.runners.model.FrameworkMethod.invokeExplosively(FrameworkMethod.java:41)
        at
org.junit.internal.runners.statements.InvokeMethod.evaluate(InvokeMethod.java:20)
        at
org.junit.runners.BlockJUnit4ClassRunner.runChild(BlockJUnit4ClassRunner.java:76)
        at
org.junit.runners.BlockJUnit4ClassRunner.runChild(BlockJUnit4ClassRunner.java:50)
        at org.junit.runners.ParentRunner$3.run(ParentRunner.java:193)
        at org.junit.runners.ParentRunner$1.schedule(ParentRunner.java:52)
        at org.junit.runners.ParentRunner.runChildren(ParentRunner.java:191)
        at org.junit.runners.ParentRunner.access$000(ParentRunner.java:42)
        at org.junit.runners.ParentRunner$2.evaluate(ParentRunner.java:184)
        at
org.junit.internal.runners.statements.RunBefores.evaluate(RunBefores.java:28)
        at
org.junit.internal.runners.statements.RunAfters.evaluate(RunAfters.java:31)
        at org.junit.runners.ParentRunner.run(ParentRunner.java:236)
        at
org.apache.maven.surefire.junit4.JUnit4Provider.execute(JUnit4Provider.java:252)
        at
org.apache.maven.surefire.junit4.JUnit4Provider.executeTestSet(JUnit4Provider.java:141)
        at
org.apache.maven.surefire.junit4.JUnit4Provider.invoke(JUnit4Provider.java:112)
        at sun.reflect.NativeMethodAccessorImpl.invoke0(Native Method)
        at
sun.reflect.NativeMethodAccessorImpl.invoke(NativeMethodAccessorImpl.java:39)
        at
sun.reflect.DelegatingMethodAccessorImpl.invoke(DelegatingMethodAccessorImpl.java:25)
        at java.lang.reflect.Method.invoke(Method.java:597)
        at
org.apache.maven.surefire.util.ReflectionUtils.invokeMethodWithArray(ReflectionUtils.java:189)
        at
org.apache.maven.surefire.booter.ProviderFactory$ProviderProxy.invoke(ProviderFactory.java:165)
        at
org.apache.maven.surefire.booter.ProviderFactory.invokeProvider(ProviderFactory.java:85)
        at
org.apache.maven.surefire.booter.ForkedBooter.runSuitesInProcess(ForkedBooter.java:115)
        at
org.apache.maven.surefire.booter.ForkedBooter.main(ForkedBooter.java:75)

Tests run: 2, Failures: 0, Errors: 0, Skipped: 0, Time elapsed: 1.975 sec
Running org.apache.logging.log4j.core.appender.FileAppenderTest
Tests run: 4, Failures: 0, Errors: 0, Skipped: 0, Time elapsed: 0.948 sec
Running org.apache.logging.log4j.core.appender.OutputStreamAppenderTest
Tests run: 1, Failures: 0, Errors: 0, Skipped: 0, Time elapsed: 0.465 sec
Running org.apache.logging.log4j.core.appender.rewrite.MapRewritePolicyTest
Tests run: 3, Failures: 0, Errors: 0, Skipped: 0, Time elapsed: 0.12 sec
Running org.apache.logging.log4j.core.appender.rewrite.RewriteAppenderTest
Tests run: 2, Failures: 0, Errors: 0, Skipped: 0, Time elapsed: 0.731 sec
Running
org.apache.logging.log4j.core.appender.rolling.helper.FileRenameActionTest
Tests run: 3, Failures: 0, Errors: 0, Skipped: 0, Time elapsed: 0.105 sec
Running
org.apache.logging.log4j.core.appender.rolling.OnStartupTriggeringPolicyTest
Tests run: 1, Failures: 0, Errors: 0, Skipped: 0, Time elapsed: 0.335 sec
Running
org.apache.logging.log4j.core.appender.rolling.RollingAppenderSizeTest
2013-03-24 23:06:19,953 WARN Unable to instantiate WindowsAnsiOutputStream
2013-03-24 23:06:19,993 WARN Unable to instantiate WindowsAnsiOutputStream
2013-03-24 23:06:20,053 WARN Unable to instantiate WindowsAnsiOutputStream
2013-03-24 23:06:20,248 WARN Unable to instantiate WindowsAnsiOutputStream
Tests run: 1, Failures: 0, Errors: 0, Skipped: 0, Time elapsed: 1.045 sec
Running
org.apache.logging.log4j.core.appender.rolling.RollingAppenderTimeAndSizeTest
2013-03-24 23:06:21,794 WARN Unable to instantiate WindowsAnsiOutputStream
2013-03-24 23:06:21,829 WARN Unable to instantiate WindowsAnsiOutputStream
2013-03-24 23:06:21,879 WARN Unable to instantiate WindowsAnsiOutputStream
2013-03-24 23:06:32,030 WARN Unable to instantiate WindowsAnsiOutputStream
Tests run: 1, Failures: 0, Errors: 0, Skipped: 0, Time elapsed: 11.032 sec
Running
org.apache.logging.log4j.core.appender.rolling.RollingAppenderTimeTest
2013-03-24 23:06:33,245 WARN Unable to instantiate WindowsAnsiOutputStream
2013-03-24 23:06:33,275 WARN Unable to instantiate WindowsAnsiOutputStream
2013-03-24 23:06:33,330 WARN Unable to instantiate WindowsAnsiOutputStream
2013-03-24 23:06:43,391 WARN Unable to instantiate WindowsAnsiOutputStream
Tests run: 1, Failures: 0, Errors: 0, Skipped: 0, Time elapsed: 10.686 sec
Running
org.apache.logging.log4j.core.appender.rolling.RollingAppenderUncompressedTest
2013-03-24 23:06:44,577 WARN Unable to instantiate WindowsAnsiOutputStream
2013-03-24 23:06:44,607 WARN Unable to instantiate WindowsAnsiOutputStream
2013-03-24 23:06:44,667 WARN Unable to instantiate WindowsAnsiOutputStream
2013-03-24 23:06:44,842 WARN Unable to instantiate WindowsAnsiOutputStream
Tests run: 1, Failures: 0, Errors: 0, Skipped: 0, Time elapsed: 0.89 sec
Running
org.apache.logging.log4j.core.appender.routing.JSONRoutingAppender2Test
Tests run: 1, Failures: 0, Errors: 0, Skipped: 0, Time elapsed: 0.79 sec
Running
org.apache.logging.log4j.core.appender.routing.JSONRoutingAppenderTest
Tests run: 1, Failures: 0, Errors: 0, Skipped: 0, Time elapsed: 0.87 sec
Running org.apache.logging.log4j.core.appender.routing.RoutingAppenderTest
2013-03-24 23:06:48,968 DEBUG Found Plugin Map at
file:/C:/svn/org/apache/log4j2/trunk/core/target/classes/org/apache/logging/log4j/core/config/plugins/Log4j2Plugins.dat
2013-03-24 23:06:48,983 DEBUG Generated plugins in 0.019705931 seconds
2013-03-24 23:06:48,988 DEBUG Generated plugins in 0.003602810 seconds
2013-03-24 23:06:48,993 DEBUG Generated plugins in 0.003379920 seconds
2013-03-24 23:06:48,993 DEBUG Generated plugins in 0.002793630 seconds
2013-03-24 23:06:48,998 DEBUG Generated plugins in 0.003221702 seconds
2013-03-24 23:06:49,003 DEBUG Generated plugins in 0.003306393 seconds
2013-03-24 23:06:49,008 DEBUG Generated plugins in 0.003344118 seconds
2013-03-24 23:06:49,008 DEBUG Generated plugins in 0.003145865 seconds
2013-03-24 23:06:49,013 DEBUG Generated plugins in 0.003799908 seconds
2013-03-24 23:06:49,018 DEBUG Generated plugins in 0.002979565 seconds
2013-03-24 23:06:49,023 DEBUG Generated plugins in 0.003329875 seconds
2013-03-24 23:06:49,028 DEBUG Generated plugins in 0.003103520 seconds
2013-03-24 23:06:49,028 DEBUG Generated plugins in 0.003259043 seconds
2013-03-24 23:06:49,033 DEBUG Generated plugins in 0.002557652 seconds
2013-03-24 23:06:49,038 DEBUG Generated plugins in 0.003679416 seconds
2013-03-24 23:06:49,043 DEBUG Generated plugins in 0.002323213 seconds
2013-03-24 23:06:49,043 DEBUG Generated plugins in 0.002404825 seconds
2013-03-24 23:06:49,048 DEBUG Generated plugins in 0.002826737 seconds
2013-03-24 23:06:49,053 DEBUG Generated plugins in 0.003545451 seconds
2013-03-24 23:06:49,058 DEBUG Generated plugins in 0.004150988 seconds
2013-03-24 23:06:49,063 DEBUG Generated plugins in 0.003700588 seconds
2013-03-24 23:06:49,063 DEBUG Generated plugins in 0.003523509 seconds
2013-03-24 23:06:49,078 DEBUG Calling createProperty on class
org.apache.logging.log4j.core.config.Property for element property with
params(name="filename", value="target/routing1/routingtest-${sd:type}.log")
2013-03-24 23:06:49,088 DEBUG Calling configureSubstitutor on class
org.apache.logging.log4j.core.config.plugins.PropertiesPlugin for element
properties with
params(properties={filename=target/routing1/routingtest-${sd:type}.log},
 Configuration(RoutingTest))
2013-03-24 23:06:49,088 DEBUG Generated plugins in 0.002384037 seconds
2013-03-24 23:06:49,093 DEBUG Calling createFilter on class
org.apache.logging.log4j.core.filter.ThresholdFilter for element
ThresholdFilter with params(level="debug", onMatch="null",
onMismatch="null")
2013-03-24 23:06:49,093 DEBUG Calling createLayout on class
org.apache.logging.log4j.core.layout.PatternLayout for element
PatternLayout with params(pattern="%m%n", Configuration(RoutingTest), null,
charset="null")
2013-03-24 23:06:49,098 DEBUG Generated plugins in 0.002292417 seconds
2013-03-24 23:06:49,098 DEBUG Calling createAppender on class
org.apache.logging.log4j.core.appender.ConsoleAppender for element Console
with params(PatternLayout(%m%n), null, target="null", name="STDOUT",
follow="null", suppressE
xceptions="null")
2013-03-24 23:06:49,103 WARN Unable to instantiate WindowsAnsiOutputStream
2013-03-24 23:06:49,103 DEBUG Calling createFilter on class
org.apache.logging.log4j.core.filter.ThresholdFilter for element
ThresholdFilter with params(level="debug", onMatch="null",
onMismatch="null")
2013-03-24 23:06:49,108 DEBUG Calling createAppender on class
org.apache.logging.log4j.test.appender.ListAppender for element List with
params(name="List", entryPerNewLine="null", raw="null", null,
ThresholdFilter(DEBUG))
2013-03-24 23:06:49,113 DEBUG Calling createRoute on class
org.apache.logging.log4j.core.appender.routing.Route for element Route with
params(ref="null", key="null", Node=Route)
2013-03-24 23:06:49,113 DEBUG Calling createRoute on class
org.apache.logging.log4j.core.appender.routing.Route for element Route with
params(ref="STDOUT", key="Audit", Node=Route)
2013-03-24 23:06:49,113 DEBUG Calling createRoute on class
org.apache.logging.log4j.core.appender.routing.Route for element Route with
params(ref="List", key="Service", Node=Route)
2013-03-24 23:06:49,113 DEBUG Calling createRoutes on class
org.apache.logging.log4j.core.appender.routing.Routes for element Routes
with params(pattern="${sd:type}", routes={Route(type=dynamic - type=Route
default), Route(type=st
atic Reference=STDOUT key='Audit'), Route(type=static Reference=List
key='Service')})
2013-03-24 23:06:49,113 DEBUG Calling createAppender on class
org.apache.logging.log4j.core.appender.routing.RoutingAppender for element
Routing with params(name="Routing", suppressExceptions="null",
Routes({Route(type=dynamic - t
ype=Route default),Route(type=static Reference=STDOUT
key='Audit'),Route(type=static Reference=List key='Service')}),
Configuration(RoutingTest), null, null)
2013-03-24 23:06:49,118 DEBUG Calling createAppenders on class
org.apache.logging.log4j.core.config.plugins.AppendersPlugin for element
appenders with params(appenders={STDOUT, List, Routing})
2013-03-24 23:06:49,118 DEBUG Calling createAppenderRef on class
org.apache.logging.log4j.core.config.AppenderRef for element appender-ref
with params(ref="Routing", level="null", null)
2013-03-24 23:06:49,118 DEBUG Calling createLogger on class
org.apache.logging.log4j.core.config.LoggerConfig for element logger with
params(additivity="false", level="info", name="EventLogger",
appender-ref={org.apache.logging.lo
g4j.core.config.AppenderRef@7977b9b}, properties={},
Configuration(RoutingTest), null)
2013-03-24 23:06:49,123 DEBUG Calling createAppenderRef on class
org.apache.logging.log4j.core.config.AppenderRef for element appender-ref
with params(ref="STDOUT", level="null", null)
2013-03-24 23:06:49,128 DEBUG Calling createLogger on class
org.apache.logging.log4j.core.config.LoggerConfig$RootLogger for element
root with params(additivity="null", level="error", appender-ref={
org.apache.logging.log4j.core.co
nfig.AppenderRef@48e61a35}, properties={}, Configuration(RoutingTest), null)
2013-03-24 23:06:49,128 DEBUG Calling createLoggers on class
org.apache.logging.log4j.core.config.plugins.LoggersPlugin for element
loggers with params(loggers={EventLogger, root})
2013-03-24 23:06:49,128 DEBUG Reconfiguration completed
2013-03-24 23:06:49,153 DEBUG Calling createLayout on class
org.apache.logging.log4j.core.layout.PatternLayout for element
PatternLayout with params(pattern="%d %p %C{1.} [%t] %m%n",
Configuration(RoutingTest), null, charset="null
")
2013-03-24 23:06:49,153 DEBUG Calling createPolicy on class
org.apache.logging.log4j.core.appender.rolling.SizeBasedTriggeringPolicy
for element SizeBasedTriggeringPolicy with params(size="500")
2013-03-24 23:06:49,158 DEBUG Calling createAppender on class
org.apache.logging.log4j.core.appender.RollingFileAppender for element
RollingFile with params(fileName="target/routing1/routingtest-Alert.log",
filePattern="target/rou
ting1/test1-Alert.%i.log.gz", append="null", name="Routing-Alert",
bufferedIO="null", immediateFlush="null",
SizeBasedTriggeringPolicy(SizeBasedTriggeringPolicy(size=500)), null,
PatternLayout(%d %p %C{1.} [%t] %m%n), null, suppre
ssExceptions="null", advertise="null", advertiseURI="null",
Configuration(RoutingTest))
2013-03-24 23:06:49,163 DEBUG Starting RollingFileManager
target/routing1/routingtest-Alert.log
2013-03-24 23:06:49,168 DEBUG Generated plugins in 0.004229134 seconds
2013-03-24 23:06:49,178 DEBUG Calling createLayout on class
org.apache.logging.log4j.core.layout.PatternLayout for element
PatternLayout with params(pattern="%d %p %C{1.} [%t] %m%n",
Configuration(RoutingTest), null, charset="null
")
2013-03-24 23:06:49,178 DEBUG Calling createPolicy on class
org.apache.logging.log4j.core.appender.rolling.SizeBasedTriggeringPolicy
for element SizeBasedTriggeringPolicy with params(size="500")
2013-03-24 23:06:49,178 DEBUG Calling createAppender on class
org.apache.logging.log4j.core.appender.RollingFileAppender for element
RollingFile with
params(fileName="target/routing1/routingtest-Activity.log",
filePattern="target/
routing1/test1-Activity.%i.log.gz", append="null", name="Routing-Activity",
bufferedIO="null", immediateFlush="null",
SizeBasedTriggeringPolicy(SizeBasedTriggeringPolicy(size=500)), null,
PatternLayout(%d %p %C{1.} [%t] %m%n), nul
l, suppressExceptions="null", advertise="null", advertiseURI="null",
Configuration(RoutingTest))
2013-03-24 23:06:49,178 DEBUG Starting RollingFileManager
target/routing1/routingtest-Activity.log
2013-03-24 23:06:49,183 DEBUG Generated plugins in 0.002574205 seconds
2013-03-24 23:06:49,183 DEBUG Reconfiguration started for context
sun.misc.Launcher$AppClassLoader@3326b249
2013-03-24 23:06:49,208 DEBUG Generated plugins in 0.003079268 seconds
2013-03-24 23:06:49,208 WARN Unable to instantiate WindowsAnsiOutputStream
2013-03-24 23:06:49,213 DEBUG Shutting down RollingFileManager
target/routing1/routingtest-Activity.log
2013-03-24 23:06:49,213 DEBUG Shutting down RollingFileManager
target/routing1/routingtest-Alert.log
2013-03-24 23:06:49,213 DEBUG Reconfiguration completed
Tests run: 1, Failures: 0, Errors: 0, Skipped: 0, Time elapsed: 0.846 sec
Running org.apache.logging.log4j.core.appender.SMTPAppenderTest
Tests run: 6, Failures: 0, Errors: 0, Skipped: 0, Time elapsed: 0.615 sec
Running org.apache.logging.log4j.core.appender.SocketAppenderTest
Tests run: 2, Failures: 0, Errors: 0, Skipped: 0, Time elapsed: 0.886 sec
Running org.apache.logging.log4j.core.appender.SyslogAppenderTest
Tests run: 5, Failures: 0, Errors: 0, Skipped: 0, Time elapsed: 0.66 sec
Running org.apache.logging.log4j.core.AppenderRefLevelTest
2013-03-24 23:06:54,284 WARN Unable to instantiate WindowsAnsiOutputStream
2013-03-24 23:06:54,339 WARN Unable to instantiate WindowsAnsiOutputStream
Tests run: 3, Failures: 0, Errors: 0, Skipped: 0, Time elapsed: 0.615 sec
Running org.apache.logging.log4j.core.BasicLoggingTest
23:06:55.694 [main] ERROR org.apache.logging.log4j.core.BasicLoggingTest -
Test message
Tests run: 1, Failures: 0, Errors: 0, Skipped: 0, Time elapsed: 0.65 sec
Running org.apache.logging.log4j.core.CollectionLoggingTest
23:06:57.014 [main] ERROR
org.apache.logging.log4j.core.CollectionLoggingTest -
{java.runtime.name=Java(TM)
SE Runtime Environment, sun.boot.library.path=C:\Program
Files\Java\jdk1.6.0_39\jre\bin, java.vm.version=20.14-b01, java.v
m.vendor=Sun Microsystems Inc., java.vendor.url=http://java.sun.com/,
path.separator=;, java.vm.name=Java HotSpot(TM) 64-Bit Server VM,
file.encoding.pkg=sun.io, sun.java.launcher=SUN_STANDARD, user.country=US,
sun.os.patch.level=
Service Pack 1, java.vm.specification.name=Java Virtual Machine
Specification, user.dir=C:\svn\org\apache\log4j2\trunk\core,
java.runtime.version=1.6.0_39-b04,
basedir=C:\svn\org\apache\log4j2\trunk\core, java.awt.graphicsenv=sun.
awt.Win32GraphicsEnvironment, java.endorsed.dirs=C:\Program
Files\Java\jdk1.6.0_39\jre\lib\endorsed, os.arch=amd64,
surefire.real.class.path=C:\svn\org\apache\log4j2\trunk\core\target\surefire\surefirebooter8053787884026318717.jar
, java.io.tmpdir=C:\Users\ggregory\AppData\Local\Temp\, line.separator=
, java.vm.specification.vendor=Sun Microsystems Inc., user.variant=,
os.name=Windows
7, sun.jnu.encoding=Cp1252, java.library.path=C:\Program
Files\Java\jdk1.6.0_39\jre\bin;C:\Windows\Sun\Java\bin;C:\Windows\system32;C:\Windows;C:
\Program Files\Python27\;C:\Program
Files\Python27\Scripts;C:\App\Ruby193\bin;C:\Program Files
(x86)\IBM\WebSphere MQ\java\lib;C:\Program Files (x86)\IBM\WebSphere
MQ\java\lib64;C:\App\Perl64\site\bin;C:\App\Perl64\bin;C:\Program
Files\Common Files\Microsoft Shared\Windows Live;C:\Program Files
(x86)\Common Files\Microsoft Shared\Windows
Live;C:\Windows\system32;C:\Windows;C:\Windows\System32\Wbem;C:\Program
Files\Intel\WiFi\bin\;C:\Program Files\Common Fi
les\Intel\WirelessCommon\;C:\Program Files (x86)\Common
Files\Lenovo;c:\Program Files (x86)\Microsoft SQL
Server\100\Tools\Binn\;c:\Program Files\Microsoft SQL
Server\100\Tools\Binn\;c:\Program Files\Microsoft SQL Server\100\DTS\B
inn\;C:\Java\apache-maven-3.0.5\bin;C:\Java\apache-maven-2.2.1\bin;C:\Java\apache-ant-1.9.0\bin;C:\Program
Files (x86)\GNU\GnuPG;C:\Program Files (x86)\Windows Live\Shared;C:\Program
Files (x86)\GNU\GnuPG\pub;C:\Program Files (x86
)\IBM\WebSphere MQ\bin64;C:\Program Files (x86)\IBM\WebSphere
MQ\bin;C:\Program Files (x86)\IBM\WebSphere
MQ\tools\c\samples\bin;C:\SWTOOLS\ReadyApps;C:\Program Files
(x86)\Lenovo\Access Connections\;C:\Program Files (x86)\QuickTi
me\QTSystem\;C:\Windows\System32\WindowsPowerShell\v1.0\;C:\Program
Files\SlikSvn\bin;C:\App;C:\Program Files (x86)\Git\cmd;C:\Program
Files\TortoiseSVN\bin;%APPDATA%\Python\Scripts;.,
surefire.test.class.path=C:\svn\org\apache\lo
g4j2\trunk\core\target\test-classes;C:\svn\org\apache\log4j2\trunk\core\target\classes;C:\Users\ggregory\.m2\repository\org\apache\logging\log4j\log4j-api\2.0-beta5-SNAPSHOT\log4j-api-2.0-beta5-SNAPSHOT.jar;C:\Users\ggregory\.m2\r
epository\org\osgi\core\4.3.0\core-4.3.0.jar;C:\Users\ggregory\.m2\repository\org\codehaus\jackson\jackson-core-asl\1.9.2\jackson-core-asl-1.9.2.jar;C:\Users\ggregory\.m2\repository\org\codehaus\jackson\jackson-mapper-asl\1.9.2\ja
ckson-mapper-asl-1.9.2.jar;C:\Users\ggregory\.m2\repository\org\fusesource\jansi\jansi\1.9\jansi-1.9.jar;C:\Users\ggregory\.m2\repository\javax\jmdns\jmdns\3.4.1\jmdns-3.4.1.jar;C:\Users\ggregory\.m2\repository\oro\oro\2.0.8\oro-2
.0.8.jar;C:\Users\ggregory\.m2\repository\log4j\log4j\1.2.16\log4j-1.2.16.jar;C:\Users\ggregory\.m2\repository\org\slf4j\slf4j-api\1.7.2\slf4j-api-1.7.2.jar;C:\Users\ggregory\.m2\repository\org\slf4j\slf4j-ext\1.7.2\slf4j-ext-1.7.
2.jar;C:\Users\ggregory\.m2\repository\ch\qos\cal10n\cal10n-api\0.7.4\cal10n-api-0.7.4.jar;C:\Users\ggregory\.m2\repository\junit\junit\4.7\junit-4.7.jar;C:\Users\ggregory\.m2\repository\org\mockejb\mockejb\0.6-beta2\mockejb-0.6-b
eta2.jar;C:\Users\ggregory\.m2\repository\cglib\cglib-full\2.0.2\cglib-full-2.0.2.jar;C:\Users\ggregory\.m2\repository\commons-logging\commons-logging\1.0.4\commons-logging-1.0.4.jar;C:\Users\ggregory\.m2\repository\ch\qos\logback
\logback-core\1.0.7\logback-core-1.0.7.jar;C:\Users\ggregory\.m2\repository\ch\qos\logback\logback-classic\1.0.7\logback-classic-1.0.7.jar;C:\Users\ggregory\.m2\repository\org\apache\geronimo\specs\geronimo-jms_1.1_spec\1.0\geroni
mo-jms_1.1_spec-1.0.jar;C:\Users\ggregory\.m2\repository\javax\mail\mail\1.4.5\mail-1.4.5.jar;C:\Users\ggregory\.m2\repository\javax\activation\activation\1.1\activation-1.1.jar;,
java.specification.name=Java Platform API Specific
ation, java.class.version=50.0, sun.management.compiler=HotSpot 64-Bit
Tiered Compilers, os.version=6.1, user.home=C:\Users\ggregory,
user.timezone=America/New_York,
java.awt.printerjob=sun.awt.windows.WPrinterJob, file.encoding=C
p1252, java.specification.version=1.6,
java.class.path=C:\svn\org\apache\log4j2\trunk\core\target\test-classes;C:\svn\org\apache\log4j2\trunk\core\target\classes;C:\Users\ggregory\.m2\repository\org\apache\logging\log4j\log4j-api\
2.0-beta5-SNAPSHOT\log4j-api-2.0-beta5-SNAPSHOT.jar;C:\Users\ggregory\.m2\repository\org\osgi\core\4.3.0\core-4.3.0.jar;C:\Users\ggregory\.m2\repository\org\codehaus\jackson\jackson-core-asl\1.9.2\jackson-core-asl-1.9.2.jar;C:\Use
rs\ggregory\.m2\repository\org\codehaus\jackson\jackson-mapper-asl\1.9.2\jackson-mapper-asl-1.9.2.jar;C:\Users\ggregory\.m2\repository\org\fusesource\jansi\jansi\1.9\jansi-1.9.jar;C:\Users\ggregory\.m2\repository\javax\jmdns\jmdns
\3.4.1\jmdns-3.4.1.jar;C:\Users\ggregory\.m2\repository\oro\oro\2.0.8\oro-2.0.8.jar;C:\Users\ggregory\.m2\repository\log4j\log4j\1.2.16\log4j-1.2.16.jar;C:\Users\ggregory\.m2\repository\org\slf4j\slf4j-api\1.7.2\slf4j-api-1.7.2.ja
r;C:\Users\ggregory\.m2\repository\org\slf4j\slf4j-ext\1.7.2\slf4j-ext-1.7.2.jar;C:\Users\ggregory\.m2\repository\ch\qos\cal10n\cal10n-api\0.7.4\cal10n-api-0.7.4.jar;C:\Users\ggregory\.m2\repository\junit\junit\4.7\junit-4.7.jar;C
:\Users\ggregory\.m2\repository\org\mockejb\mockejb\0.6-beta2\mockejb-0.6-beta2.jar;C:\Users\ggregory\.m2\repository\cglib\cglib-full\2.0.2\cglib-full-2.0.2.jar;C:\Users\ggregory\.m2\repository\commons-logging\commons-logging\1.0.
4\commons-logging-1.0.4.jar;C:\Users\ggregory\.m2\repository\ch\qos\logback\logback-core\1.0.7\logback-core-1.0.7.jar;C:\Users\ggregory\.m2\repository\ch\qos\logback\logback-classic\1.0.7\logback-classic-1.0.7.jar;C:\Users\ggregor
y\.m2\repository\org\apache\geronimo\specs\geronimo-jms_1.1_spec\1.0\geronimo-jms_1.1_spec-1.0.jar;C:\Users\ggregory\.m2\repository\javax\mail\mail\1.4.5\mail-1.4.5.jar;C:\Users\ggregory\.m2\repository\javax\activation\activation\
1.1\activation-1.1.jar;, user.name=ggregory,
java.vm.specification.version=1.0,
sun.java.command=C:\svn\org\apache\log4j2\trunk\core\target\surefire\surefirebooter8053787884026318717.jar
C:\svn\org\apache\log4j2\trunk\core\target\
surefire\surefire7495287913145984288tmp
C:\svn\org\apache\log4j2\trunk\core\target\surefire\surefire_212848922094494223226tmp,
java.home=C:\Program Files\Java\jdk1.6.0_39\jre, sun.arch.data.model=64,
user.language=en, java.specifi
cation.vendor=Sun Microsystems Inc., awt.toolkit=sun.awt.windows.WToolkit,
java.vm.info=mixed mode, java.version=1.6.0_39, java.ext.dirs=C:\Program
Files\Java\jdk1.6.0_39\jre\lib\ext;C:\Windows\Sun\Java\lib\ext,
sun.boot.class.pat
h=C:\Program Files\Java\jdk1.6.0_39\jre\lib\resources.jar;C:\Program
Files\Java\jdk1.6.0_39\jre\lib\rt.jar;C:\Program
Files\Java\jdk1.6.0_39\jre\lib\sunrsasign.jar;C:\Program
Files\Java\jdk1.6.0_39\jre\lib\jsse.jar;C:\Program File
s\Java\jdk1.6.0_39\jre\lib\jce.jar;C:\Program
Files\Java\jdk1.6.0_39\jre\lib\charsets.jar;C:\Program
Files\Java\jdk1.6.0_39\jre\lib\modules\jdk.boot.jar;C:\Program
Files\Java\jdk1.6.0_39\jre\classes, java.vendor=Sun Microsystems I
nc., localRepository=C:\Users\ggregory\.m2\repository, file.separator=\,
java.vendor.url.bug=http://java.sun.com/cgi-bin/bugreport.cgi,
sun.io.unicode.encoding=UnicodeLittle, sun.cpu.endian=little,
sun.desktop=windows, sun.cpu.isa
list=amd64}
23:06:57.024 [main] ERROR
org.apache.logging.log4j.core.CollectionLoggingTest -
{java.runtime.name=Java(TM)
SE Runtime Environment, sun.boot.library.path=C:\Program
Files\Java\jdk1.6.0_39\jre\bin, java.vm.version=20.14-b01, java.v
m.vendor=Sun Microsystems Inc., java.vendor.url=http://java.sun.com/,
path.separator=;, java.vm.name=Java HotSpot(TM) 64-Bit Server VM,
file.encoding.pkg=sun.io, sun.java.launcher=SUN_STANDARD, user.country=US,
sun.os.patch.level=
Service Pack 1, java.vm.specification.name=Java Virtual Machine
Specification, user.dir=C:\svn\org\apache\log4j2\trunk\core,
java.runtime.version=1.6.0_39-b04,
basedir=C:\svn\org\apache\log4j2\trunk\core, java.awt.graphicsenv=sun.
awt.Win32GraphicsEnvironment, java.endorsed.dirs=C:\Program
Files\Java\jdk1.6.0_39\jre\lib\endorsed, os.arch=amd64,
surefire.real.class.path=C:\svn\org\apache\log4j2\trunk\core\target\surefire\surefirebooter8053787884026318717.jar
, java.io.tmpdir=C:\Users\ggregory\AppData\Local\Temp\, line.separator=
, java.vm.specification.vendor=Sun Microsystems Inc., user.variant=,
os.name=Windows
7, sun.jnu.encoding=Cp1252, java.library.path=C:\Program
Files\Java\jdk1.6.0_39\jre\bin;C:\Windows\Sun\Java\bin;C:\Windows\system32;C:\Windows;C:
\Program Files\Python27\;C:\Program
Files\Python27\Scripts;C:\App\Ruby193\bin;C:\Program Files
(x86)\IBM\WebSphere MQ\java\lib;C:\Program Files (x86)\IBM\WebSphere
MQ\java\lib64;C:\App\Perl64\site\bin;C:\App\Perl64\bin;C:\Program
Files\Common Files\Microsoft Shared\Windows Live;C:\Program Files
(x86)\Common Files\Microsoft Shared\Windows
Live;C:\Windows\system32;C:\Windows;C:\Windows\System32\Wbem;C:\Program
Files\Intel\WiFi\bin\;C:\Program Files\Common Fi
les\Intel\WirelessCommon\;C:\Program Files (x86)\Common
Files\Lenovo;c:\Program Files (x86)\Microsoft SQL
Server\100\Tools\Binn\;c:\Program Files\Microsoft SQL
Server\100\Tools\Binn\;c:\Program Files\Microsoft SQL Server\100\DTS\B
inn\;C:\Java\apache-maven-3.0.5\bin;C:\Java\apache-maven-2.2.1\bin;C:\Java\apache-ant-1.9.0\bin;C:\Program
Files (x86)\GNU\GnuPG;C:\Program Files (x86)\Windows Live\Shared;C:\Program
Files (x86)\GNU\GnuPG\pub;C:\Program Files (x86
)\IBM\WebSphere MQ\bin64;C:\Program Files (x86)\IBM\WebSphere
MQ\bin;C:\Program Files (x86)\IBM\WebSphere
MQ\tools\c\samples\bin;C:\SWTOOLS\ReadyApps;C:\Program Files
(x86)\Lenovo\Access Connections\;C:\Program Files (x86)\QuickTi
me\QTSystem\;C:\Windows\System32\WindowsPowerShell\v1.0\;C:\Program
Files\SlikSvn\bin;C:\App;C:\Program Files (x86)\Git\cmd;C:\Program
Files\TortoiseSVN\bin;%APPDATA%\Python\Scripts;.,
surefire.test.class.path=C:\svn\org\apache\lo
g4j2\trunk\core\target\test-classes;C:\svn\org\apache\log4j2\trunk\core\target\classes;C:\Users\ggregory\.m2\repository\org\apache\logging\log4j\log4j-api\2.0-beta5-SNAPSHOT\log4j-api-2.0-beta5-SNAPSHOT.jar;C:\Users\ggregory\.m2\r
epository\org\osgi\core\4.3.0\core-4.3.0.jar;C:\Users\ggregory\.m2\repository\org\codehaus\jackson\jackson-core-asl\1.9.2\jackson-core-asl-1.9.2.jar;C:\Users\ggregory\.m2\repository\org\codehaus\jackson\jackson-mapper-asl\1.9.2\ja
ckson-mapper-asl-1.9.2.jar;C:\Users\ggregory\.m2\repository\org\fusesource\jansi\jansi\1.9\jansi-1.9.jar;C:\Users\ggregory\.m2\repository\javax\jmdns\jmdns\3.4.1\jmdns-3.4.1.jar;C:\Users\ggregory\.m2\repository\oro\oro\2.0.8\oro-2
.0.8.jar;C:\Users\ggregory\.m2\repository\log4j\log4j\1.2.16\log4j-1.2.16.jar;C:\Users\ggregory\.m2\repository\org\slf4j\slf4j-api\1.7.2\slf4j-api-1.7.2.jar;C:\Users\ggregory\.m2\repository\org\slf4j\slf4j-ext\1.7.2\slf4j-ext-1.7.
2.jar;C:\Users\ggregory\.m2\repository\ch\qos\cal10n\cal10n-api\0.7.4\cal10n-api-0.7.4.jar;C:\Users\ggregory\.m2\repository\junit\junit\4.7\junit-4.7.jar;C:\Users\ggregory\.m2\repository\org\mockejb\mockejb\0.6-beta2\mockejb-0.6-b
eta2.jar;C:\Users\ggregory\.m2\repository\cglib\cglib-full\2.0.2\cglib-full-2.0.2.jar;C:\Users\ggregory\.m2\repository\commons-logging\commons-logging\1.0.4\commons-logging-1.0.4.jar;C:\Users\ggregory\.m2\repository\ch\qos\logback
\logback-core\1.0.7\logback-core-1.0.7.jar;C:\Users\ggregory\.m2\repository\ch\qos\logback\logback-classic\1.0.7\logback-classic-1.0.7.jar;C:\Users\ggregory\.m2\repository\org\apache\geronimo\specs\geronimo-jms_1.1_spec\1.0\geroni
mo-jms_1.1_spec-1.0.jar;C:\Users\ggregory\.m2\repository\javax\mail\mail\1.4.5\mail-1.4.5.jar;C:\Users\ggregory\.m2\repository\javax\activation\activation\1.1\activation-1.1.jar;,
java.specification.name=Java Platform API Specific
ation, java.class.version=50.0, sun.management.compiler=HotSpot 64-Bit
Tiered Compilers, os.version=6.1, user.home=C:\Users\ggregory,
user.timezone=America/New_York,
java.awt.printerjob=sun.awt.windows.WPrinterJob, file.encoding=C
p1252, java.specification.version=1.6,
java.class.path=C:\svn\org\apache\log4j2\trunk\core\target\test-classes;C:\svn\org\apache\log4j2\trunk\core\target\classes;C:\Users\ggregory\.m2\repository\org\apache\logging\log4j\log4j-api\
2.0-beta5-SNAPSHOT\log4j-api-2.0-beta5-SNAPSHOT.jar;C:\Users\ggregory\.m2\repository\org\osgi\core\4.3.0\core-4.3.0.jar;C:\Users\ggregory\.m2\repository\org\codehaus\jackson\jackson-core-asl\1.9.2\jackson-core-asl-1.9.2.jar;C:\Use
rs\ggregory\.m2\repository\org\codehaus\jackson\jackson-mapper-asl\1.9.2\jackson-mapper-asl-1.9.2.jar;C:\Users\ggregory\.m2\repository\org\fusesource\jansi\jansi\1.9\jansi-1.9.jar;C:\Users\ggregory\.m2\repository\javax\jmdns\jmdns
\3.4.1\jmdns-3.4.1.jar;C:\Users\ggregory\.m2\repository\oro\oro\2.0.8\oro-2.0.8.jar;C:\Users\ggregory\.m2\repository\log4j\log4j\1.2.16\log4j-1.2.16.jar;C:\Users\ggregory\.m2\repository\org\slf4j\slf4j-api\1.7.2\slf4j-api-1.7.2.ja
r;C:\Users\ggregory\.m2\repository\org\slf4j\slf4j-ext\1.7.2\slf4j-ext-1.7.2.jar;C:\Users\ggregory\.m2\repository\ch\qos\cal10n\cal10n-api\0.7.4\cal10n-api-0.7.4.jar;C:\Users\ggregory\.m2\repository\junit\junit\4.7\junit-4.7.jar;C
:\Users\ggregory\.m2\repository\org\mockejb\mockejb\0.6-beta2\mockejb-0.6-beta2.jar;C:\Users\ggregory\.m2\repository\cglib\cglib-full\2.0.2\cglib-full-2.0.2.jar;C:\Users\ggregory\.m2\repository\commons-logging\commons-logging\1.0.
4\commons-logging-1.0.4.jar;C:\Users\ggregory\.m2\repository\ch\qos\logback\logback-core\1.0.7\logback-core-1.0.7.jar;C:\Users\ggregory\.m2\repository\ch\qos\logback\logback-classic\1.0.7\logback-classic-1.0.7.jar;C:\Users\ggregor
y\.m2\repository\org\apache\geronimo\specs\geronimo-jms_1.1_spec\1.0\geronimo-jms_1.1_spec-1.0.jar;C:\Users\ggregory\.m2\repository\javax\mail\mail\1.4.5\mail-1.4.5.jar;C:\Users\ggregory\.m2\repository\javax\activation\activation\
1.1\activation-1.1.jar;, user.name=ggregory,
java.vm.specification.version=1.0,
sun.java.command=C:\svn\org\apache\log4j2\trunk\core\target\surefire\surefirebooter8053787884026318717.jar
C:\svn\org\apache\log4j2\trunk\core\target\
surefire\surefire7495287913145984288tmp
C:\svn\org\apache\log4j2\trunk\core\target\surefire\surefire_212848922094494223226tmp,
java.home=C:\Program Files\Java\jdk1.6.0_39\jre, sun.arch.data.model=64,
user.language=en, java.specifi
cation.vendor=Sun Microsystems Inc., awt.toolkit=sun.awt.windows.WToolkit,
java.vm.info=mixed mode, java.version=1.6.0_39, java.ext.dirs=C:\Program
Files\Java\jdk1.6.0_39\jre\lib\ext;C:\Windows\Sun\Java\lib\ext,
sun.boot.class.pat
h=C:\Program Files\Java\jdk1.6.0_39\jre\lib\resources.jar;C:\Program
Files\Java\jdk1.6.0_39\jre\lib\rt.jar;C:\Program
Files\Java\jdk1.6.0_39\jre\lib\sunrsasign.jar;C:\Program
Files\Java\jdk1.6.0_39\jre\lib\jsse.jar;C:\Program File
s\Java\jdk1.6.0_39\jre\lib\jce.jar;C:\Program
Files\Java\jdk1.6.0_39\jre\lib\charsets.jar;C:\Program
Files\Java\jdk1.6.0_39\jre\lib\modules\jdk.boot.jar;C:\Program
Files\Java\jdk1.6.0_39\jre\classes, java.vendor=Sun Microsystems I
nc., localRepository=C:\Users\ggregory\.m2\repository, file.separator=\,
java.vendor.url.bug=http://java.sun.com/cgi-bin/bugreport.cgi,
sun.io.unicode.encoding=UnicodeLittle, sun.cpu.endian=little,
sun.desktop=windows, sun.cpu.isa
list=amd64}
23:06:57.029 [main] ERROR
org.apache.logging.log4j.core.CollectionLoggingTest - MyKey1="MyValue1"
MyKey2="MyValue2"
23:06:57.029 [main] ERROR
org.apache.logging.log4j.core.CollectionLoggingTest - {MyKey2=MyValue2,
MyKey1=MyValue1}
23:06:57.299 [main] ERROR
org.apache.logging.log4j.core.CollectionLoggingTest -
java.net.NetworkInterface$1@6076ab2f
23:06:57.379 [main] ERROR
org.apache.logging.log4j.core.CollectionLoggingTest - {Big5=Big5,
Big5-HKSCS=Big5-HKSCS, EUC-JP=EUC-JP, EUC-KR=EUC-KR, GB18030=GB18030,
GB2312=GB2312, GBK=GBK, IBM-Thai=IBM-Thai, IBM00858=IBM00858, IBM011
40=IBM01140, IBM01141=IBM01141, IBM01142=IBM01142, IBM01143=IBM01143,
IBM01144=IBM01144, IBM01145=IBM01145, IBM01146=IBM01146, IBM01147=IBM01147,
IBM01148=IBM01148, IBM01149=IBM01149, IBM037=IBM037, IBM1026=IBM1026,
IBM1047=IBM104
7, IBM273=IBM273, IBM277=IBM277, IBM278=IBM278, IBM280=IBM280,
IBM284=IBM284, IBM285=IBM285, IBM297=IBM297, IBM420=IBM420, IBM424=IBM424,
IBM437=IBM437, IBM500=IBM500, IBM775=IBM775, IBM850=IBM850, IBM852=IBM852,
IBM855=IBM855, IB
M857=IBM857, IBM860=IBM860, IBM861=IBM861, IBM862=IBM862, IBM863=IBM863,
IBM864=IBM864, IBM865=IBM865, IBM866=IBM866, IBM868=IBM868, IBM869=IBM869,
IBM870=IBM870, IBM871=IBM871, IBM918=IBM918, ISO-2022-CN=ISO-2022-CN,
ISO-2022-JP=
ISO-2022-JP, ISO-2022-JP-2=ISO-2022-JP-2, ISO-2022-KR=ISO-2022-KR,
ISO-8859-1=ISO-8859-1, ISO-8859-13=ISO-8859-13, ISO-8859-15=ISO-8859-15,
ISO-8859-2=ISO-8859-2, ISO-8859-3=ISO-8859-3, ISO-8859-4=ISO-8859-4,
ISO-8859-5=ISO-8859-5
, ISO-8859-6=ISO-8859-6, ISO-8859-7=ISO-8859-7, ISO-8859-8=ISO-8859-8,
ISO-8859-9=ISO-8859-9, JIS_X0201=JIS_X0201, JIS_X0212-1990=JIS_X0212-1990,
KOI8-R=KOI8-R, KOI8-U=KOI8-U, Shift_JIS=Shift_JIS, TIS-620=TIS-620,
US-ASCII=US-ASCI
I, UTF-16=UTF-16, UTF-16BE=UTF-16BE, UTF-16LE=UTF-16LE, UTF-32=UTF-32,
UTF-32BE=UTF-32BE, UTF-32LE=UTF-32LE, UTF-8=UTF-8,
windows-1250=windows-1250, windows-1251=windows-1251,
windows-1252=windows-1252, windows-1253=windows-1253,
windows-1254=windows-1254, windows-1255=windows-1255,
windows-1256=windows-1256, windows-1257=windows-1257,
windows-1258=windows-1258, windows-31j=windows-31j,
x-Big5-HKSCS-2001=x-Big5-HKSCS-2001, x-Big5-Solaris=x-Big5-Solaris, x-
euc-jp-linux=x-euc-jp-linux, x-EUC-TW=x-EUC-TW, x-eucJP-Open=x-eucJP-Open,
x-IBM1006=x-IBM1006, x-IBM1025=x-IBM1025, x-IBM1046=x-IBM1046,
x-IBM1097=x-IBM1097, x-IBM1098=x-IBM1098, x-IBM1112=x-IBM1112,
x-IBM1122=x-IBM1122, x-IBM112
3=x-IBM1123, x-IBM1124=x-IBM1124, x-IBM1364=x-IBM1364, x-IBM1381=x-IBM1381,
x-IBM1383=x-IBM1383, x-IBM33722=x-IBM33722, x-IBM737=x-IBM737,
x-IBM833=x-IBM833, x-IBM834=x-IBM834, x-IBM856=x-IBM856, x-IBM874=x-IBM874,
x-IBM875=x-IBM8
75, x-IBM921=x-IBM921, x-IBM922=x-IBM922, x-IBM930=x-IBM930,
x-IBM933=x-IBM933, x-IBM935=x-IBM935, x-IBM937=x-IBM937, x-IBM939=x-IBM939,
x-IBM942=x-IBM942, x-IBM942C=x-IBM942C, x-IBM943=x-IBM943,
x-IBM943C=x-IBM943C, x-IBM948=x-IB
M948, x-IBM949=x-IBM949, x-IBM949C=x-IBM949C, x-IBM950=x-IBM950,
x-IBM964=x-IBM964, x-IBM970=x-IBM970, x-ISCII91=x-ISCII91,
x-ISO-2022-CN-CNS=x-ISO-2022-CN-CNS, x-ISO-2022-CN-GB=x-ISO-2022-CN-GB,
x-iso-8859-11=x-iso-8859-11, x-JIS
0208=x-JIS0208, x-JISAutoDetect=x-JISAutoDetect, x-Johab=x-Johab,
x-MacArabic=x-MacArabic, x-MacCentralEurope=x-MacCentralEurope,
x-MacCroatian=x-MacCroatian, x-MacCyrillic=x-MacCyrillic,
x-MacDingbat=x-MacDingbat, x-MacGreek=x-Ma
cGreek, x-MacHebrew=x-MacHebrew, x-MacIceland=x-MacIceland,
x-MacRoman=x-MacRoman, x-MacRomania=x-MacRomania, x-MacSymbol=x-MacSymbol,
x-MacThai=x-MacThai, x-MacTurkish=x-MacTurkish, x-MacUkraine=x-MacUkraine,
x-MS932_0213=x-MS932
_0213, x-MS950-HKSCS=x-MS950-HKSCS, x-MS950-HKSCS-XP=x-MS950-HKSCS-XP,
x-mswin-936=x-mswin-936, x-PCK=x-PCK, x-SJIS_0213=x-SJIS_0213,
x-UTF-16LE-BOM=x-UTF-16LE-BOM, X-UTF-32BE-BOM=X-UTF-32BE-BOM,
X-UTF-32LE-BOM=X-UTF-32LE-BOM, x-w
indows-50220=x-windows-50220, x-windows-50221=x-windows-50221,
x-windows-874=x-windows-874, x-windows-949=x-windows-949,
x-windows-950=x-windows-950, x-windows-iso2022jp=x-windows-iso2022jp}
Tests run: 4, Failures: 0, Errors: 0, Skipped: 0, Time elapsed: 1.075 sec
Running org.apache.logging.log4j.core.config.AdvertiserTest
Tests run: 3, Failures: 0, Errors: 0, Skipped: 0, Time elapsed: 9.4 sec
Running org.apache.logging.log4j.core.config.FileOutputTest
Tests run: 1, Failures: 0, Errors: 0, Skipped: 0, Time elapsed: 0.731 sec
Running org.apache.logging.log4j.core.config.TestConfigurator
2013-03-24 23:07:11,285 WARN Unable to instantiate WindowsAnsiOutputStream
2013-03-24 23:07:11,300 ERROR Unknown object "logger" of type
org.apache.logging.log4j.core.config.LoggerConfig is ignored
2013-03-24 23:07:11,305 ERROR Unknown object "logger" of type
org.apache.logging.log4j.core.config.LoggerConfig is ignored
2013-03-24 23:07:11,305 ERROR Unknown object "root" of type
org.apache.logging.log4j.core.config.LoggerConfig is ignored
2013-03-24 23:07:11,305 WARN No Loggers were configured, using default. Is
the Loggers element missing?
2013-03-24 23:07:11,315 WARN Unable to instantiate WindowsAnsiOutputStream
2013-03-24 23:07:11,480 WARN Unable to instantiate WindowsAnsiOutputStream
2013-03-24 23:07:11,485 ERROR KeyValuePair contains an invalid element or
attribute "key1"
2013-03-24 23:07:11,485 ERROR A null key is not valid in MapFilter
2013-03-24 23:07:11,485 ERROR ThreadContextMapFilter is not configured with
any valid key value pairs
2013-03-24 23:07:11,560 WARN Unable to instantiate WindowsAnsiOutputStream
2013-03-24 23:07:11,645 ERROR Console contains an invalid element or
attribute "TypoLayout"
2013-03-24 23:07:11,650 WARN Unable to instantiate WindowsAnsiOutputStream
2013-03-24 23:07:11,740 WARN Unable to instantiate WindowsAnsiOutputStream
2013-03-24 23:07:11,745 ERROR FileManager (1:/target/bad:file.log)
java.io.FileNotFoundException: 1:\target\bad:file.log (The system cannot
find the path specified)
2013-03-24 23:07:11,745 ERROR Unable to invoke method createAppender in
class org.apache.logging.log4j.core.appender.FileAppender for element File
java.lang.reflect.InvocationTargetException
        at sun.reflect.NativeMethodAccessorImpl.invoke0(Native Method)
        at
sun.reflect.NativeMethodAccessorImpl.invoke(NativeMethodAccessorImpl.java:39)
        at
sun.reflect.DelegatingMethodAccessorImpl.invoke(DelegatingMethodAccessorImpl.java:25)
        at java.lang.reflect.Method.invoke(Method.java:597)
        at
org.apache.logging.log4j.core.config.BaseConfiguration.createPluginObject(BaseConfiguration.java:738)
        at
org.apache.logging.log4j.core.config.BaseConfiguration.createConfiguration(BaseConfiguration.java:504)
        at
org.apache.logging.log4j.core.config.BaseConfiguration.createConfiguration(BaseConfiguration.java:496)
        at
org.apache.logging.log4j.core.config.BaseConfiguration.doConfigure(BaseConfiguration.java:161)
        at
org.apache.logging.log4j.core.config.BaseConfiguration.start(BaseConfiguration.java:119)
        at
org.apache.logging.log4j.core.LoggerContext.setConfiguration(LoggerContext.java:271)
        at
org.apache.logging.log4j.core.config.Configurator.initialize(Configurator.java:68)
        at
org.apache.logging.log4j.core.config.Configurator.initialize(Configurator.java:47)
        at
org.apache.logging.log4j.core.config.TestConfigurator.testBadFileName(TestConfigurator.java:252)
        at sun.reflect.NativeMethodAccessorImpl.invoke0(Native Method)
        at
sun.reflect.NativeMethodAccessorImpl.invoke(NativeMethodAccessorImpl.java:39)
        at
sun.reflect.DelegatingMethodAccessorImpl.invoke(DelegatingMethodAccessorImpl.java:25)
        at java.lang.reflect.Method.invoke(Method.java:597)
        at
org.junit.runners.model.FrameworkMethod$1.runReflectiveCall(FrameworkMethod.java:44)
        at
org.junit.internal.runners.model.ReflectiveCallable.run(ReflectiveCallable.java:15)
        at
org.junit.runners.model.FrameworkMethod.invokeExplosively(FrameworkMethod.java:41)
        at
org.junit.internal.runners.statements.InvokeMethod.evaluate(InvokeMethod.java:20)
        at
org.junit.runners.BlockJUnit4ClassRunner.runChild(BlockJUnit4ClassRunner.java:76)
        at
org.junit.runners.BlockJUnit4ClassRunner.runChild(BlockJUnit4ClassRunner.java:50)
        at org.junit.runners.ParentRunner$3.run(ParentRunner.java:193)
        at org.junit.runners.ParentRunner$1.schedule(ParentRunner.java:52)
        at org.junit.runners.ParentRunner.runChildren(ParentRunner.java:191)
        at org.junit.runners.ParentRunner.access$000(ParentRunner.java:42)
        at org.junit.runners.ParentRunner$2.evaluate(ParentRunner.java:184)
        at org.junit.runners.ParentRunner.run(ParentRunner.java:236)
        at
org.apache.maven.surefire.junit4.JUnit4Provider.execute(JUnit4Provider.java:252)
        at
org.apache.maven.surefire.junit4.JUnit4Provider.executeTestSet(JUnit4Provider.java:141)
        at
org.apache.maven.surefire.junit4.JUnit4Provider.invoke(JUnit4Provider.java:112)
        at sun.reflect.NativeMethodAccessorImpl.invoke0(Native Method)
        at
sun.reflect.NativeMethodAccessorImpl.invoke(NativeMethodAccessorImpl.java:39)
        at
sun.reflect.DelegatingMethodAccessorImpl.invoke(DelegatingMethodAccessorImpl.java:25)
        at java.lang.reflect.Method.invoke(Method.java:597)
        at
org.apache.maven.surefire.util.ReflectionUtils.invokeMethodWithArray(ReflectionUtils.java:189)
        at
org.apache.maven.surefire.booter.ProviderFactory$ProviderProxy.invoke(ProviderFactory.java:165)
        at
org.apache.maven.surefire.booter.ProviderFactory.invokeProvider(ProviderFactory.java:85)
        at
org.apache.maven.surefire.booter.ForkedBooter.runSuitesInProcess(ForkedBooter.java:115)
        at
org.apache.maven.surefire.booter.ForkedBooter.main(ForkedBooter.java:75)
Caused by: java.lang.IllegalStateException: Unable to create a manager
        at
org.apache.logging.log4j.core.appender.AbstractManager.getManager(AbstractManager.java:72)
        at
org.apache.logging.log4j.core.appender.OutputStreamManager.getManager(OutputStreamManager.java:49)
        at
org.apache.logging.log4j.core.appender.FileManager.getFileManager(FileManager.java:64)
        at
org.apache.logging.log4j.core.appender.FileAppender.createAppender(FileAppender.java:130)
        ... 41 more

2013-03-24 23:07:11,750 ERROR Null object returned for File in appenders
2013-03-24 23:07:11,760 ERROR Unable to locate appender File for logger
org.apache.logging.log4j.test2
Tests run: 12, Failures: 0, Errors: 0, Skipped: 0, Time elapsed: 2.01 sec
Running org.apache.logging.log4j.core.config.TestConfiguratorError
ERROR StatusLogger LogManager returned an instance of
org.apache.logging.log4j.simple.SimpleLoggerContext which does not
implement org.apache.logging.log4j.core.LoggerContext. Unable to initialize
Log4j
Tests run: 1, Failures: 0, Errors: 0, Skipped: 0, Time elapsed: 0.085 sec
Running org.apache.logging.log4j.core.config.XMLConfigurationPropsTest
2013-03-24 23:07:13,256 ERROR Invalid status specified: ${sys:log4j.level}.
Defaulting to ERROR
2013-03-24 23:07:13,306 DEBUG Generated plugins in 0.000460408 seconds
2013-03-24 23:07:13,306 DEBUG Generated plugins in 0.000298726 seconds
2013-03-24 23:07:13,306 DEBUG Generated plugins in 0.000272934 seconds
2013-03-24 23:07:13,306 DEBUG Generated plugins in 0.000263695 seconds
2013-03-24 23:07:13,306 DEBUG Generated plugins in 0.000264080 seconds
2013-03-24 23:07:13,311 DEBUG Generated plugins in 0.000263695 seconds
2013-03-24 23:07:13,311 DEBUG Calling createLayout on class
org.apache.logging.log4j.core.layout.PatternLayout for element
PatternLayout with params(pattern="[%-5level] %msg%n", Configuration(DSI),
null, charset="null")
2013-03-24 23:07:13,311 DEBUG Generated plugins in 0.000309120 seconds
2013-03-24 23:07:13,316 DEBUG Calling createAppender on class
org.apache.logging.log4j.core.appender.ConsoleAppender for element Console
with params(PatternLayout([%-5level] %msg%n), null, target="SYSTEM_OUT",
name="Console", foll
ow="null", suppressExceptions="null")
2013-03-24 23:07:13,321 WARN Unable to instantiate WindowsAnsiOutputStream
2013-03-24 23:07:13,321 DEBUG Calling createAppenders on class
org.apache.logging.log4j.core.config.plugins.AppendersPlugin for element
appenders with params(appenders={Console})
2013-03-24 23:07:13,321 DEBUG Generated plugins in 0.000505833 seconds
2013-03-24 23:07:13,321 DEBUG Calling createAppenderRef on class
org.apache.logging.log4j.core.config.AppenderRef for element appender-ref
with params(ref="Console", level="null", null)
2013-03-24 23:07:13,326 DEBUG Calling createLogger on class
org.apache.logging.log4j.core.config.LoggerConfig$RootLogger for element
root with params(additivity="null", level="${sys:log.level}",
appender-ref={org.apache.logging.lo
g4j.core.config.AppenderRef@3747c1db}, properties={}, Configuration(DSI),
null)
2013-03-24 23:07:13,326 DEBUG Calling createLoggers on class
org.apache.logging.log4j.core.config.plugins.LoggersPlugin for element
loggers with params(loggers={root})
2013-03-24 23:07:13,326 DEBUG Reconfiguration completed
2013-03-24 23:07:13,331 DEBUG Reconfiguration started for context Default
2013-03-24 23:07:13,336 DEBUG Generated plugins in 0.000425377 seconds
2013-03-24 23:07:13,336 DEBUG Generated plugins in 0.000594758 seconds
2013-03-24 23:07:13,336 DEBUG Generated plugins in 0.000354930 seconds
2013-03-24 23:07:13,336 DEBUG Generated plugins in 0.000771068 seconds
2013-03-24 23:07:13,341 DEBUG Generated plugins in 0.000336067 seconds
2013-03-24 23:07:13,341 DEBUG Generated plugins in 0.000252147 seconds
2013-03-24 23:07:13,341 DEBUG Calling createLayout on class
org.apache.logging.log4j.core.layout.PatternLayout for element
PatternLayout with params(pattern="[%-5level] %msg%n", Configuration(DSI),
null, charset="null")
2013-03-24 23:07:13,341 DEBUG Generated plugins in 0.000449629 seconds
2013-03-24 23:07:13,346 DEBUG Calling createAppender on class
org.apache.logging.log4j.core.appender.ConsoleAppender for element Console
with params(PatternLayout([%-5level] %msg%n), null, target="SYSTEM_OUT",
name="Console", foll
ow="null", suppressExceptions="null")
2013-03-24 23:07:13,346 WARN Unable to instantiate WindowsAnsiOutputStream
2013-03-24 23:07:13,346 DEBUG Calling createAppenders on class
org.apache.logging.log4j.core.config.plugins.AppendersPlugin for element
appenders with params(appenders={Console})
2013-03-24 23:07:13,346 DEBUG Generated plugins in 0.000766449 seconds
2013-03-24 23:07:13,346 DEBUG Calling createAppenderRef on class
org.apache.logging.log4j.core.config.AppenderRef for element appender-ref
with params(ref="Console", level="null", null)
2013-03-24 23:07:13,351 DEBUG Calling createLogger on class
org.apache.logging.log4j.core.config.LoggerConfig$RootLogger for element
root with params(additivity="null", level="debug", appender-ref={
org.apache.logging.log4j.core.co
nfig.AppenderRef@10d09ad3}, properties={}, Configuration(DSI), null)
2013-03-24 23:07:13,351 DEBUG Calling createLoggers on class
org.apache.logging.log4j.core.config.plugins.LoggersPlugin for element
loggers with params(loggers={root})
2013-03-24 23:07:13,351 DEBUG Reconfiguration completed
2013-03-24 23:07:13,351 DEBUG Reconfiguration started for context Default
2013-03-24 23:07:13,371 DEBUG Generated plugins in 0.000416138 seconds
2013-03-24 23:07:13,371 WARN Unable to instantiate WindowsAnsiOutputStream
2013-03-24 23:07:13,371 DEBUG Reconfiguration completed
Tests run: 3, Failures: 0, Errors: 0, Skipped: 0, Time elapsed: 0.751 sec
Running org.apache.logging.log4j.core.config.XMLConfigurationTest
2013-03-24 23:07:14,596 WARN Unable to instantiate WindowsAnsiOutputStream
2013-03-24 23:07:14,621 WARN Unable to instantiate WindowsAnsiOutputStream
2013-03-24 23:07:14,671 WARN Unable to instantiate WindowsAnsiOutputStream
2013-03-24 23:07:14,706 WARN Unable to instantiate WindowsAnsiOutputStream
Tests run: 2, Failures: 0, Errors: 0, Skipped: 0, Time elapsed: 0.675 sec
Running org.apache.logging.log4j.core.config.XMLLoggerPropsTest
Tests run: 1, Failures: 0, Errors: 0, Skipped: 0, Time elapsed: 0.73 sec
Running org.apache.logging.log4j.core.FileConfigTest
Tests run: 1, Failures: 0, Errors: 0, Skipped: 0, Time elapsed: 6.716 sec
Running org.apache.logging.log4j.core.filter.BurstFilterTest
Tests run: 1, Failures: 0, Errors: 0, Skipped: 0, Time elapsed: 7.341 sec
Running org.apache.logging.log4j.core.filter.DynamicThresholdFilterTest
Tests run: 2, Failures: 0, Errors: 0, Skipped: 0, Time elapsed: 0.78 sec
Running org.apache.logging.log4j.core.filter.MapFilterTest
Tests run: 2, Failures: 0, Errors: 0, Skipped: 0, Time elapsed: 0.625 sec
Running org.apache.logging.log4j.core.filter.MarkerFilterTest
Tests run: 1, Failures: 0, Errors: 0, Skipped: 0, Time elapsed: 0.13 sec
Running org.apache.logging.log4j.core.filter.RegexFilterTest
Tests run: 1, Failures: 0, Errors: 0, Skipped: 0, Time elapsed: 0.095 sec
Running org.apache.logging.log4j.core.filter.StructuredDataFilterTest
Tests run: 2, Failures: 0, Errors: 0, Skipped: 0, Time elapsed: 0.61 sec
Running org.apache.logging.log4j.core.filter.ThreadContextMapFilterTest
Tests run: 1, Failures: 0, Errors: 0, Skipped: 0, Time elapsed: 0.125 sec
Running org.apache.logging.log4j.core.filter.ThresholdFilterTest
Tests run: 1, Failures: 0, Errors: 0, Skipped: 0, Time elapsed: 0.09 sec
Running org.apache.logging.log4j.core.filter.TimeFilterTest
Tests run: 1, Failures: 0, Errors: 0, Skipped: 0, Time elapsed: 0.09 sec
Running org.apache.logging.log4j.core.helpers.UUIDTest
Elapsed for 200 UUIDS = 160527 Average = 802 ns
Elapsed for 2000 UUIDS = 2091084 Average = 1045 ns
Tests run: 2, Failures: 0, Errors: 0, Skipped: 0, Time elapsed: 0.395 sec
Running org.apache.logging.log4j.core.layout.HTMLLayoutTest
23:07:38.765 [main] DEBUG  - starting mdc pattern test
23:07:38.765 [main] DEBUG  - empty mdc
23:07:38.765 [main] DEBUG  - First line
Second line
23:07:38.765 [main] DEBUG  - filled mdc
23:07:38.765 [main] ERROR  - finished mdc pattern test
java.lang.NullPointerException: test
        at
org.apache.logging.log4j.core.layout.HTMLLayoutTest.testLayout(HTMLLayoutTest.java:93)
[test-classes/:?]
        at sun.reflect.NativeMethodAccessorImpl.invoke0(Native Method)
~[?:1.6.0_39]
        at
sun.reflect.NativeMethodAccessorImpl.invoke(NativeMethodAccessorImpl.java:39)
~[?:1.6.0_39]
        at
sun.reflect.DelegatingMethodAccessorImpl.invoke(DelegatingMethodAccessorImpl.java:25)
~[?:1.6.0_39]
        at java.lang.reflect.Method.invoke(Method.java:597) ~[?:1.6.0_39]
        at
org.junit.runners.model.FrameworkMethod$1.runReflectiveCall(FrameworkMethod.java:44)
[junit-4.7.jar:?]
        at
org.junit.internal.runners.model.ReflectiveCallable.run(ReflectiveCallable.java:15)
[junit-4.7.jar:?]
        at
org.junit.runners.model.FrameworkMethod.invokeExplosively(FrameworkMethod.java:41)
[junit-4.7.jar:?]
        at
org.junit.internal.runners.statements.InvokeMethod.evaluate(InvokeMethod.java:20)
[junit-4.7.jar:?]
        at
org.junit.runners.BlockJUnit4ClassRunner.runChild(BlockJUnit4ClassRunner.java:76)
[junit-4.7.jar:?]
        at
org.junit.runners.BlockJUnit4ClassRunner.runChild(BlockJUnit4ClassRunner.java:50)
[junit-4.7.jar:?]
        at org.junit.runners.ParentRunner$3.run(ParentRunner.java:193)
[junit-4.7.jar:?]
        at org.junit.runners.ParentRunner$1.schedule(ParentRunner.java:52)
[junit-4.7.jar:?]
        at
org.junit.runners.ParentRunner.runChildren(ParentRunner.java:191)
[junit-4.7.jar:?]
        at org.junit.runners.ParentRunner.access$000(ParentRunner.java:42)
[junit-4.7.jar:?]
        at org.junit.runners.ParentRunner$2.evaluate(ParentRunner.java:184)
[junit-4.7.jar:?]
        at
org.junit.internal.runners.statements.RunBefores.evaluate(RunBefores.java:28)
[junit-4.7.jar:?]
        at
org.junit.internal.runners.statements.RunAfters.evaluate(RunAfters.java:31)
[junit-4.7.jar:?]
        at org.junit.runners.ParentRunner.run(ParentRunner.java:236)
[junit-4.7.jar:?]
        at
org.apache.maven.surefire.junit4.JUnit4Provider.execute(JUnit4Provider.java:252)
[surefire-junit4-2.12.4.jar:2.12.4]
        at
org.apache.maven.surefire.junit4.JUnit4Provider.executeTestSet(JUnit4Provider.java:141)
[surefire-junit4-2.12.4.jar:2.12.4]
        at
org.apache.maven.surefire.junit4.JUnit4Provider.invoke(JUnit4Provider.java:112)
[surefire-junit4-2.12.4.jar:2.12.4]
        at sun.reflect.NativeMethodAccessorImpl.invoke0(Native Method)
~[?:1.6.0_39]
        at
sun.reflect.NativeMethodAccessorImpl.invoke(NativeMethodAccessorImpl.java:39)
~[?:1.6.0_39]
        at
sun.reflect.DelegatingMethodAccessorImpl.invoke(DelegatingMethodAccessorImpl.java:25)
~[?:1.6.0_39]
        at java.lang.reflect.Method.invoke(Method.java:597) ~[?:1.6.0_39]
        at
org.apache.maven.surefire.util.ReflectionUtils.invokeMethodWithArray(ReflectionUtils.java:189)
[surefire-api-2.12.4.jar:2.12.4]
        at
org.apache.maven.surefire.booter.ProviderFactory$ProviderProxy.invoke(ProviderFactory.java:165)
[surefire-booter-2.12.4.jar:2.12.4]
        at
org.apache.maven.surefire.booter.ProviderFactory.invokeProvider(ProviderFactory.java:85)
[surefire-booter-2.12.4.jar:2.12.4]
        at
org.apache.maven.surefire.booter.ForkedBooter.runSuitesInProcess(ForkedBooter.java:115)
[surefire-booter-2.12.4.jar:2.12.4]
        at
org.apache.maven.surefire.booter.ForkedBooter.main(ForkedBooter.java:75)
[surefire-booter-2.12.4.jar:2.12.4]
Tests run: 1, Failures: 0, Errors: 0, Skipped: 0, Time elapsed: 0.57 sec
Running org.apache.logging.log4j.core.layout.PatternLayoutTest
23:07:39.875 [main] DEBUG  - starting mdc pattern test
23:07:39.880 [main] DEBUG  - empty mdc, no key specified in pattern
23:07:39.880 [main] DEBUG  - empty mdc, key1 in pattern
23:07:39.880 [main] DEBUG  - empty mdc, key2 in pattern
23:07:39.880 [main] DEBUG  - empty mdc, key3 in pattern
23:07:39.880 [main] DEBUG  - empty mdc, key1, key2, and key3 in pattern
23:07:39.880 [main] DEBUG  - filled mdc, no key specified in pattern
23:07:39.880 [main] DEBUG  - filled mdc, key1 in pattern
23:07:39.880 [main] DEBUG  - filled mdc, key2 in pattern
23:07:39.880 [main] DEBUG  - filled mdc, key3 in pattern
23:07:39.880 [main] DEBUG  - filled mdc, key1, key2, and key3 in pattern
23:07:39.885 [main] DEBUG  - finished mdc pattern test
Tests run: 2, Failures: 0, Errors: 0, Skipped: 0, Time elapsed: 0.555 sec
Running org.apache.logging.log4j.core.layout.RFC5424LayoutTest
Tests run: 3, Failures: 0, Errors: 0, Skipped: 0, Time elapsed: 0.445 sec
Running org.apache.logging.log4j.core.layout.SerializedLayoutTest
23:07:42.165 [main] DEBUG  - starting mdc pattern test
23:07:42.175 [main] DEBUG  - empty mdc
23:07:42.180 [main] DEBUG  - filled mdc
23:07:42.180 [main] ERROR  - finished mdc pattern test
java.lang.NullPointerException: test
        at
org.apache.logging.log4j.core.layout.SerializedLayoutTest.testLayout(SerializedLayoutTest.java:101)
[test-classes/:?]
        at sun.reflect.NativeMethodAccessorImpl.invoke0(Native Method)
~[?:1.6.0_39]
        at
sun.reflect.NativeMethodAccessorImpl.invoke(NativeMethodAccessorImpl.java:39)
~[?:1.6.0_39]
        at
sun.reflect.DelegatingMethodAccessorImpl.invoke(DelegatingMethodAccessorImpl.java:25)
~[?:1.6.0_39]
        at java.lang.reflect.Method.invoke(Method.java:597) ~[?:1.6.0_39]
        at
org.junit.runners.model.FrameworkMethod$1.runReflectiveCall(FrameworkMethod.java:44)
[junit-4.7.jar:?]
        at
org.junit.internal.runners.model.ReflectiveCallable.run(ReflectiveCallable.java:15)
[junit-4.7.jar:?]
        at
org.junit.runners.model.FrameworkMethod.invokeExplosively(FrameworkMethod.java:41)
[junit-4.7.jar:?]
        at
org.junit.internal.runners.statements.InvokeMethod.evaluate(InvokeMethod.java:20)
[junit-4.7.jar:?]
        at
org.junit.runners.BlockJUnit4ClassRunner.runChild(BlockJUnit4ClassRunner.java:76)
[junit-4.7.jar:?]
        at
org.junit.runners.BlockJUnit4ClassRunner.runChild(BlockJUnit4ClassRunner.java:50)
[junit-4.7.jar:?]
        at org.junit.runners.ParentRunner$3.run(ParentRunner.java:193)
[junit-4.7.jar:?]
        at org.junit.runners.ParentRunner$1.schedule(ParentRunner.java:52)
[junit-4.7.jar:?]
        at
org.junit.runners.ParentRunner.runChildren(ParentRunner.java:191)
[junit-4.7.jar:?]
        at org.junit.runners.ParentRunner.access$000(ParentRunner.java:42)
[junit-4.7.jar:?]
        at org.junit.runners.ParentRunner$2.evaluate(ParentRunner.java:184)
[junit-4.7.jar:?]
        at
org.junit.internal.runners.statements.RunBefores.evaluate(RunBefores.java:28)
[junit-4.7.jar:?]
        at
org.junit.internal.runners.statements.RunAfters.evaluate(RunAfters.java:31)
[junit-4.7.jar:?]
        at org.junit.runners.ParentRunner.run(ParentRunner.java:236)
[junit-4.7.jar:?]
        at
org.apache.maven.surefire.junit4.JUnit4Provider.execute(JUnit4Provider.java:252)
[surefire-junit4-2.12.4.jar:2.12.4]
        at
org.apache.maven.surefire.junit4.JUnit4Provider.executeTestSet(JUnit4Provider.java:141)
[surefire-junit4-2.12.4.jar:2.12.4]
        at
org.apache.maven.surefire.junit4.JUnit4Provider.invoke(JUnit4Provider.java:112)
[surefire-junit4-2.12.4.jar:2.12.4]
        at sun.reflect.NativeMethodAccessorImpl.invoke0(Native Method)
~[?:1.6.0_39]
        at
sun.reflect.NativeMethodAccessorImpl.invoke(NativeMethodAccessorImpl.java:39)
~[?:1.6.0_39]
        at
sun.reflect.DelegatingMethodAccessorImpl.invoke(DelegatingMethodAccessorImpl.java:25)
~[?:1.6.0_39]
        at java.lang.reflect.Method.invoke(Method.java:597) ~[?:1.6.0_39]
        at
org.apache.maven.surefire.util.ReflectionUtils.invokeMethodWithArray(ReflectionUtils.java:189)
[surefire-api-2.12.4.jar:2.12.4]
        at
org.apache.maven.surefire.booter.ProviderFactory$ProviderProxy.invoke(ProviderFactory.java:165)
[surefire-booter-2.12.4.jar:2.12.4]
        at
org.apache.maven.surefire.booter.ProviderFactory.invokeProvider(ProviderFactory.java:85)
[surefire-booter-2.12.4.jar:2.12.4]
        at
org.apache.maven.surefire.booter.ForkedBooter.runSuitesInProcess(ForkedBooter.java:115)
[surefire-booter-2.12.4.jar:2.12.4]
        at
org.apache.maven.surefire.booter.ForkedBooter.main(ForkedBooter.java:75)
[surefire-booter-2.12.4.jar:2.12.4]
23:07:42.210 [main] ERROR  - Throwing an exception
org.apache.logging.log4j.LoggingException: This is a test
        at
org.apache.logging.log4j.core.layout.SerializedLayoutTest.testLayout(SerializedLayoutTest.java:104)
[test-classes/:?]
        at sun.reflect.NativeMethodAccessorImpl.invoke0(Native Method)
~[?:1.6.0_39]
        at
sun.reflect.NativeMethodAccessorImpl.invoke(NativeMethodAccessorImpl.java:39)
~[?:1.6.0_39]
        at
sun.reflect.DelegatingMethodAccessorImpl.invoke(DelegatingMethodAccessorImpl.java:25)
~[?:1.6.0_39]
        at java.lang.reflect.Method.invoke(Method.java:597) ~[?:1.6.0_39]
        at
org.junit.runners.model.FrameworkMethod$1.runReflectiveCall(FrameworkMethod.java:44)
[junit-4.7.jar:?]
        at
org.junit.internal.runners.model.ReflectiveCallable.run(ReflectiveCallable.java:15)
[junit-4.7.jar:?]
        at
org.junit.runners.model.FrameworkMethod.invokeExplosively(FrameworkMethod.java:41)
[junit-4.7.jar:?]
        at
org.junit.internal.runners.statements.InvokeMethod.evaluate(InvokeMethod.java:20)
[junit-4.7.jar:?]
        at
org.junit.runners.BlockJUnit4ClassRunner.runChild(BlockJUnit4ClassRunner.java:76)
[junit-4.7.jar:?]
        at
org.junit.runners.BlockJUnit4ClassRunner.runChild(BlockJUnit4ClassRunner.java:50)
[junit-4.7.jar:?]
        at org.junit.runners.ParentRunner$3.run(ParentRunner.java:193)
[junit-4.7.jar:?]
        at org.junit.runners.ParentRunner$1.schedule(ParentRunner.java:52)
[junit-4.7.jar:?]
        at
org.junit.runners.ParentRunner.runChildren(ParentRunner.java:191)
[junit-4.7.jar:?]
        at org.junit.runners.ParentRunner.access$000(ParentRunner.java:42)
[junit-4.7.jar:?]
        at org.junit.runners.ParentRunner$2.evaluate(ParentRunner.java:184)
[junit-4.7.jar:?]
        at
org.junit.internal.runners.statements.RunBefores.evaluate(RunBefores.java:28)
[junit-4.7.jar:?]
        at
org.junit.internal.runners.statements.RunAfters.evaluate(RunAfters.java:31)
[junit-4.7.jar:?]
        at org.junit.runners.ParentRunner.run(ParentRunner.java:236)
[junit-4.7.jar:?]
        at
org.apache.maven.surefire.junit4.JUnit4Provider.execute(JUnit4Provider.java:252)
[surefire-junit4-2.12.4.jar:2.12.4]
        at
org.apache.maven.surefire.junit4.JUnit4Provider.executeTestSet(JUnit4Provider.java:141)
[surefire-junit4-2.12.4.jar:2.12.4]
        at
org.apache.maven.surefire.junit4.JUnit4Provider.invoke(JUnit4Provider.java:112)
[surefire-junit4-2.12.4.jar:2.12.4]
        at sun.reflect.NativeMethodAccessorImpl.invoke0(Native Method)
~[?:1.6.0_39]
        at
sun.reflect.NativeMethodAccessorImpl.invoke(NativeMethodAccessorImpl.java:39)
~[?:1.6.0_39]
        at
sun.reflect.DelegatingMethodAccessorImpl.invoke(DelegatingMethodAccessorImpl.java:25)
~[?:1.6.0_39]
        at java.lang.reflect.Method.invoke(Method.java:597) ~[?:1.6.0_39]
        at
org.apache.maven.surefire.util.ReflectionUtils.invokeMethodWithArray(ReflectionUtils.java:189)
[surefire-api-2.12.4.jar:2.12.4]
        at
org.apache.maven.surefire.booter.ProviderFactory$ProviderProxy.invoke(ProviderFactory.java:165)
[surefire-booter-2.12.4.jar:2.12.4]
        at
org.apache.maven.surefire.booter.ProviderFactory.invokeProvider(ProviderFactory.java:85)
[surefire-booter-2.12.4.jar:2.12.4]
        at
org.apache.maven.surefire.booter.ForkedBooter.runSuitesInProcess(ForkedBooter.java:115)
[surefire-booter-2.12.4.jar:2.12.4]
        at
org.apache.maven.surefire.booter.ForkedBooter.main(ForkedBooter.java:75)
[surefire-booter-2.12.4.jar:2.12.4]
Caused by: java.lang.IllegalStateException: Test
        at
org.apache.logging.log4j.core.layout.SerializedLayoutTest.testLayout(SerializedLayoutTest.java:103)
~[test-classes/:?]
        ... 30 more
Tests run: 1, Failures: 0, Errors: 0, Skipped: 0, Time elapsed: 0.79 sec
Running org.apache.logging.log4j.core.layout.SyslogLayoutTest
Tests run: 1, Failures: 0, Errors: 0, Skipped: 0, Time elapsed: 0.575 sec
Running org.apache.logging.log4j.core.layout.XMLLayoutTest
23:07:44.760 [main] DEBUG  - starting mdc pattern test
23:07:44.760 [main] DEBUG  - empty mdc
23:07:44.760 [main] DEBUG  - filled mdc
23:07:44.760 [main] ERROR  - finished mdc pattern test
java.lang.NullPointerException: test
        at
org.apache.logging.log4j.core.layout.XMLLayoutTest.testLayout(XMLLayoutTest.java:88)
[test-classes/:?]
        at sun.reflect.NativeMethodAccessorImpl.invoke0(Native Method)
~[?:1.6.0_39]
        at
sun.reflect.NativeMethodAccessorImpl.invoke(NativeMethodAccessorImpl.java:39)
~[?:1.6.0_39]
        at
sun.reflect.DelegatingMethodAccessorImpl.invoke(DelegatingMethodAccessorImpl.java:25)
~[?:1.6.0_39]
        at java.lang.reflect.Method.invoke(Method.java:597) ~[?:1.6.0_39]
        at
org.junit.runners.model.FrameworkMethod$1.runReflectiveCall(FrameworkMethod.java:44)
[junit-4.7.jar:?]
        at
org.junit.internal.runners.model.ReflectiveCallable.run(ReflectiveCallable.java:15)
[junit-4.7.jar:?]
        at
org.junit.runners.model.FrameworkMethod.invokeExplosively(FrameworkMethod.java:41)
[junit-4.7.jar:?]
        at
org.junit.internal.runners.statements.InvokeMethod.evaluate(InvokeMethod.java:20)
[junit-4.7.jar:?]
        at
org.junit.runners.BlockJUnit4ClassRunner.runChild(BlockJUnit4ClassRunner.java:76)
[junit-4.7.jar:?]
        at
org.junit.runners.BlockJUnit4ClassRunner.runChild(BlockJUnit4ClassRunner.java:50)
[junit-4.7.jar:?]
        at org.junit.runners.ParentRunner$3.run(ParentRunner.java:193)
[junit-4.7.jar:?]
        at org.junit.runners.ParentRunner$1.schedule(ParentRunner.java:52)
[junit-4.7.jar:?]
        at
org.junit.runners.ParentRunner.runChildren(ParentRunner.java:191)
[junit-4.7.jar:?]
        at org.junit.runners.ParentRunner.access$000(ParentRunner.java:42)
[junit-4.7.jar:?]
        at org.junit.runners.ParentRunner$2.evaluate(ParentRunner.java:184)
[junit-4.7.jar:?]
        at
org.junit.internal.runners.statements.RunBefores.evaluate(RunBefores.java:28)
[junit-4.7.jar:?]
        at
org.junit.internal.runners.statements.RunAfters.evaluate(RunAfters.java:31)
[junit-4.7.jar:?]
        at org.junit.runners.ParentRunner.run(ParentRunner.java:236)
[junit-4.7.jar:?]
        at
org.apache.maven.surefire.junit4.JUnit4Provider.execute(JUnit4Provider.java:252)
[surefire-junit4-2.12.4.jar:2.12.4]
        at
org.apache.maven.surefire.junit4.JUnit4Provider.executeTestSet(JUnit4Provider.java:141)
[surefire-junit4-2.12.4.jar:2.12.4]
        at
org.apache.maven.surefire.junit4.JUnit4Provider.invoke(JUnit4Provider.java:112)
[surefire-junit4-2.12.4.jar:2.12.4]
        at sun.reflect.NativeMethodAccessorImpl.invoke0(Native Method)
~[?:1.6.0_39]
        at
sun.reflect.NativeMethodAccessorImpl.invoke(NativeMethodAccessorImpl.java:39)
~[?:1.6.0_39]
        at
sun.reflect.DelegatingMethodAccessorImpl.invoke(DelegatingMethodAccessorImpl.java:25)
~[?:1.6.0_39]
        at java.lang.reflect.Method.invoke(Method.java:597) ~[?:1.6.0_39]
        at
org.apache.maven.surefire.util.ReflectionUtils.invokeMethodWithArray(ReflectionUtils.java:189)
[surefire-api-2.12.4.jar:2.12.4]
        at
org.apache.maven.surefire.booter.ProviderFactory$ProviderProxy.invoke(ProviderFactory.java:165)
[surefire-booter-2.12.4.jar:2.12.4]
        at
org.apache.maven.surefire.booter.ProviderFactory.invokeProvider(ProviderFactory.java:85)
[surefire-booter-2.12.4.jar:2.12.4]
        at
org.apache.maven.surefire.booter.ForkedBooter.runSuitesInProcess(ForkedBooter.java:115)
[surefire-booter-2.12.4.jar:2.12.4]
        at
org.apache.maven.surefire.booter.ForkedBooter.main(ForkedBooter.java:75)
[surefire-booter-2.12.4.jar:2.12.4]
Tests run: 1, Failures: 0, Errors: 0, Skipped: 0, Time elapsed: 0.535 sec
Running org.apache.logging.log4j.core.LogEventTest
Tests run: 1, Failures: 0, Errors: 0, Skipped: 0, Time elapsed: 0.125 sec
Running org.apache.logging.log4j.core.LoggerTest
Tests run: 15, Failures: 0, Errors: 0, Skipped: 0, Time elapsed: 6.922 sec
Running org.apache.logging.log4j.core.lookup.ContextMapLookupTest
Tests run: 1, Failures: 0, Errors: 0, Skipped: 0, Time elapsed: 0.12 sec
Running org.apache.logging.log4j.core.lookup.DateLookupTest
Tests run: 1, Failures: 0, Errors: 0, Skipped: 0, Time elapsed: 0.09 sec
Running org.apache.logging.log4j.core.lookup.EnvironmentLookupTest
Tests run: 1, Failures: 0, Errors: 0, Skipped: 0, Time elapsed: 0.05 sec
Running org.apache.logging.log4j.core.lookup.InterpolatorTest
Tests run: 1, Failures: 0, Errors: 0, Skipped: 0, Time elapsed: 0.405 sec
Running org.apache.logging.log4j.core.lookup.StrSubstitutorTest
Tests run: 1, Failures: 0, Errors: 0, Skipped: 0, Time elapsed: 0.35 sec
Running org.apache.logging.log4j.core.lookup.StructuredDataLookupTest
Tests run: 1, Failures: 0, Errors: 0, Skipped: 0, Time elapsed: 0.09 sec
Running org.apache.logging.log4j.core.lookup.SystemPropertiesLookupTest
Tests run: 1, Failures: 0, Errors: 0, Skipped: 0, Time elapsed: 0.085 sec
Running org.apache.logging.log4j.core.net.JMSQueueAppenderTest
log4j:WARN No appenders could be found for logger
(org.mockejb.jndi.MockContext).
log4j:WARN Please initialize the log4j system properly.
log4j:WARN See http://logging.apache.org/log4j/1.2/faq.html#noconfig for
more info.
2013-03-24 23:07:58,093 DEBUG Found Plugin Map at
file:/C:/svn/org/apache/log4j2/trunk/core/target/classes/org/apache/logging/log4j/core/config/plugins/Log4j2Plugins.dat
2013-03-24 23:07:58,103 DEBUG Generated plugins in 0.010930075 seconds
2013-03-24 23:07:58,108 DEBUG Generated plugins in 0.002471037 seconds
2013-03-24 23:07:58,108 DEBUG Generated plugins in 0.002161532 seconds
2013-03-24 23:07:58,113 DEBUG Generated plugins in 0.002677759 seconds
2013-03-24 23:07:58,113 DEBUG Generated plugins in 0.002692772 seconds
2013-03-24 23:07:58,118 DEBUG Generated plugins in 0.002729342 seconds
2013-03-24 23:07:58,128 DEBUG Calling createLayout on class
org.apache.logging.log4j.core.layout.PatternLayout for element
PatternLayout with params(pattern="%m%n", Configuration(ConfigTest), null,
charset="null")
2013-03-24 23:07:58,133 DEBUG Generated plugins in 0.002807489 seconds
2013-03-24 23:07:58,138 DEBUG Calling createAppender on class
org.apache.logging.log4j.core.appender.JMSQueueAppender for element
JMSQueue with params(name="JMSQueue", factoryName="null",
providerURL="null", urlPkgPrefixes="null",
 securityPrincipalName="null", securityCredentials="null",
factoryBindingName="TestQueueConnectionFactory",
queueBindingName="TestQueue", userName="null", password="null",
PatternLayout(%m%n), null, suppressExceptions="null")
2013-03-24 23:07:58,153 DEBUG Starting JMSQueueManager
JMSQueue:TestQueueConnectionFactory.TestQueue
2013-03-24 23:07:58,153 DEBUG Calling createAppenders on class
org.apache.logging.log4j.core.config.plugins.AppendersPlugin for element
appenders with params(appenders={JMSQueue})
2013-03-24 23:07:58,158 DEBUG Generated plugins in 0.002268165 seconds
2013-03-24 23:07:58,158 DEBUG Calling createAppenderRef on class
org.apache.logging.log4j.core.config.AppenderRef for element appender-ref
with params(ref="JMSQueue", level="null", null)
2013-03-24 23:07:58,163 DEBUG Calling createLogger on class
org.apache.logging.log4j.core.config.LoggerConfig$RootLogger for element
root with params(additivity="null", level="error", appender-ref={
org.apache.logging.log4j.core.co
nfig.AppenderRef@776be68f}, properties={}, Configuration(ConfigTest), null)
2013-03-24 23:07:58,163 DEBUG Calling createLoggers on class
org.apache.logging.log4j.core.config.plugins.LoggersPlugin for element
loggers with params(loggers={root})
2013-03-24 23:07:58,163 DEBUG Shutting down OutputStreamManager SYSTEM_OUT
2013-03-24 23:07:58,163 DEBUG Reconfiguration completed
2013-03-24 23:07:58,178 DEBUG Generated plugins in 0.001865500 seconds
2013-03-24 23:07:58,183 WARN Unable to instantiate WindowsAnsiOutputStream
2013-03-24 23:07:58,183 DEBUG Reconfiguration started for context Default
2013-03-24 23:07:58,188 DEBUG Generated plugins in 0.002666980 seconds
2013-03-24 23:07:58,193 DEBUG Generated plugins in 0.002492980 seconds
2013-03-24 23:07:58,193 DEBUG Generated plugins in 0.002524546 seconds
2013-03-24 23:07:58,198 DEBUG Generated plugins in 0.002467572 seconds
2013-03-24 23:07:58,203 DEBUG Generated plugins in 0.002593453 seconds
2013-03-24 23:07:58,203 DEBUG Generated plugins in 0.001972133 seconds
2013-03-24 23:07:58,203 DEBUG Calling createLayout on class
org.apache.logging.log4j.core.layout.PatternLayout for element
PatternLayout with params(pattern="%m%n", Configuration(ConfigTest), null,
charset="null")
2013-03-24 23:07:58,209 DEBUG Generated plugins in 0.002874856 seconds
2013-03-24 23:07:58,209 DEBUG Calling createAppender on class
org.apache.logging.log4j.core.appender.JMSQueueAppender for element
JMSQueue with params(name="JMSQueue", factoryName="null",
providerURL="null", urlPkgPrefixes="null",
 securityPrincipalName="null", securityCredentials="null",
factoryBindingName="TestQueueConnectionFactory",
queueBindingName="TestQueue", userName="null", password="null",
PatternLayout(%m%n), null, suppressExceptions="null")
2013-03-24 23:07:58,209 DEBUG Calling createAppenders on class
org.apache.logging.log4j.core.config.plugins.AppendersPlugin for element
appenders with params(appenders={JMSQueue})
2013-03-24 23:07:58,214 DEBUG Generated plugins in 0.002495290 seconds
2013-03-24 23:07:58,214 DEBUG Calling createAppenderRef on class
org.apache.logging.log4j.core.config.AppenderRef for element appender-ref
with params(ref="JMSQueue", level="null", null)
2013-03-24 23:07:58,219 DEBUG Calling createLogger on class
org.apache.logging.log4j.core.config.LoggerConfig$RootLogger for element
root with params(additivity="null", level="error", appender-ref={
org.apache.logging.log4j.core.co
nfig.AppenderRef@5773ec72}, properties={}, Configuration(ConfigTest), null)
2013-03-24 23:07:58,219 DEBUG Calling createLoggers on class
org.apache.logging.log4j.core.config.plugins.LoggersPlugin for element
loggers with params(loggers={root})
2013-03-24 23:07:58,219 DEBUG Shutting down OutputStreamManager SYSTEM_OUT
2013-03-24 23:07:58,219 DEBUG Reconfiguration completed
Tests run: 1, Failures: 0, Errors: 0, Skipped: 0, Time elapsed: 1.211 sec
Running org.apache.logging.log4j.core.net.JMSQueueFailoverTest
log4j:WARN No appenders could be found for logger
(org.mockejb.jndi.MockContext).
log4j:WARN Please initialize the log4j system properly.
log4j:WARN See http://logging.apache.org/log4j/1.2/faq.html#noconfig for
more info.
2013-03-24 23:07:59,849 ERROR An exception occurred processing Appender
Log4j2Queue
org.apache.logging.log4j.core.appender.AppenderRuntimeException:
javax.naming.NameNotFoundException: Name Log4j2Queue not found.
        at
org.apache.logging.log4j.core.appender.JMSQueueAppender.append(JMSQueueAppender.java:52)
        at
org.apache.logging.log4j.core.config.AppenderControl.callAppender(AppenderControl.java:102)
        at
org.apache.logging.log4j.core.appender.rewrite.RewriteAppender.append(RewriteAppender.java:84)
        at
org.apache.logging.log4j.core.config.AppenderControl.callAppender(AppenderControl.java:102)
        at
org.apache.logging.log4j.core.appender.FailoverAppender.callAppender(FailoverAppender.java:122)
        at
org.apache.logging.log4j.core.appender.FailoverAppender.append(FailoverAppender.java:109)
        at
org.apache.logging.log4j.core.config.AppenderControl.callAppender(AppenderControl.java:102)
        at
org.apache.logging.log4j.core.config.LoggerConfig.callAppenders(LoggerConfig.java:335)
        at
org.apache.logging.log4j.core.config.LoggerConfig.log(LoggerConfig.java:316)
        at
org.apache.logging.log4j.core.config.LoggerConfig.log(LoggerConfig.java:281)
        at org.apache.logging.log4j.core.Logger.log(Logger.java:108)
        at
org.apache.logging.log4j.spi.AbstractLogger.debug(AbstractLogger.java:316)
        at
org.apache.logging.log4j.core.net.JMSQueueFailoverTest.testFailover(JMSQueueFailoverTest.java:108)
        at sun.reflect.NativeMethodAccessorImpl.invoke0(Native Method)
        at
sun.reflect.NativeMethodAccessorImpl.invoke(NativeMethodAccessorImpl.java:39)
        at
sun.reflect.DelegatingMethodAccessorImpl.invoke(DelegatingMethodAccessorImpl.java:25)
        at java.lang.reflect.Method.invoke(Method.java:597)
        at
org.junit.runners.model.FrameworkMethod$1.runReflectiveCall(FrameworkMethod.java:44)
        at
org.junit.internal.runners.model.ReflectiveCallable.run(ReflectiveCallable.java:15)
        at
org.junit.runners.model.FrameworkMethod.invokeExplosively(FrameworkMethod.java:41)
        at
org.junit.internal.runners.statements.InvokeMethod.evaluate(InvokeMethod.java:20)
        at
org.junit.internal.runners.statements.RunBefores.evaluate(RunBefores.java:28)
        at
org.junit.runners.BlockJUnit4ClassRunner.runChild(BlockJUnit4ClassRunner.java:76)
        at
org.junit.runners.BlockJUnit4ClassRunner.runChild(BlockJUnit4ClassRunner.java:50)
        at org.junit.runners.ParentRunner$3.run(ParentRunner.java:193)
        at org.junit.runners.ParentRunner$1.schedule(ParentRunner.java:52)
        at org.junit.runners.ParentRunner.runChildren(ParentRunner.java:191)
        at org.junit.runners.ParentRunner.access$000(ParentRunner.java:42)
        at org.junit.runners.ParentRunner$2.evaluate(ParentRunner.java:184)
        at
org.junit.internal.runners.statements.RunBefores.evaluate(RunBefores.java:28)
        at
org.junit.internal.runners.statements.RunAfters.evaluate(RunAfters.java:31)
        at org.junit.runners.ParentRunner.run(ParentRunner.java:236)
        at
org.apache.maven.surefire.junit4.JUnit4Provider.execute(JUnit4Provider.java:252)
        at
org.apache.maven.surefire.junit4.JUnit4Provider.executeTestSet(JUnit4Provider.java:141)
        at
org.apache.maven.surefire.junit4.JUnit4Provider.invoke(JUnit4Provider.java:112)
        at sun.reflect.NativeMethodAccessorImpl.invoke0(Native Method)
        at
sun.reflect.NativeMethodAccessorImpl.invoke(NativeMethodAccessorImpl.java:39)
        at
sun.reflect.DelegatingMethodAccessorImpl.invoke(DelegatingMethodAccessorImpl.java:25)
        at java.lang.reflect.Method.invoke(Method.java:597)
        at
org.apache.maven.surefire.util.ReflectionUtils.invokeMethodWithArray(ReflectionUtils.java:189)
        at
org.apache.maven.surefire.booter.ProviderFactory$ProviderProxy.invoke(ProviderFactory.java:165)
        at
org.apache.maven.surefire.booter.ProviderFactory.invokeProvider(ProviderFactory.java:85)
        at
org.apache.maven.surefire.booter.ForkedBooter.runSuitesInProcess(ForkedBooter.java:115)
        at
org.apache.maven.surefire.booter.ForkedBooter.main(ForkedBooter.java:75)
Caused by: javax.naming.NameNotFoundException: Name Log4j2Queue not found.
        at org.mockejb.jndi.MockContext.lookup(MockContext.java:543)
        at
org.mockejb.jndi.MockContext$$FastClassByCGLIB$$8f78c5.invoke(<generated>)
        at net.sf.cglib.reflect.FastMethod.invoke(FastMethod.java:53)
        at
org.mockejb.interceptor.InterceptorInvoker$CglibMethodInvoker.intercept(InterceptorInvoker.java:95)
        at
org.mockejb.interceptor.InvocationContext.proceed(InvocationContext.java:177)
        at
org.mockejb.interceptor.InterceptorInvoker.invoke(InterceptorInvoker.java:53)
        at
org.mockejb.interceptor.InterceptableProxy.intercept(InterceptableProxy.java:58)
        at
$javax.naming.Context$$EnhancerByCGLIB$$b681ec35.lookup(<generated>)
        at javax.naming.InitialContext.lookup(InitialContext.java:392)
        at
org.apache.logging.log4j.core.net.AbstractJMSManager.lookup(AbstractJMSManager.java:77)
        at
org.apache.logging.log4j.core.net.JMSQueueManager.connect(JMSQueueManager.java:182)
        at
org.apache.logging.log4j.core.net.JMSQueueManager.send(JMSQueueManager.java:105)
        at
org.apache.logging.log4j.core.appender.JMSQueueAppender.append(JMSQueueAppender.java:50)
        ... 43 more

2013-03-24 23:07:59,854 ERROR An exception occurred processing Appender
Rewrite org.apache.logging.log4j.core.appender.AppenderRuntimeException: An
exception occurred processing Appender Log4j2Queue
        at
org.apache.logging.log4j.core.appender.DefaultErrorHandler.error(DefaultErrorHandler.java:71)
        at
org.apache.logging.log4j.core.config.AppenderControl.callAppender(AppenderControl.java:104)
        at
org.apache.logging.log4j.core.appender.rewrite.RewriteAppender.append(RewriteAppender.java:84)
        at
org.apache.logging.log4j.core.config.AppenderControl.callAppender(AppenderControl.java:102)
        at
org.apache.logging.log4j.core.appender.FailoverAppender.callAppender(FailoverAppender.java:122)
        at
org.apache.logging.log4j.core.appender.FailoverAppender.append(FailoverAppender.java:109)
        at
org.apache.logging.log4j.core.config.AppenderControl.callAppender(AppenderControl.java:102)
        at
org.apache.logging.log4j.core.config.LoggerConfig.callAppenders(LoggerConfig.java:335)
        at
org.apache.logging.log4j.core.config.LoggerConfig.log(LoggerConfig.java:316)
        at
org.apache.logging.log4j.core.config.LoggerConfig.log(LoggerConfig.java:281)
        at org.apache.logging.log4j.core.Logger.log(Logger.java:108)
        at
org.apache.logging.log4j.spi.AbstractLogger.debug(AbstractLogger.java:316)
        at
org.apache.logging.log4j.core.net.JMSQueueFailoverTest.testFailover(JMSQueueFailoverTest.java:108)
        at sun.reflect.NativeMethodAccessorImpl.invoke0(Native Method)
        at
sun.reflect.NativeMethodAccessorImpl.invoke(NativeMethodAccessorImpl.java:39)
        at
sun.reflect.DelegatingMethodAccessorImpl.invoke(DelegatingMethodAccessorImpl.java:25)
        at java.lang.reflect.Method.invoke(Method.java:597)
        at
org.junit.runners.model.FrameworkMethod$1.runReflectiveCall(FrameworkMethod.java:44)
        at
org.junit.internal.runners.model.ReflectiveCallable.run(ReflectiveCallable.java:15)
        at
org.junit.runners.model.FrameworkMethod.invokeExplosively(FrameworkMethod.java:41)
        at
org.junit.internal.runners.statements.InvokeMethod.evaluate(InvokeMethod.java:20)
        at
org.junit.internal.runners.statements.RunBefores.evaluate(RunBefores.java:28)
        at
org.junit.runners.BlockJUnit4ClassRunner.runChild(BlockJUnit4ClassRunner.java:76)
        at
org.junit.runners.BlockJUnit4ClassRunner.runChild(BlockJUnit4ClassRunner.java:50)
        at org.junit.runners.ParentRunner$3.run(ParentRunner.java:193)
        at org.junit.runners.ParentRunner$1.schedule(ParentRunner.java:52)
        at org.junit.runners.ParentRunner.runChildren(ParentRunner.java:191)
        at org.junit.runners.ParentRunner.access$000(ParentRunner.java:42)
        at org.junit.runners.ParentRunner$2.evaluate(ParentRunner.java:184)
        at
org.junit.internal.runners.statements.RunBefores.evaluate(RunBefores.java:28)
        at
org.junit.internal.runners.statements.RunAfters.evaluate(RunAfters.java:31)
        at org.junit.runners.ParentRunner.run(ParentRunner.java:236)
        at
org.apache.maven.surefire.junit4.JUnit4Provider.execute(JUnit4Provider.java:252)
        at
org.apache.maven.surefire.junit4.JUnit4Provider.executeTestSet(JUnit4Provider.java:141)
        at
org.apache.maven.surefire.junit4.JUnit4Provider.invoke(JUnit4Provider.java:112)
        at sun.reflect.NativeMethodAccessorImpl.invoke0(Native Method)
        at
sun.reflect.NativeMethodAccessorImpl.invoke(NativeMethodAccessorImpl.java:39)
        at
sun.reflect.DelegatingMethodAccessorImpl.invoke(DelegatingMethodAccessorImpl.java:25)
        at java.lang.reflect.Method.invoke(Method.java:597)
        at
org.apache.maven.surefire.util.ReflectionUtils.invokeMethodWithArray(ReflectionUtils.java:189)
        at
org.apache.maven.surefire.booter.ProviderFactory$ProviderProxy.invoke(ProviderFactory.java:165)
        at
org.apache.maven.surefire.booter.ProviderFactory.invokeProvider(ProviderFactory.java:85)
        at
org.apache.maven.surefire.booter.ForkedBooter.runSuitesInProcess(ForkedBooter.java:115)
        at
org.apache.maven.surefire.booter.ForkedBooter.main(ForkedBooter.java:75)
Caused by: org.apache.logging.log4j.core.appender.AppenderRuntimeException:
javax.naming.NameNotFoundException: Name Log4j2Queue not found.
        at
org.apache.logging.log4j.core.appender.JMSQueueAppender.append(JMSQueueAppender.java:52)
        at
org.apache.logging.log4j.core.config.AppenderControl.callAppender(AppenderControl.java:102)
        ... 42 more
Caused by: javax.naming.NameNotFoundException: Name Log4j2Queue not found.
        at org.mockejb.jndi.MockContext.lookup(MockContext.java:543)
        at
org.mockejb.jndi.MockContext$$FastClassByCGLIB$$8f78c5.invoke(<generated>)
        at net.sf.cglib.reflect.FastMethod.invoke(FastMethod.java:53)
        at
org.mockejb.interceptor.InterceptorInvoker$CglibMethodInvoker.intercept(InterceptorInvoker.java:95)
        at
org.mockejb.interceptor.InvocationContext.proceed(InvocationContext.java:177)
        at
org.mockejb.interceptor.InterceptorInvoker.invoke(InterceptorInvoker.java:53)
        at
org.mockejb.interceptor.InterceptableProxy.intercept(InterceptableProxy.java:58)
        at
$javax.naming.Context$$EnhancerByCGLIB$$b681ec35.lookup(<generated>)
        at javax.naming.InitialContext.lookup(InitialContext.java:392)
        at
org.apache.logging.log4j.core.net.AbstractJMSManager.lookup(AbstractJMSManager.java:77)
        at
org.apache.logging.log4j.core.net.JMSQueueManager.connect(JMSQueueManager.java:182)
        at
org.apache.logging.log4j.core.net.JMSQueueManager.send(JMSQueueManager.java:105)
        at
org.apache.logging.log4j.core.appender.JMSQueueAppender.append(JMSQueueAppender.java:50)
        ... 43 more

Tests run: 2, Failures: 0, Errors: 0, Skipped: 0, Time elapsed: 1.165 sec
Running org.apache.logging.log4j.core.net.JMSQueueTest
log4j:WARN No appenders could be found for logger
(org.mockejb.jndi.MockContext).
log4j:WARN Please initialize the log4j system properly.
log4j:WARN See http://logging.apache.org/log4j/1.2/faq.html#noconfig for
more info.
Tests run: 1, Failures: 0, Errors: 0, Skipped: 0, Time elapsed: 0.955 sec
Running org.apache.logging.log4j.core.net.JMSTopicFailoverTest
log4j:WARN No appenders could be found for logger
(org.mockejb.jndi.MockContext).
log4j:WARN Please initialize the log4j system properly.
log4j:WARN See http://logging.apache.org/log4j/1.2/faq.html#noconfig for
more info.
2013-03-24 23:08:02,715 ERROR An exception occurred processing Appender
Log4j2Topic
org.apache.logging.log4j.core.appender.AppenderRuntimeException:
javax.naming.NameNotFoundException: Name Log4j2Topic not found.
        at
org.apache.logging.log4j.core.appender.JMSTopicAppender.append(JMSTopicAppender.java:52)
        at
org.apache.logging.log4j.core.config.AppenderControl.callAppender(AppenderControl.java:102)
        at
org.apache.logging.log4j.core.appender.rewrite.RewriteAppender.append(RewriteAppender.java:84)
        at
org.apache.logging.log4j.core.config.AppenderControl.callAppender(AppenderControl.java:102)
        at
org.apache.logging.log4j.core.appender.FailoverAppender.callAppender(FailoverAppender.java:122)
        at
org.apache.logging.log4j.core.appender.FailoverAppender.append(FailoverAppender.java:109)
        at
org.apache.logging.log4j.core.config.AppenderControl.callAppender(AppenderControl.java:102)
        at
org.apache.logging.log4j.core.config.LoggerConfig.callAppenders(LoggerConfig.java:335)
        at
org.apache.logging.log4j.core.config.LoggerConfig.log(LoggerConfig.java:316)
        at
org.apache.logging.log4j.core.config.LoggerConfig.log(LoggerConfig.java:281)
        at org.apache.logging.log4j.core.Logger.log(Logger.java:108)
        at
org.apache.logging.log4j.spi.AbstractLogger.debug(AbstractLogger.java:316)
        at
org.apache.logging.log4j.core.net.JMSTopicFailoverTest.testFailover(JMSTopicFailoverTest.java:107)
        at sun.reflect.NativeMethodAccessorImpl.invoke0(Native Method)
        at
sun.reflect.NativeMethodAccessorImpl.invoke(NativeMethodAccessorImpl.java:39)
        at
sun.reflect.DelegatingMethodAccessorImpl.invoke(DelegatingMethodAccessorImpl.java:25)
        at java.lang.reflect.Method.invoke(Method.java:597)
        at
org.junit.runners.model.FrameworkMethod$1.runReflectiveCall(FrameworkMethod.java:44)
        at
org.junit.internal.runners.model.ReflectiveCallable.run(ReflectiveCallable.java:15)
        at
org.junit.runners.model.FrameworkMethod.invokeExplosively(FrameworkMethod.java:41)
        at
org.junit.internal.runners.statements.InvokeMethod.evaluate(InvokeMethod.java:20)
        at
org.junit.internal.runners.statements.RunBefores.evaluate(RunBefores.java:28)
        at
org.junit.runners.BlockJUnit4ClassRunner.runChild(BlockJUnit4ClassRunner.java:76)
        at
org.junit.runners.BlockJUnit4ClassRunner.runChild(BlockJUnit4ClassRunner.java:50)
        at org.junit.runners.ParentRunner$3.run(ParentRunner.java:193)
        at org.junit.runners.ParentRunner$1.schedule(ParentRunner.java:52)
        at org.junit.runners.ParentRunner.runChildren(ParentRunner.java:191)
        at org.junit.runners.ParentRunner.access$000(ParentRunner.java:42)
        at org.junit.runners.ParentRunner$2.evaluate(ParentRunner.java:184)
        at
org.junit.internal.runners.statements.RunBefores.evaluate(RunBefores.java:28)
        at
org.junit.internal.runners.statements.RunAfters.evaluate(RunAfters.java:31)
        at org.junit.runners.ParentRunner.run(ParentRunner.java:236)
        at
org.apache.maven.surefire.junit4.JUnit4Provider.execute(JUnit4Provider.java:252)
        at
org.apache.maven.surefire.junit4.JUnit4Provider.executeTestSet(JUnit4Provider.java:141)
        at
org.apache.maven.surefire.junit4.JUnit4Provider.invoke(JUnit4Provider.java:112)
        at sun.reflect.NativeMethodAccessorImpl.invoke0(Native Method)
        at
sun.reflect.NativeMethodAccessorImpl.invoke(NativeMethodAccessorImpl.java:39)
        at
sun.reflect.DelegatingMethodAccessorImpl.invoke(DelegatingMethodAccessorImpl.java:25)
        at java.lang.reflect.Method.invoke(Method.java:597)
        at
org.apache.maven.surefire.util.ReflectionUtils.invokeMethodWithArray(ReflectionUtils.java:189)
        at
org.apache.maven.surefire.booter.ProviderFactory$ProviderProxy.invoke(ProviderFactory.java:165)
        at
org.apache.maven.surefire.booter.ProviderFactory.invokeProvider(ProviderFactory.java:85)
        at
org.apache.maven.surefire.booter.ForkedBooter.runSuitesInProcess(ForkedBooter.java:115)
        at
org.apache.maven.surefire.booter.ForkedBooter.main(ForkedBooter.java:75)
Caused by: javax.naming.NameNotFoundException: Name Log4j2Topic not found.
        at org.mockejb.jndi.MockContext.lookup(MockContext.java:543)
        at
org.mockejb.jndi.MockContext$$FastClassByCGLIB$$8f78c5.invoke(<generated>)
        at net.sf.cglib.reflect.FastMethod.invoke(FastMethod.java:53)
        at
org.mockejb.interceptor.InterceptorInvoker$CglibMethodInvoker.intercept(InterceptorInvoker.java:95)
        at
org.mockejb.interceptor.InvocationContext.proceed(InvocationContext.java:177)
        at
org.mockejb.interceptor.InterceptorInvoker.invoke(InterceptorInvoker.java:53)
        at
org.mockejb.interceptor.InterceptableProxy.intercept(InterceptableProxy.java:58)
        at
$javax.naming.Context$$EnhancerByCGLIB$$b681ec35.lookup(<generated>)
        at javax.naming.InitialContext.lookup(InitialContext.java:392)
        at
org.apache.logging.log4j.core.net.AbstractJMSManager.lookup(AbstractJMSManager.java:77)
        at
org.apache.logging.log4j.core.net.JMSTopicManager.connect(JMSTopicManager.java:183)
        at
org.apache.logging.log4j.core.net.JMSTopicManager.send(JMSTopicManager.java:105)
        at
org.apache.logging.log4j.core.appender.JMSTopicAppender.append(JMSTopicAppender.java:50)
        ... 43 more

2013-03-24 23:08:02,720 ERROR An exception occurred processing Appender
Rewrite org.apache.logging.log4j.core.appender.AppenderRuntimeException: An
exception occurred processing Appender Log4j2Topic
        at
org.apache.logging.log4j.core.appender.DefaultErrorHandler.error(DefaultErrorHandler.java:71)
        at
org.apache.logging.log4j.core.config.AppenderControl.callAppender(AppenderControl.java:104)
        at
org.apache.logging.log4j.core.appender.rewrite.RewriteAppender.append(RewriteAppender.java:84)
        at
org.apache.logging.log4j.core.config.AppenderControl.callAppender(AppenderControl.java:102)
        at
org.apache.logging.log4j.core.appender.FailoverAppender.callAppender(FailoverAppender.java:122)
        at
org.apache.logging.log4j.core.appender.FailoverAppender.append(FailoverAppender.java:109)
        at
org.apache.logging.log4j.core.config.AppenderControl.callAppender(AppenderControl.java:102)
        at
org.apache.logging.log4j.core.config.LoggerConfig.callAppenders(LoggerConfig.java:335)
        at
org.apache.logging.log4j.core.config.LoggerConfig.log(LoggerConfig.java:316)
        at
org.apache.logging.log4j.core.config.LoggerConfig.log(LoggerConfig.java:281)
        at org.apache.logging.log4j.core.Logger.log(Logger.java:108)
        at
org.apache.logging.log4j.spi.AbstractLogger.debug(AbstractLogger.java:316)
        at
org.apache.logging.log4j.core.net.JMSTopicFailoverTest.testFailover(JMSTopicFailoverTest.java:107)
        at sun.reflect.NativeMethodAccessorImpl.invoke0(Native Method)
        at
sun.reflect.NativeMethodAccessorImpl.invoke(NativeMethodAccessorImpl.java:39)
        at
sun.reflect.DelegatingMethodAccessorImpl.invoke(DelegatingMethodAccessorImpl.java:25)
        at java.lang.reflect.Method.invoke(Method.java:597)
        at
org.junit.runners.model.FrameworkMethod$1.runReflectiveCall(FrameworkMethod.java:44)
        at
org.junit.internal.runners.model.ReflectiveCallable.run(ReflectiveCallable.java:15)
        at
org.junit.runners.model.FrameworkMethod.invokeExplosively(FrameworkMethod.java:41)
        at
org.junit.internal.runners.statements.InvokeMethod.evaluate(InvokeMethod.java:20)
        at
org.junit.internal.runners.statements.RunBefores.evaluate(RunBefores.java:28)
        at
org.junit.runners.BlockJUnit4ClassRunner.runChild(BlockJUnit4ClassRunner.java:76)
        at
org.junit.runners.BlockJUnit4ClassRunner.runChild(BlockJUnit4ClassRunner.java:50)
        at org.junit.runners.ParentRunner$3.run(ParentRunner.java:193)
        at org.junit.runners.ParentRunner$1.schedule(ParentRunner.java:52)
        at org.junit.runners.ParentRunner.runChildren(ParentRunner.java:191)
        at org.junit.runners.ParentRunner.access$000(ParentRunner.java:42)
        at org.junit.runners.ParentRunner$2.evaluate(ParentRunner.java:184)
        at
org.junit.internal.runners.statements.RunBefores.evaluate(RunBefores.java:28)
        at
org.junit.internal.runners.statements.RunAfters.evaluate(RunAfters.java:31)
        at org.junit.runners.ParentRunner.run(ParentRunner.java:236)
        at
org.apache.maven.surefire.junit4.JUnit4Provider.execute(JUnit4Provider.java:252)
        at
org.apache.maven.surefire.junit4.JUnit4Provider.executeTestSet(JUnit4Provider.java:141)
        at
org.apache.maven.surefire.junit4.JUnit4Provider.invoke(JUnit4Provider.java:112)
        at sun.reflect.NativeMethodAccessorImpl.invoke0(Native Method)
        at
sun.reflect.NativeMethodAccessorImpl.invoke(NativeMethodAccessorImpl.java:39)
        at
sun.reflect.DelegatingMethodAccessorImpl.invoke(DelegatingMethodAccessorImpl.java:25)
        at java.lang.reflect.Method.invoke(Method.java:597)
        at
org.apache.maven.surefire.util.ReflectionUtils.invokeMethodWithArray(ReflectionUtils.java:189)
        at
org.apache.maven.surefire.booter.ProviderFactory$ProviderProxy.invoke(ProviderFactory.java:165)
        at
org.apache.maven.surefire.booter.ProviderFactory.invokeProvider(ProviderFactory.java:85)
        at
org.apache.maven.surefire.booter.ForkedBooter.runSuitesInProcess(ForkedBooter.java:115)
        at
org.apache.maven.surefire.booter.ForkedBooter.main(ForkedBooter.java:75)
Caused by: org.apache.logging.log4j.core.appender.AppenderRuntimeException:
javax.naming.NameNotFoundException: Name Log4j2Topic not found.
        at
org.apache.logging.log4j.core.appender.JMSTopicAppender.append(JMSTopicAppender.java:52)
        at
org.apache.logging.log4j.core.config.AppenderControl.callAppender(AppenderControl.java:102)
        ... 42 more
Caused by: javax.naming.NameNotFoundException: Name Log4j2Topic not found.
        at org.mockejb.jndi.MockContext.lookup(MockContext.java:543)
        at
org.mockejb.jndi.MockContext$$FastClassByCGLIB$$8f78c5.invoke(<generated>)
        at net.sf.cglib.reflect.FastMethod.invoke(FastMethod.java:53)
        at
org.mockejb.interceptor.InterceptorInvoker$CglibMethodInvoker.intercept(InterceptorInvoker.java:95)
        at
org.mockejb.interceptor.InvocationContext.proceed(InvocationContext.java:177)
        at
org.mockejb.interceptor.InterceptorInvoker.invoke(InterceptorInvoker.java:53)
        at
org.mockejb.interceptor.InterceptableProxy.intercept(InterceptableProxy.java:58)
        at
$javax.naming.Context$$EnhancerByCGLIB$$b681ec35.lookup(<generated>)
        at javax.naming.InitialContext.lookup(InitialContext.java:392)
        at
org.apache.logging.log4j.core.net.AbstractJMSManager.lookup(AbstractJMSManager.java:77)
        at
org.apache.logging.log4j.core.net.JMSTopicManager.connect(JMSTopicManager.java:183)
        at
org.apache.logging.log4j.core.net.JMSTopicManager.send(JMSTopicManager.java:105)
        at
org.apache.logging.log4j.core.appender.JMSTopicAppender.append(JMSTopicAppender.java:50)
        ... 43 more

Tests run: 2, Failures: 0, Errors: 0, Skipped: 0, Time elapsed: 0.876 sec
Running org.apache.logging.log4j.core.net.JMSTopicTest
log4j:WARN No appenders could be found for logger
(org.mockejb.jndi.MockContext).
log4j:WARN Please initialize the log4j system properly.
log4j:WARN See http://logging.apache.org/log4j/1.2/faq.html#noconfig for
more info.
Tests run: 1, Failures: 0, Errors: 0, Skipped: 0, Time elapsed: 0.805 sec
Running org.apache.logging.log4j.core.net.PriorityTest
Tests run: 1, Failures: 0, Errors: 0, Skipped: 0, Time elapsed: 0.08 sec
Running org.apache.logging.log4j.core.net.SocketMessageLossTest
Initializing server
2013-03-24 23:08:05,855 DEBUG Generated plugins in 0.000021173 seconds
2013-03-24 23:08:05,855 DEBUG Generated plugins in 0.000009239 seconds
2013-03-24 23:08:05,855 DEBUG Generated plugins in 0.000012704 seconds
2013-03-24 23:08:05,860 DEBUG Generated plugins in 0.000009624 seconds
2013-03-24 23:08:05,860 DEBUG Generated plugins in 0.000024252 seconds
2013-03-24 23:08:05,860 DEBUG Generated plugins in 0.000009624 seconds
2013-03-24 23:08:05,870 DEBUG Calling createLayout on class
org.apache.logging.log4j.core.layout.PatternLayout for element
PatternLayout with params(pattern="%msg%n", Configuration(MyApp), null,
charset="null")
2013-03-24 23:08:05,870 DEBUG Generated plugins in 0.000019248 seconds
2013-03-24 23:08:05,870 DEBUG Calling createAppender on class
org.apache.logging.log4j.core.appender.SocketAppender for element Socket
with params(host="localhost", port="5514", protocol="TCP",
reconnectionDelay="0", name="socket"
, immediateFlush="null", suppressExceptions="false", PatternLayout(%msg%n),
null, advertise="null", Configuration(MyApp))
2013-03-24 23:08:05,885 DEBUG Starting TCPSocketManager TCP:localhost:5514
2013-03-24 23:08:05,885 DEBUG Calling createAppenders on class
org.apache.logging.log4j.core.config.plugins.AppendersPlugin for element
appenders with params(appenders={socket})
2013-03-24 23:08:05,885 DEBUG Generated plugins in 0.000020017 seconds
2013-03-24 23:08:05,890 DEBUG Calling createAppenderRef on class
org.apache.logging.log4j.core.config.AppenderRef for element appender-ref
with params(ref="socket", level="null", null)
2013-03-24 23:08:05,890 DEBUG Calling createLogger on class
org.apache.logging.log4j.core.config.LoggerConfig$RootLogger for element
root with params(additivity="null", level="debug", appender-ref={
org.apache.logging.log4j.core.co
nfig.AppenderRef@f5e0873}, properties={}, Configuration(MyApp), null)
2013-03-24 23:08:05,890 DEBUG Calling createLoggers on class
org.apache.logging.log4j.core.config.plugins.LoggersPlugin for element
loggers with params(loggers={root})
2013-03-24 23:08:05,890 DEBUG Shutting down OutputStreamManager SYSTEM_OUT
2013-03-24 23:08:05,895 DEBUG Reconfiguration completed
2013-03-24 23:08:06,905 ERROR Unable to write to stream TCP:localhost:5514
for appender socket
2013-03-24 23:08:06,905 ERROR An exception occurred processing Appender
socket org.apache.logging.log4j.core.appender.AppenderRuntimeException:
Error writing to TCP:localhost:5514
        at
org.apache.logging.log4j.core.net.TCPSocketManager.write(TCPSocketManager.java:122)
        at
org.apache.logging.log4j.core.appender.OutputStreamManager.write(OutputStreamManager.java:136)
        at
org.apache.logging.log4j.core.appender.AbstractOutputStreamAppender.append(AbstractOutputStreamAppender.java:115)
        at
org.apache.logging.log4j.core.config.AppenderControl.callAppender(AppenderControl.java:102)
        at
org.apache.logging.log4j.core.config.LoggerConfig.callAppenders(LoggerConfig.java:335)
        at
org.apache.logging.log4j.core.config.LoggerConfig.log(LoggerConfig.java:316)
        at
org.apache.logging.log4j.core.config.LoggerConfig.log(LoggerConfig.java:281)
        at org.apache.logging.log4j.core.Logger.log(Logger.java:108)
        at
org.apache.logging.log4j.spi.AbstractLogger.error(AbstractLogger.java:530)
        at
org.apache.logging.log4j.core.net.SocketMessageLossTest.testSocket(SocketMessageLossTest.java:81)
        at sun.reflect.NativeMethodAccessorImpl.invoke0(Native Method)
        at
sun.reflect.NativeMethodAccessorImpl.invoke(NativeMethodAccessorImpl.java:39)
        at
sun.reflect.DelegatingMethodAccessorImpl.invoke(DelegatingMethodAccessorImpl.java:25)
        at java.lang.reflect.Method.invoke(Method.java:597)
        at
org.junit.runners.model.FrameworkMethod$1.runReflectiveCall(FrameworkMethod.java:44)
        at
org.junit.internal.runners.model.ReflectiveCallable.run(ReflectiveCallable.java:15)
        at
org.junit.runners.model.FrameworkMethod.invokeExplosively(FrameworkMethod.java:41)
        at
org.junit.internal.runners.statements.InvokeMethod.evaluate(InvokeMethod.java:20)
        at
org.junit.runners.BlockJUnit4ClassRunner.runChild(BlockJUnit4ClassRunner.java:76)
        at
org.junit.runners.BlockJUnit4ClassRunner.runChild(BlockJUnit4ClassRunner.java:50)
        at org.junit.runners.ParentRunner$3.run(ParentRunner.java:193)
        at org.junit.runners.ParentRunner$1.schedule(ParentRunner.java:52)
        at org.junit.runners.ParentRunner.runChildren(ParentRunner.java:191)
        at org.junit.runners.ParentRunner.access$000(ParentRunner.java:42)
        at org.junit.runners.ParentRunner$2.evaluate(ParentRunner.java:184)
        at
org.junit.internal.runners.statements.RunBefores.evaluate(RunBefores.java:28)
        at org.junit.runners.ParentRunner.run(ParentRunner.java:236)
        at
org.apache.maven.surefire.junit4.JUnit4Provider.execute(JUnit4Provider.java:252)
        at
org.apache.maven.surefire.junit4.JUnit4Provider.executeTestSet(JUnit4Provider.java:141)
        at
org.apache.maven.surefire.junit4.JUnit4Provider.invoke(JUnit4Provider.java:112)
        at sun.reflect.NativeMethodAccessorImpl.invoke0(Native Method)
        at
sun.reflect.NativeMethodAccessorImpl.invoke(NativeMethodAccessorImpl.java:39)
        at
sun.reflect.DelegatingMethodAccessorImpl.invoke(DelegatingMethodAccessorImpl.java:25)
        at java.lang.reflect.Method.invoke(Method.java:597)
        at
org.apache.maven.surefire.util.ReflectionUtils.invokeMethodWithArray(ReflectionUtils.java:189)
        at
org.apache.maven.surefire.booter.ProviderFactory$ProviderProxy.invoke(ProviderFactory.java:165)
        at
org.apache.maven.surefire.booter.ProviderFactory.invokeProvider(ProviderFactory.java:85)
        at
org.apache.maven.surefire.booter.ForkedBooter.runSuitesInProcess(ForkedBooter.java:115)
        at
org.apache.maven.surefire.booter.ForkedBooter.main(ForkedBooter.java:75)
Caused by: java.net.SocketException: Connection reset by peer: socket write
error
        at java.net.SocketOutputStream.socketWrite0(Native Method)
        at
java.net.SocketOutputStream.socketWrite(SocketOutputStream.java:92)
        at java.net.SocketOutputStream.write(SocketOutputStream.java:136)
        at
org.apache.logging.log4j.core.net.TCPSocketManager.write(TCPSocketManager.java:113)
        ... 38 more

2013-03-24 23:08:06,910 ERROR Unable to write to stream TCP:localhost:5514
for appender socket
2013-03-24 23:08:06,910 ERROR An exception occurred processing Appender
socket org.apache.logging.log4j.core.appender.AppenderRuntimeException:
Error writing to TCP:localhost:5514
        at
org.apache.logging.log4j.core.net.TCPSocketManager.write(TCPSocketManager.java:122)
        at
org.apache.logging.log4j.core.appender.OutputStreamManager.write(OutputStreamManager.java:136)
        at
org.apache.logging.log4j.core.appender.AbstractOutputStreamAppender.append(AbstractOutputStreamAppender.java:115)
        at
org.apache.logging.log4j.core.config.AppenderControl.callAppender(AppenderControl.java:102)
        at
org.apache.logging.log4j.core.config.LoggerConfig.callAppenders(LoggerConfig.java:335)
        at
org.apache.logging.log4j.core.config.LoggerConfig.log(LoggerConfig.java:316)
        at
org.apache.logging.log4j.core.config.LoggerConfig.log(LoggerConfig.java:281)
        at org.apache.logging.log4j.core.Logger.log(Logger.java:108)
        at
org.apache.logging.log4j.spi.AbstractLogger.error(AbstractLogger.java:530)
        at
org.apache.logging.log4j.core.net.SocketMessageLossTest.testSocket(SocketMessageLossTest.java:89)
        at sun.reflect.NativeMethodAccessorImpl.invoke0(Native Method)
        at
sun.reflect.NativeMethodAccessorImpl.invoke(NativeMethodAccessorImpl.java:39)
        at
sun.reflect.DelegatingMethodAccessorImpl.invoke(DelegatingMethodAccessorImpl.java:25)
        at java.lang.reflect.Method.invoke(Method.java:597)
        at
org.junit.runners.model.FrameworkMethod$1.runReflectiveCall(FrameworkMethod.java:44)
        at
org.junit.internal.runners.model.ReflectiveCallable.run(ReflectiveCallable.java:15)
        at
org.junit.runners.model.FrameworkMethod.invokeExplosively(FrameworkMethod.java:41)
        at
org.junit.internal.runners.statements.InvokeMethod.evaluate(InvokeMethod.java:20)
        at
org.junit.runners.BlockJUnit4ClassRunner.runChild(BlockJUnit4ClassRunner.java:76)
        at
org.junit.runners.BlockJUnit4ClassRunner.runChild(BlockJUnit4ClassRunner.java:50)
        at org.junit.runners.ParentRunner$3.run(ParentRunner.java:193)
        at org.junit.runners.ParentRunner$1.schedule(ParentRunner.java:52)
        at org.junit.runners.ParentRunner.runChildren(ParentRunner.java:191)
        at org.junit.runners.ParentRunner.access$000(ParentRunner.java:42)
        at org.junit.runners.ParentRunner$2.evaluate(ParentRunner.java:184)
        at
org.junit.internal.runners.statements.RunBefores.evaluate(RunBefores.java:28)
        at org.junit.runners.ParentRunner.run(ParentRunner.java:236)
        at
org.apache.maven.surefire.junit4.JUnit4Provider.execute(JUnit4Provider.java:252)
        at
org.apache.maven.surefire.junit4.JUnit4Provider.executeTestSet(JUnit4Provider.java:141)
        at
org.apache.maven.surefire.junit4.JUnit4Provider.invoke(JUnit4Provider.java:112)
        at sun.reflect.NativeMethodAccessorImpl.invoke0(Native Method)
        at
sun.reflect.NativeMethodAccessorImpl.invoke(NativeMethodAccessorImpl.java:39)
        at
sun.reflect.DelegatingMethodAccessorImpl.invoke(DelegatingMethodAccessorImpl.java:25)
        at java.lang.reflect.Method.invoke(Method.java:597)
        at
org.apache.maven.surefire.util.ReflectionUtils.invokeMethodWithArray(ReflectionUtils.java:189)
        at
org.apache.maven.surefire.booter.ProviderFactory$ProviderProxy.invoke(ProviderFactory.java:165)
        at
org.apache.maven.surefire.booter.ProviderFactory.invokeProvider(ProviderFactory.java:85)
        at
org.apache.maven.surefire.booter.ForkedBooter.runSuitesInProcess(ForkedBooter.java:115)
        at
org.apache.maven.surefire.booter.ForkedBooter.main(ForkedBooter.java:75)
Caused by: java.net.SocketException: Connection reset by peer: socket write
error
        at java.net.SocketOutputStream.socketWrite0(Native Method)
        at
java.net.SocketOutputStream.socketWrite(SocketOutputStream.java:92)
        at java.net.SocketOutputStream.write(SocketOutputStream.java:136)
        at
org.apache.logging.log4j.core.net.TCPSocketManager.write(TCPSocketManager.java:113)
        ... 38 more

Tests run: 1, Failures: 0, Errors: 0, Skipped: 0, Time elapsed: 1.635 sec
Running org.apache.logging.log4j.core.net.SocketReconnectTest

-- 
E-Mail: garydgregory@gmail.com | ggregory@apache.org
JUnit in Action, 2nd Ed: <http://goog_1249600977>http://bit.ly/ECvg0
Spring Batch in Action: <http://s.apache.org/HOq>http://bit.ly/bqpbCK
Blog: http://garygregory.wordpress.com
Home: http://garygregory.com/
Tweet! http://twitter.com/GaryGregory

Mime
View raw message