lenya-user mailing list archives

Site index · List index
Message view « Date » · « Thread »
Top « Date » · « Thread »
From peter maas <pe...@noterik.nl>
Subject problems building lenya on top of cocoon-2.1.5
Date Mon, 14 Jun 2004 15:14:12 GMT
Hi all,

I have some problems building the current lenya version on top of 
cocoon-2.15. I have followed the instructions on the website for 
building cocoon.

The following exception is thrown during the build (tarball download AND 
cvs checkout):

BUILD FAILED
java.lang.IllegalArgumentException: No attributes are implemented
        at 
org.apache.crimson.jaxp.DocumentBuilderFactoryImpl.setAttribute(DocumentBuilderFactoryImpl.java:93)
        at XConfToolTask.execute(Unknown Source)
        at 
org.apache.tools.ant.UnknownElement.execute(UnknownElement.java:269)
        at org.apache.tools.ant.Task.perform(Task.java:364)
        at org.apache.tools.ant.Target.execute(Target.java:301)
        at org.apache.tools.ant.Target.performTasks(Target.java:328)
        at org.apache.tools.ant.Project.executeTarget(Project.java:1215)
        at org.apache.tools.ant.Project.executeTargets(Project.java:1063)
        at org.apache.tools.ant.Main.runBuild(Main.java:632)
        at org.apache.tools.ant.Main.startAnt(Main.java:183)
        at org.apache.tools.ant.launch.Launcher.run(Launcher.java:197)
        at org.apache.tools.ant.launch.Launcher.main(Launcher.java:56)
 
Total time: 3 seconds
java.lang.IllegalArgumentException: No attributes are implemented
        at 
org.apache.crimson.jaxp.DocumentBuilderFactoryImpl.setAttribute(DocumentBuilderFactoryImpl.java:93)
        at XConfToolTask.execute(Unknown Source)
        at 
org.apache.tools.ant.UnknownElement.execute(UnknownElement.java:269)
        at org.apache.tools.ant.Task.perform(Task.java:364)
        at org.apache.tools.ant.Target.execute(Target.java:301)
        at org.apache.tools.ant.Target.performTasks(Target.java:328)
        at org.apache.tools.ant.Project.executeTarget(Project.java:1215)
        at org.apache.tools.ant.Project.executeTargets(Project.java:1063)
        at org.apache.tools.ant.Main.runBuild(Main.java:632)
        at org.apache.tools.ant.Main.startAnt(Main.java:183)
        at org.apache.tools.ant.launch.Launcher.run(Launcher.java:197)
        at org.apache.tools.ant.launch.Launcher.main(Launcher.java:56)
No attributes are implemented

gr,

Peter

-- 
-------------------------------------- 
Peter Maas
Technical Project Manager / Streaming
 
Noterik Multimedia BV
Polderweg 102
Postbus 92122
1090 AC Amsterdam
Tel: +31 (0)20-592 99 66
Fax: +31 (0)20-468 84 05
 
Web: www.noterik.nl
--------------------------------------
 
Take a look at our streaming solutions: http://www.streamedit.com/demo.html
Recent project: http://managenergy.noterik.com/flashintroduction.html
---------------------------------------
 


---------------------------------------------------------------------
To unsubscribe, e-mail: lenya-user-unsubscribe@cocoon.apache.org
For additional commands, e-mail: lenya-user-help@cocoon.apache.org


Mime
View raw message