kylin-commits mailing list archives

Site index · List index
Message view « Date » · « Thread »
Top « Date » · « Thread »
From Apache Jenkins Server <jenk...@builds.apache.org>
Subject Build failed in Jenkins: Kylin-Master-JDK-1.8 #997
Date Wed, 24 Jan 2018 10:16:54 GMT
See <https://builds.apache.org/job/Kylin-Master-JDK-1.8/997/display/redirect?page=changes>

Changes:

[billyliu] KYLIN-3020 org.apache.hadoop.util.ToolRunner is not threadsafe and

------------------------------------------
[...truncated 3.22 MB...]
[INFO] Apache Kylin - External ............................ SUCCESS [ 15.285 s]
[INFO] Apache Kylin - Calcite Overrides ................... SUCCESS [ 15.919 s]
[INFO] Apache Kylin - Core Common ......................... SUCCESS [ 28.588 s]
[INFO] Apache Kylin - Core Metadata ....................... SUCCESS [ 47.483 s]
[INFO] Apache Kylin - Core Dictionary ..................... SUCCESS [ 51.415 s]
[INFO] Apache Kylin - Core Cube ........................... SUCCESS [01:35 min]
[INFO] Apache Kylin - Core Metrics ........................ SUCCESS [  8.266 s]
[INFO] Apache Kylin - Core Job ............................ SUCCESS [ 59.406 s]
[INFO] Apache Kylin - Core Storage ........................ SUCCESS [ 17.282 s]
[INFO] Apache Kylin - MapReduce Engine .................... SUCCESS [ 36.007 s]
[INFO] Apache Kylin - HBase Storage ....................... SUCCESS [ 32.709 s]
[INFO] Apache Kylin - Spark Engine ........................ SUCCESS [ 17.556 s]
[INFO] Apache Kylin - Hive Source ......................... FAILURE [  0.691 s]
[INFO] Apache Kylin - Kafka Source ........................ SUCCESS [ 13.769 s]
[INFO] Apache Kylin - Query ............................... SUCCESS [ 18.355 s]
[INFO] Apache Kylin - Metrics Reporter Hive ............... FAILURE [  0.412 s]
[INFO] Apache Kylin - Metrics Reporter Kafka .............. SUCCESS [  7.909 s]
[INFO] Apache Kylin - REST Server Base .................... SKIPPED
[INFO] Apache Kylin - REST Server ......................... SKIPPED
[INFO] Apache Kylin - JDBC Driver ......................... SUCCESS [ 11.743 s]
[INFO] Apache Kylin - Assembly ............................ SKIPPED
[INFO] Apache Kylin - Tool ................................ SKIPPED
[INFO] Apache Kylin - Tool Assembly ....................... SKIPPED
[INFO] Apache Kylin - Integration Test .................... SKIPPED
[INFO] Apache Kylin - Tomcat Extension .................... SUCCESS [  6.904 s]
[INFO] ------------------------------------------------------------------------
[INFO] BUILD FAILURE
[INFO] ------------------------------------------------------------------------
[INFO] Total time: 10:16 min
[INFO] Finished at: 2018-01-24T10:16:10+00:00
[INFO] Final Memory: 71M/576M
[INFO] ------------------------------------------------------------------------
Waiting for Jenkins to finish collecting data
[ERROR] Failed to execute goal on project kylin-source-hive: Could not resolve dependencies
for project org.apache.kylin:kylin-source-hive:jar:2.3.0-SNAPSHOT: Failed to collect dependencies
at org.apache.hive.hcatalog:hive-hcatalog-core:jar:1.2.1 -> org.apache.hive:hive-cli:jar:1.2.1
-> org.apache.hive:hive-service:jar:1.2.1 -> org.eclipse.jetty.aggregate:jetty-all:jar:7.6.0.v20120127
-> org.apache.geronimo.specs:geronimo-jaspic_1.0_spec:jar:1.0: Failed to read artifact
descriptor for org.apache.geronimo.specs:geronimo-jaspic_1.0_spec:jar:1.0: Could not transfer
artifact org.apache.geronimo.specs:geronimo-jaspic_1.0_spec:pom:1.0 from/to central (http://repo.maven.apache.org/maven2):
/home/jenkins/.m2/repository/org/apache/geronimo/specs/geronimo-jaspic_1.0_spec/1.0/geronimo-jaspic_1.0_spec-1.0.pom.part.lock
(No such file or directory) -> [Help 1]
org.apache.maven.lifecycle.LifecycleExecutionException: Failed to execute goal on project
kylin-source-hive: Could not resolve dependencies for project org.apache.kylin:kylin-source-hive:jar:2.3.0-SNAPSHOT:
Failed to collect dependencies at org.apache.hive.hcatalog:hive-hcatalog-core:jar:1.2.1 ->
org.apache.hive:hive-cli:jar:1.2.1 -> org.apache.hive:hive-service:jar:1.2.1 -> org.eclipse.jetty.aggregate:jetty-all:jar:7.6.0.v20120127
-> org.apache.geronimo.specs:geronimo-jaspic_1.0_spec:jar:1.0
	at org.apache.maven.lifecycle.internal.LifecycleDependencyResolver.getDependencies(LifecycleDependencyResolver.java:221)
	at org.apache.maven.lifecycle.internal.LifecycleDependencyResolver.resolveProjectDependencies(LifecycleDependencyResolver.java:127)
	at org.apache.maven.lifecycle.internal.MojoExecutor.ensureDependenciesAreResolved(MojoExecutor.java:245)
	at org.apache.maven.lifecycle.internal.MojoExecutor.execute(MojoExecutor.java:199)
	at org.apache.maven.lifecycle.internal.MojoExecutor.execute(MojoExecutor.java:153)
	at org.apache.maven.lifecycle.internal.MojoExecutor.execute(MojoExecutor.java:145)
	at org.apache.maven.lifecycle.internal.LifecycleModuleBuilder.buildProject(LifecycleModuleBuilder.java:116)
	at org.apache.maven.lifecycle.internal.LifecycleModuleBuilder.buildProject(LifecycleModuleBuilder.java:80)
	at org.apache.maven.lifecycle.internal.builder.singlethreaded.SingleThreadedBuilder.build(SingleThreadedBuilder.java:51)
	at org.apache.maven.lifecycle.internal.LifecycleStarter.execute(LifecycleStarter.java:128)
	at org.apache.maven.DefaultMaven.doExecute(DefaultMaven.java:307)
	at org.apache.maven.DefaultMaven.doExecute(DefaultMaven.java:193)
	at org.apache.maven.DefaultMaven.execute(DefaultMaven.java:106)
	at org.jvnet.hudson.maven3.launcher.Maven33Launcher.main(Maven33Launcher.java:129)
	at sun.reflect.NativeMethodAccessorImpl.invoke0(Native Method)
	at sun.reflect.NativeMethodAccessorImpl.invoke(NativeMethodAccessorImpl.java:62)
	at sun.reflect.DelegatingMethodAccessorImpl.invoke(DelegatingMethodAccessorImpl.java:43)
	at java.lang.reflect.Method.invoke(Method.java:498)
	at org.codehaus.plexus.classworlds.launcher.Launcher.launchStandard(Launcher.java:330)
	at org.codehaus.plexus.classworlds.launcher.Launcher.launch(Launcher.java:238)
	at jenkins.maven3.agent.Maven33Main.launch(Maven33Main.java:176)
	at sun.reflect.NativeMethodAccessorImpl.invoke0(Native Method)
	at sun.reflect.NativeMethodAccessorImpl.invoke(NativeMethodAccessorImpl.java:62)
	at sun.reflect.DelegatingMethodAccessorImpl.invoke(DelegatingMethodAccessorImpl.java:43)
	at java.lang.reflect.Method.invoke(Method.java:498)
	at hudson.maven.Maven3Builder.call(Maven3Builder.java:139)
	at hudson.maven.Maven3Builder.call(Maven3Builder.java:70)
	at hudson.remoting.UserRequest.perform(UserRequest.java:207)
	at hudson.remoting.UserRequest.perform(UserRequest.java:53)
	at hudson.remoting.Request$2.run(Request.java:358)
	at hudson.remoting.InterceptingExecutorService$1.call(InterceptingExecutorService.java:72)
	at java.util.concurrent.FutureTask.run(FutureTask.java:266)
	at java.util.concurrent.ThreadPoolExecutor.runWorker(ThreadPoolExecutor.java:1149)
	at java.util.concurrent.ThreadPoolExecutor$Worker.run(ThreadPoolExecutor.java:624)
	at java.lang.Thread.run(Thread.java:748)
Caused by: org.apache.maven.project.DependencyResolutionException: Could not resolve dependencies
for project org.apache.kylin:kylin-source-hive:jar:2.3.0-SNAPSHOT: Failed to collect dependencies
at org.apache.hive.hcatalog:hive-hcatalog-core:jar:1.2.1 -> org.apache.hive:hive-cli:jar:1.2.1
-> org.apache.hive:hive-service:jar:1.2.1 -> org.eclipse.jetty.aggregate:jetty-all:jar:7.6.0.v20120127
-> org.apache.geronimo.specs:geronimo-jaspic_1.0_spec:jar:1.0
	at org.apache.maven.project.DefaultProjectDependenciesResolver.resolve(DefaultProjectDependenciesResolver.java:180)
	at org.apache.maven.lifecycle.internal.LifecycleDependencyResolver.getDependencies(LifecycleDependencyResolver.java:195)
	... 34 more
Caused by: org.eclipse.aether.collection.DependencyCollectionException: Failed to collect
dependencies at org.apache.hive.hcatalog:hive-hcatalog-core:jar:1.2.1 -> org.apache.hive:hive-cli:jar:1.2.1
-> org.apache.hive:hive-service:jar:1.2.1 -> org.eclipse.jetty.aggregate:jetty-all:jar:7.6.0.v20120127
-> org.apache.geronimo.specs:geronimo-jaspic_1.0_spec:jar:1.0
	at org.eclipse.aether.internal.impl.DefaultDependencyCollector.collectDependencies(DefaultDependencyCollector.java:291)
	at org.eclipse.aether.internal.impl.DefaultRepositorySystem.collectDependencies(DefaultRepositorySystem.java:316)
	at org.apache.maven.project.DefaultProjectDependenciesResolver.resolve(DefaultProjectDependenciesResolver.java:172)
	... 35 more
Caused by: org.eclipse.aether.resolution.ArtifactDescriptorException: Failed to read artifact
descriptor for org.apache.geronimo.specs:geronimo-jaspic_1.0_spec:jar:1.0
	at org.apache.maven.repository.internal.DefaultArtifactDescriptorReader.loadPom(DefaultArtifactDescriptorReader.java:282)
	at org.apache.maven.repository.internal.DefaultArtifactDescriptorReader.readArtifactDescriptor(DefaultArtifactDescriptorReader.java:198)
	at org.eclipse.aether.internal.impl.DefaultDependencyCollector.resolveCachedArtifactDescriptor(DefaultDependencyCollector.java:535)
	at org.eclipse.aether.internal.impl.DefaultDependencyCollector.getArtifactDescriptorResult(DefaultDependencyCollector.java:519)
	at org.eclipse.aether.internal.impl.DefaultDependencyCollector.processDependency(DefaultDependencyCollector.java:409)
	at org.eclipse.aether.internal.impl.DefaultDependencyCollector.processDependency(DefaultDependencyCollector.java:363)
	at org.eclipse.aether.internal.impl.DefaultDependencyCollector.process(DefaultDependencyCollector.java:351)
	at org.eclipse.aether.internal.impl.DefaultDependencyCollector.doRecurse(DefaultDependencyCollector.java:504)
	at org.eclipse.aether.internal.impl.DefaultDependencyCollector.processDependency(DefaultDependencyCollector.java:458)
	at org.eclipse.aether.internal.impl.DefaultDependencyCollector.processDependency(DefaultDependencyCollector.java:363)
	at org.eclipse.aether.internal.impl.DefaultDependencyCollector.process(DefaultDependencyCollector.java:351)
	at org.eclipse.aether.internal.impl.DefaultDependencyCollector.doRecurse(DefaultDependencyCollector.java:504)
	at org.eclipse.aether.internal.impl.DefaultDependencyCollector.processDependency(DefaultDependencyCollector.java:458)
	at org.eclipse.aether.internal.impl.DefaultDependencyCollector.processDependency(DefaultDependencyCollector.java:363)
	at org.eclipse.aether.internal.impl.DefaultDependencyCollector.process(DefaultDependencyCollector.java:351)
	at org.eclipse.aether.internal.impl.DefaultDependencyCollector.doRecurse(DefaultDependencyCollector.java:504)
	at org.eclipse.aether.internal.impl.DefaultDependencyCollector.processDependency(DefaultDependencyCollector.java:458)
	at org.eclipse.aether.internal.impl.DefaultDependencyCollector.processDependency(DefaultDependencyCollector.java:363)
	at org.eclipse.aether.internal.impl.DefaultDependencyCollector.process(DefaultDependencyCollector.java:351)
	at org.eclipse.aether.internal.impl.DefaultDependencyCollector.doRecurse(DefaultDependencyCollector.java:504)
	at org.eclipse.aether.internal.impl.DefaultDependencyCollector.processDependency(DefaultDependencyCollector.java:458)
	at org.eclipse.aether.internal.impl.DefaultDependencyCollector.processDependency(DefaultDependencyCollector.java:363)
	at org.eclipse.aether.internal.impl.DefaultDependencyCollector.process(DefaultDependencyCollector.java:351)
	at org.eclipse.aether.internal.impl.DefaultDependencyCollector.collectDependencies(DefaultDependencyCollector.java:254)
	... 37 more
Caused by: org.eclipse.aether.resolution.ArtifactResolutionException: Could not transfer artifact
org.apache.geronimo.specs:geronimo-jaspic_1.0_spec:pom:1.0 from/to central (http://repo.maven.apache.org/maven2):
/home/jenkins/.m2/repository/org/apache/geronimo/specs/geronimo-jaspic_1.0_spec/1.0/geronimo-jaspic_1.0_spec-1.0.pom.part.lock
(No such file or directory)
	at org.eclipse.aether.internal.impl.DefaultArtifactResolver.resolve(DefaultArtifactResolver.java:444)
	at org.eclipse.aether.internal.impl.DefaultArtifactResolver.resolveArtifacts(DefaultArtifactResolver.java:246)
	at org.eclipse.aether.internal.impl.DefaultArtifactResolver.resolveArtifact(DefaultArtifactResolver.java:223)
	at org.apache.maven.repository.internal.DefaultArtifactDescriptorReader.loadPom(DefaultArtifactDescriptorReader.java:267)
	... 60 more
Caused by: org.eclipse.aether.transfer.ArtifactTransferException: Could not transfer artifact
org.apache.geronimo.specs:geronimo-jaspic_1.0_spec:pom:1.0 from/to central (http://repo.maven.apache.org/maven2):
/home/jenkins/.m2/repository/org/apache/geronimo/specs/geronimo-jaspic_1.0_spec/1.0/geronimo-jaspic_1.0_spec-1.0.pom.part.lock
(No such file or directory)
	at org.eclipse.aether.connector.basic.ArtifactTransportListener.transferFailed(ArtifactTransportListener.java:43)
	at org.eclipse.aether.connector.basic.BasicRepositoryConnector$TaskRunner.run(BasicRepositoryConnector.java:355)
	at org.eclipse.aether.util.concurrency.RunnableErrorForwarder$1.run(RunnableErrorForwarder.java:67)
	at org.eclipse.aether.connector.basic.BasicRepositoryConnector$DirectExecutor.execute(BasicRepositoryConnector.java:581)
	at org.eclipse.aether.connector.basic.BasicRepositoryConnector.get(BasicRepositoryConnector.java:249)
	at org.eclipse.aether.internal.impl.DefaultArtifactResolver.performDownloads(DefaultArtifactResolver.java:520)
	at org.eclipse.aether.internal.impl.DefaultArtifactResolver.resolve(DefaultArtifactResolver.java:421)
	... 63 more
Caused by: java.io.FileNotFoundException: /home/jenkins/.m2/repository/org/apache/geronimo/specs/geronimo-jaspic_1.0_spec/1.0/geronimo-jaspic_1.0_spec-1.0.pom.part.lock
(No such file or directory)
	at java.io.RandomAccessFile.open0(Native Method)
	at java.io.RandomAccessFile.open(RandomAccessFile.java:316)
	at java.io.RandomAccessFile.<init>(RandomAccessFile.java:243)
	at org.eclipse.aether.connector.basic.PartialFile$LockFile.tryLock(PartialFile.java:123)
	at org.eclipse.aether.connector.basic.PartialFile$LockFile.lock(PartialFile.java:71)
	at org.eclipse.aether.connector.basic.PartialFile$LockFile.<init>(PartialFile.java:58)
	at org.eclipse.aether.connector.basic.PartialFile$Factory.newInstance(PartialFile.java:210)
	at org.eclipse.aether.connector.basic.BasicRepositoryConnector$GetTaskRunner.runTask(BasicRepositoryConnector.java:432)
	at org.eclipse.aether.connector.basic.BasicRepositoryConnector$TaskRunner.run(BasicRepositoryConnector.java:350)
	... 68 more
[ERROR] Failed to execute goal on project kylin-metrics-reporter-hive: Could not resolve dependencies
for project org.apache.kylin:kylin-metrics-reporter-hive:jar:2.3.0-SNAPSHOT: Could not transfer
artifact org.apache.geronimo.specs:geronimo-jaspic_1.0_spec:jar:1.0 from/to central (http://repo.maven.apache.org/maven2):
/home/jenkins/.m2/repository/org/apache/geronimo/specs/geronimo-jaspic_1.0_spec/1.0/geronimo-jaspic_1.0_spec-1.0.jar.part.lock
(No such file or directory) -> [Help 1]
org.apache.maven.lifecycle.LifecycleExecutionException: Failed to execute goal on project
kylin-metrics-reporter-hive: Could not resolve dependencies for project org.apache.kylin:kylin-metrics-reporter-hive:jar:2.3.0-SNAPSHOT:
Could not transfer artifact org.apache.geronimo.specs:geronimo-jaspic_1.0_spec:jar:1.0 from/to
central (http://repo.maven.apache.org/maven2): /home/jenkins/.m2/repository/org/apache/geronimo/specs/geronimo-jaspic_1.0_spec/1.0/geronimo-jaspic_1.0_spec-1.0.jar.part.lock
(No such file or directory)
	at org.apache.maven.lifecycle.internal.LifecycleDependencyResolver.getDependencies(LifecycleDependencyResolver.java:221)
	at org.apache.maven.lifecycle.internal.LifecycleDependencyResolver.resolveProjectDependencies(LifecycleDependencyResolver.java:127)
	at org.apache.maven.lifecycle.internal.MojoExecutor.ensureDependenciesAreResolved(MojoExecutor.java:245)
	at org.apache.maven.lifecycle.internal.MojoExecutor.execute(MojoExecutor.java:199)
	at org.apache.maven.lifecycle.internal.MojoExecutor.execute(MojoExecutor.java:153)
	at org.apache.maven.lifecycle.internal.MojoExecutor.execute(MojoExecutor.java:145)
	at org.apache.maven.lifecycle.internal.LifecycleModuleBuilder.buildProject(LifecycleModuleBuilder.java:116)
	at org.apache.maven.lifecycle.internal.LifecycleModuleBuilder.buildProject(LifecycleModuleBuilder.java:80)
	at org.apache.maven.lifecycle.internal.builder.singlethreaded.SingleThreadedBuilder.build(SingleThreadedBuilder.java:51)
	at org.apache.maven.lifecycle.internal.LifecycleStarter.execute(LifecycleStarter.java:128)
	at org.apache.maven.DefaultMaven.doExecute(DefaultMaven.java:307)
	at org.apache.maven.DefaultMaven.doExecute(DefaultMaven.java:193)
	at org.apache.maven.DefaultMaven.execute(DefaultMaven.java:106)
	at org.jvnet.hudson.maven3.launcher.Maven33Launcher.main(Maven33Launcher.java:129)
	at sun.reflect.NativeMethodAccessorImpl.invoke0(Native Method)
	at sun.reflect.NativeMethodAccessorImpl.invoke(NativeMethodAccessorImpl.java:62)
	at sun.reflect.DelegatingMethodAccessorImpl.invoke(DelegatingMethodAccessorImpl.java:43)
	at java.lang.reflect.Method.invoke(Method.java:498)
	at org.codehaus.plexus.classworlds.launcher.Launcher.launchStandard(Launcher.java:330)
	at org.codehaus.plexus.classworlds.launcher.Launcher.launch(Launcher.java:238)
	at jenkins.maven3.agent.Maven33Main.launch(Maven33Main.java:176)
	at sun.reflect.NativeMethodAccessorImpl.invoke0(Native Method)
	at sun.reflect.NativeMethodAccessorImpl.invoke(NativeMethodAccessorImpl.java:62)
	at sun.reflect.DelegatingMethodAccessorImpl.invoke(DelegatingMethodAccessorImpl.java:43)
	at java.lang.reflect.Method.invoke(Method.java:498)
	at hudson.maven.Maven3Builder.call(Maven3Builder.java:139)
	at hudson.maven.Maven3Builder.call(Maven3Builder.java:70)
	at hudson.remoting.UserRequest.perform(UserRequest.java:207)
	at hudson.remoting.UserRequest.perform(UserRequest.java:53)
	at hudson.remoting.Request$2.run(Request.java:358)
	at hudson.remoting.InterceptingExecutorService$1.call(InterceptingExecutorService.java:72)
	at java.util.concurrent.FutureTask.run(FutureTask.java:266)
	at java.util.concurrent.ThreadPoolExecutor.runWorker(ThreadPoolExecutor.java:1149)
	at java.util.concurrent.ThreadPoolExecutor$Worker.run(ThreadPoolExecutor.java:624)
	at java.lang.Thread.run(Thread.java:748)
Caused by: org.apache.maven.project.DependencyResolutionException: Could not resolve dependencies
for project org.apache.kylin:kylin-metrics-reporter-hive:jar:2.3.0-SNAPSHOT: Could not transfer
artifact org.apache.geronimo.specs:geronimo-jaspic_1.0_spec:jar:1.0 from/to central (http://repo.maven.apache.org/maven2):
/home/jenkins/.m2/repository/org/apache/geronimo/specs/geronimo-jaspic_1.0_spec/1.0/geronimo-jaspic_1.0_spec-1.0.jar.part.lock
(No such file or directory)
	at org.apache.maven.project.DefaultProjectDependenciesResolver.resolve(DefaultProjectDependenciesResolver.java:211)
	at org.apache.maven.lifecycle.internal.LifecycleDependencyResolver.getDependencies(LifecycleDependencyResolver.java:195)
	... 34 more
Caused by: org.eclipse.aether.resolution.DependencyResolutionException: Could not transfer
artifact org.apache.geronimo.specs:geronimo-jaspic_1.0_spec:jar:1.0 from/to central (http://repo.maven.apache.org/maven2):
/home/jenkins/.m2/repository/org/apache/geronimo/specs/geronimo-jaspic_1.0_spec/1.0/geronimo-jaspic_1.0_spec-1.0.jar.part.lock
(No such file or directory)
	at org.eclipse.aether.internal.impl.DefaultRepositorySystem.resolveDependencies(DefaultRepositorySystem.java:384)
	at org.apache.maven.project.DefaultProjectDependenciesResolver.resolve(DefaultProjectDependenciesResolver.java:205)
	... 35 more
Caused by: org.eclipse.aether.resolution.ArtifactResolutionException: Could not transfer artifact
org.apache.geronimo.specs:geronimo-jaspic_1.0_spec:jar:1.0 from/to central (http://repo.maven.apache.org/maven2):
/home/jenkins/.m2/repository/org/apache/geronimo/specs/geronimo-jaspic_1.0_spec/1.0/geronimo-jaspic_1.0_spec-1.0.jar.part.lock
(No such file or directory)
	at org.eclipse.aether.internal.impl.DefaultArtifactResolver.resolve(DefaultArtifactResolver.java:444)
	at org.eclipse.aether.internal.impl.DefaultArtifactResolver.resolveArtifacts(DefaultArtifactResolver.java:246)
	at org.eclipse.aether.internal.impl.DefaultRepositorySystem.resolveDependencies(DefaultRepositorySystem.java:367)
	... 36 more
Caused by: org.eclipse.aether.transfer.ArtifactTransferException: Could not transfer artifact
org.apache.geronimo.specs:geronimo-jaspic_1.0_spec:jar:1.0 from/to central (http://repo.maven.apache.org/maven2):
/home/jenkins/.m2/repository/org/apache/geronimo/specs/geronimo-jaspic_1.0_spec/1.0/geronimo-jaspic_1.0_spec-1.0.jar.part.lock
(No such file or directory)
	at org.eclipse.aether.connector.basic.ArtifactTransportListener.transferFailed(ArtifactTransportListener.java:43)
	at org.eclipse.aether.connector.basic.BasicRepositoryConnector$TaskRunner.run(BasicRepositoryConnector.java:355)
	at org.eclipse.aether.util.concurrency.RunnableErrorForwarder$1.run(RunnableErrorForwarder.java:67)
	at org.eclipse.aether.connector.basic.BasicRepositoryConnector$DirectExecutor.execute(BasicRepositoryConnector.java:581)
	at org.eclipse.aether.connector.basic.BasicRepositoryConnector.get(BasicRepositoryConnector.java:249)
	at org.eclipse.aether.internal.impl.DefaultArtifactResolver.performDownloads(DefaultArtifactResolver.java:520)
	at org.eclipse.aether.internal.impl.DefaultArtifactResolver.resolve(DefaultArtifactResolver.java:421)
	... 38 more
Caused by: java.io.FileNotFoundException: /home/jenkins/.m2/repository/org/apache/geronimo/specs/geronimo-jaspic_1.0_spec/1.0/geronimo-jaspic_1.0_spec-1.0.jar.part.lock
(No such file or directory)
	at java.io.RandomAccessFile.open0(Native Method)
	at java.io.RandomAccessFile.open(RandomAccessFile.java:316)
	at java.io.RandomAccessFile.<init>(RandomAccessFile.java:243)
	at org.eclipse.aether.connector.basic.PartialFile$LockFile.tryLock(PartialFile.java:123)
	at org.eclipse.aether.connector.basic.PartialFile$LockFile.lock(PartialFile.java:71)
	at org.eclipse.aether.connector.basic.PartialFile$LockFile.<init>(PartialFile.java:58)
	at org.eclipse.aether.connector.basic.PartialFile$Factory.newInstance(PartialFile.java:210)
	at org.eclipse.aether.connector.basic.BasicRepositoryConnector$GetTaskRunner.runTask(BasicRepositoryConnector.java:432)
	at org.eclipse.aether.connector.basic.BasicRepositoryConnector$TaskRunner.run(BasicRepositoryConnector.java:350)
	... 43 more
[ERROR] 
[ERROR] Re-run Maven using the -X switch to enable full debug logging.
[ERROR] 
[ERROR] For more information about the errors and possible solutions, please read the following
articles:
[ERROR] [Help 1] http://cwiki.apache.org/confluence/display/MAVEN/DependencyResolutionException
[ERROR] 
[ERROR] After correcting the problems, you can resume the build with the command
[ERROR]   mvn <goals> -rf :kylin-source-hive
[JENKINS] Archiving <https://builds.apache.org/job/Kylin-Master-JDK-1.8/ws/server/pom.xml>
to org.apache.kylin/kylin-server/2.3.0-SNAPSHOT/kylin-server-2.3.0-SNAPSHOT.pom
[JENKINS] Archiving <https://builds.apache.org/job/Kylin-Master-JDK-1.8/ws/jdbc/pom.xml>
to org.apache.kylin/kylin-jdbc/2.3.0-SNAPSHOT/kylin-jdbc-2.3.0-SNAPSHOT.pom
[JENKINS] Archiving <https://builds.apache.org/job/Kylin-Master-JDK-1.8/ws/core-metadata/pom.xml>
to org.apache.kylin/kylin-core-metadata/2.3.0-SNAPSHOT/kylin-core-metadata-2.3.0-SNAPSHOT.pom
[JENKINS] Archiving <https://builds.apache.org/job/Kylin-Master-JDK-1.8/ws/storage-hbase/pom.xml>
to org.apache.kylin/kylin-storage-hbase/2.3.0-SNAPSHOT/kylin-storage-hbase-2.3.0-SNAPSHOT.pom
[JENKINS] Archiving <https://builds.apache.org/job/Kylin-Master-JDK-1.8/ws/source-hive/pom.xml>
to org.apache.kylin/kylin-source-hive/2.3.0-SNAPSHOT/kylin-source-hive-2.3.0-SNAPSHOT.pom
[JENKINS] Archiving <https://builds.apache.org/job/Kylin-Master-JDK-1.8/ws/external/pom.xml>
to org.apache.kylin/kylin-external/2.3.0-SNAPSHOT/kylin-external-2.3.0-SNAPSHOT.pom
[JENKINS] Archiving <https://builds.apache.org/job/Kylin-Master-JDK-1.8/ws/atopcalcite/pom.xml>
to org.apache.kylin/atopcalcite/2.3.0-SNAPSHOT/atopcalcite-2.3.0-SNAPSHOT.pom
[JENKINS] Archiving <https://builds.apache.org/job/Kylin-Master-JDK-1.8/ws/pom.xml>
to org.apache.kylin/kylin/2.3.0-SNAPSHOT/kylin-2.3.0-SNAPSHOT.pom
[Fast Archiver] Compressed 69.43 KB of artifacts by 92.2% relative to #996
[JENKINS] Archiving <https://builds.apache.org/job/Kylin-Master-JDK-1.8/ws/metrics-reporter-hive/pom.xml>
to org.apache.kylin/kylin-metrics-reporter-hive/2.3.0-SNAPSHOT/kylin-metrics-reporter-hive-2.3.0-SNAPSHOT.pom
[JENKINS] Archiving <https://builds.apache.org/job/Kylin-Master-JDK-1.8/ws/core-metrics/pom.xml>
to org.apache.kylin/kylin-core-metrics/2.3.0-SNAPSHOT/kylin-core-metrics-2.3.0-SNAPSHOT.pom
[JENKINS] Archiving <https://builds.apache.org/job/Kylin-Master-JDK-1.8/ws/core-cube/pom.xml>
to org.apache.kylin/kylin-core-cube/2.3.0-SNAPSHOT/kylin-core-cube-2.3.0-SNAPSHOT.pom
[JENKINS] Archiving <https://builds.apache.org/job/Kylin-Master-JDK-1.8/ws/metrics-reporter-kafka/pom.xml>
to org.apache.kylin/kylin-metrics-reporter-kafka/2.3.0-SNAPSHOT/kylin-metrics-reporter-kafka-2.3.0-SNAPSHOT.pom
[JENKINS] Archiving <https://builds.apache.org/job/Kylin-Master-JDK-1.8/ws/core-dictionary/pom.xml>
to org.apache.kylin/kylin-core-dictionary/2.3.0-SNAPSHOT/kylin-core-dictionary-2.3.0-SNAPSHOT.pom
[JENKINS] Archiving <https://builds.apache.org/job/Kylin-Master-JDK-1.8/ws/core-storage/pom.xml>
to org.apache.kylin/kylin-core-storage/2.3.0-SNAPSHOT/kylin-core-storage-2.3.0-SNAPSHOT.pom
[JENKINS] Archiving <https://builds.apache.org/job/Kylin-Master-JDK-1.8/ws/server-base/pom.xml>
to org.apache.kylin/kylin-server-base/2.3.0-SNAPSHOT/kylin-server-base-2.3.0-SNAPSHOT.pom
[JENKINS] Archiving <https://builds.apache.org/job/Kylin-Master-JDK-1.8/ws/core-job/pom.xml>
to org.apache.kylin/kylin-core-job/2.3.0-SNAPSHOT/kylin-core-job-2.3.0-SNAPSHOT.pom
[JENKINS] Archiving <https://builds.apache.org/job/Kylin-Master-JDK-1.8/ws/tool/pom.xml>
to org.apache.kylin/kylin-tool/2.3.0-SNAPSHOT/kylin-tool-2.3.0-SNAPSHOT.pom
[JENKINS] Archiving <https://builds.apache.org/job/Kylin-Master-JDK-1.8/ws/tomcat-ext/pom.xml>
to org.apache.kylin/kylin-tomcat-ext/2.3.0-SNAPSHOT/kylin-tomcat-ext-2.3.0-SNAPSHOT.pom
[JENKINS] Archiving <https://builds.apache.org/job/Kylin-Master-JDK-1.8/ws/engine-spark/pom.xml>
to org.apache.kylin/kylin-engine-spark/2.3.0-SNAPSHOT/kylin-engine-spark-2.3.0-SNAPSHOT.pom
[JENKINS] Archiving <https://builds.apache.org/job/Kylin-Master-JDK-1.8/ws/assembly/pom.xml>
to org.apache.kylin/kylin-assembly/2.3.0-SNAPSHOT/kylin-assembly-2.3.0-SNAPSHOT.pom
[JENKINS] Archiving <https://builds.apache.org/job/Kylin-Master-JDK-1.8/ws/core-common/pom.xml>
to org.apache.kylin/kylin-core-common/2.3.0-SNAPSHOT/kylin-core-common-2.3.0-SNAPSHOT.pom
[JENKINS] Archiving <https://builds.apache.org/job/Kylin-Master-JDK-1.8/ws/source-kafka/pom.xml>
to org.apache.kylin/kylin-source-kafka/2.3.0-SNAPSHOT/kylin-source-kafka-2.3.0-SNAPSHOT.pom
[JENKINS] Archiving <https://builds.apache.org/job/Kylin-Master-JDK-1.8/ws/tool-assembly/pom.xml>
to org.apache.kylin/kylin-tool-assembly/2.3.0-SNAPSHOT/kylin-tool-assembly-2.3.0-SNAPSHOT.pom
[JENKINS] Archiving <https://builds.apache.org/job/Kylin-Master-JDK-1.8/ws/query/pom.xml>
to org.apache.kylin/kylin-query/2.3.0-SNAPSHOT/kylin-query-2.3.0-SNAPSHOT.pom
[JENKINS] Archiving <https://builds.apache.org/job/Kylin-Master-JDK-1.8/ws/kylin-it/pom.xml>
to org.apache.kylin/kylin-it/2.3.0-SNAPSHOT/kylin-it-2.3.0-SNAPSHOT.pom
[JENKINS] Archiving <https://builds.apache.org/job/Kylin-Master-JDK-1.8/ws/engine-mr/pom.xml>
to org.apache.kylin/kylin-engine-mr/2.3.0-SNAPSHOT/kylin-engine-mr-2.3.0-SNAPSHOT.pom
channel stopped
Not sending mail to unregistered user 100650920@qq.com
Not sending mail to unregistered user 245915794@qq.com
Not sending mail to unregistered user 550175214@qq.com
Not sending mail to unregistered user cheng.wang@kyligence.io
Not sending mail to unregistered user chunen.ni@kyligence.io
Not sending mail to unregistered user event.dimlas@gmail.com
Not sending mail to unregistered user github@alasdairhodge.co.uk
Not sending mail to unregistered user liuyiming.vip@gmail.com
Not sending mail to unregistered user ma@kyligence.io
Not sending mail to unregistered user rogershijicheng@gmail.com
Not sending mail to unregistered user sheng.zhang@kyligence.io
Not sending mail to unregistered user zjsynce@sjtu.org

Mime
View raw message