kylin-commits mailing list archives

Site index · List index
Message view « Date » · « Thread »
Top « Date » · « Thread »
From Apache Jenkins Server <jenk...@builds.apache.org>
Subject Build failed in Jenkins: Kylin-Master-JDK-1.8 #958
Date Mon, 08 Jan 2018 10:42:59 GMT
See <https://builds.apache.org/job/Kylin-Master-JDK-1.8/958/display/redirect>

------------------------------------------
[...truncated 38.71 KB...]
[INFO] 
[INFO] --- maven-dependency-plugin:2.10:copy (copy-jamm) @ kylin-jdbc ---
[INFO] Configured Artifact: com.github.jbellis:jamm:?:jar
[INFO] Copying jamm-0.3.1.jar to <https://builds.apache.org/job/Kylin-Master-JDK-1.8/ws/jdbc/target/test-classes/jamm.jar>
[INFO] 
[INFO] --- maven-resources-plugin:3.0.1:testResources (default-testResources) @ kylin-jdbc
---
[INFO] Using 'UTF-8' encoding to copy filtered resources.
[INFO] skip non existing resourceDirectory <https://builds.apache.org/job/Kylin-Master-JDK-1.8/ws/jdbc/src/test/resources>
[INFO] Copying 3 resources
[INFO] 
[INFO] --- maven-compiler-plugin:3.5.1:testCompile (default-testCompile) @ kylin-jdbc ---
[INFO] Changes detected - recompiling the module!
[INFO] Compiling 5 source files to <https://builds.apache.org/job/Kylin-Master-JDK-1.8/ws/jdbc/target/test-classes>
[INFO] 
[INFO] --- maven-surefire-plugin:2.19.1:test (default-test) @ kylin-jdbc ---
[INFO] Surefire report directory: <https://builds.apache.org/job/Kylin-Master-JDK-1.8/ws/jdbc/../target/surefire-reports>

-------------------------------------------------------
 T E S T S
-------------------------------------------------------
Java HotSpot(TM) 64-Bit Server VM warning: ignoring option MaxPermSize=512M; support was removed
in 8.0
Running org.apache.kylin.jdbc.SQLResonseStubTest
Tests run: 2, Failures: 0, Errors: 0, Skipped: 0, Time elapsed: 0.941 sec - in org.apache.kylin.jdbc.SQLResonseStubTest
Running org.apache.kylin.jdbc.DriverTest
2018-01-08 10:41:47,249 DEBUG [main] jdbc.KylinConnection:62 : Kylin base url test_url, project
name test_db
2018-01-08 10:41:47,418 DEBUG [main] jdbc.KylinConnection:62 : Kylin base url test_url, project
name test_db
2018-01-08 10:41:47,422 DEBUG [main] jdbc.KylinConnection:62 : Kylin base url test_url, project
name test_db
2018-01-08 10:41:47,426 DEBUG [main] jdbc.KylinConnection:62 : Kylin base url test_url, project
name test_db
Tests run: 7, Failures: 0, Errors: 0, Skipped: 2, Time elapsed: 0.738 sec - in org.apache.kylin.jdbc.DriverTest

Results :

Tests run: 9, Failures: 0, Errors: 0, Skipped: 2

[JENKINS] Recording test results
[INFO] 
[INFO] --- jacoco-maven-plugin:0.7.8:report (post-test) @ kylin-jdbc ---
[INFO] Skipping JaCoCo execution due to missing execution data file.
[PMD] No report found for mojo report
[INFO]                                                                         
[INFO] ------------------------------------------------------------------------
[INFO] Skipping Apache Kylin - Assembly
[INFO] This project has been banned from the build due to previous failures.
[INFO] ------------------------------------------------------------------------
[INFO]                                                                         
[INFO] ------------------------------------------------------------------------
[INFO] Skipping Apache Kylin - Tool
[INFO] This project has been banned from the build due to previous failures.
[INFO] ------------------------------------------------------------------------
[INFO]                                                                         
[INFO] ------------------------------------------------------------------------
[INFO] Skipping Apache Kylin - Tool Assembly
[INFO] This project has been banned from the build due to previous failures.
[INFO] ------------------------------------------------------------------------
[INFO]                                                                         
[INFO] ------------------------------------------------------------------------
[INFO] Skipping Apache Kylin - Integration Test
[INFO] This project has been banned from the build due to previous failures.
[INFO] ------------------------------------------------------------------------
[INFO]                                                                         
[INFO] ------------------------------------------------------------------------
[INFO] Building Apache Kylin - Tomcat Extension 2.3.0-SNAPSHOT
[INFO] ------------------------------------------------------------------------
[INFO] 
[INFO] --- maven-clean-plugin:2.5:clean (default-clean) @ kylin-tomcat-ext ---
[INFO] Deleting <https://builds.apache.org/job/Kylin-Master-JDK-1.8/ws/tomcat-ext/target>
[INFO] 
[INFO] --- maven-checkstyle-plugin:2.17:check (check-style) @ kylin-tomcat-ext ---
[INFO] Starting audit...
Audit done.
[CHECKSTYLE] Parsing file <https://builds.apache.org/job/Kylin-Master-JDK-1.8/ws/tomcat-ext/target/checkstyle-result.xml>
[CHECKSTYLE] Successfully parsed file <https://builds.apache.org/job/Kylin-Master-JDK-1.8/ws/tomcat-ext/target/checkstyle-result.xml>
of module Apache Kylin - Tomcat Extension with 0 unique warnings and 0 duplicates.
[CHECKSTYLE] Computing warning deltas based on reference build #957
[PMD] No report found for mojo check
[INFO] 
[INFO] --- jacoco-maven-plugin:0.7.8:prepare-agent (pre-test) @ kylin-tomcat-ext ---
[INFO] surefireArgLine set to -javaagent:/home/jenkins/jenkins-slave/maven-repositories/0/org/jacoco/org.jacoco.agent/0.7.8/org.jacoco.agent-0.7.8-runtime.jar=destfile=<https://builds.apache.org/job/Kylin-Master-JDK-1.8/ws/tomcat-ext/../target/jacoco.exec,append=true>
[INFO] 
[INFO] --- maven-remote-resources-plugin:1.5:process (default) @ kylin-tomcat-ext ---
[INFO] 
[INFO] --- maven-resources-plugin:3.0.1:resources (default-resources) @ kylin-tomcat-ext ---
[INFO] Using 'UTF-8' encoding to copy filtered resources.
[INFO] skip non existing resourceDirectory <https://builds.apache.org/job/Kylin-Master-JDK-1.8/ws/tomcat-ext/src/main/resources>
[INFO] Copying 3 resources
[INFO] 
[INFO] --- maven-compiler-plugin:3.5.1:compile (default-compile) @ kylin-tomcat-ext ---
[INFO] Changes detected - recompiling the module!
[INFO] Compiling 1 source file to <https://builds.apache.org/job/Kylin-Master-JDK-1.8/ws/tomcat-ext/target/classes>
[INFO] 
[INFO] --- maven-dependency-plugin:2.10:copy (copy-jamm) @ kylin-tomcat-ext ---
[INFO] Configured Artifact: com.github.jbellis:jamm:?:jar
[INFO] Copying jamm-0.3.1.jar to <https://builds.apache.org/job/Kylin-Master-JDK-1.8/ws/tomcat-ext/target/test-classes/jamm.jar>
[INFO] 
[INFO] --- maven-resources-plugin:3.0.1:testResources (default-testResources) @ kylin-tomcat-ext
---
[INFO] Using 'UTF-8' encoding to copy filtered resources.
[INFO] skip non existing resourceDirectory <https://builds.apache.org/job/Kylin-Master-JDK-1.8/ws/tomcat-ext/src/test/resources>
[INFO] Copying 3 resources
[INFO] 
[INFO] --- maven-compiler-plugin:3.5.1:testCompile (default-testCompile) @ kylin-tomcat-ext
---
[INFO] No sources to compile
[INFO] 
[INFO] --- maven-surefire-plugin:2.19.1:test (default-test) @ kylin-tomcat-ext ---
[JENKINS] Recording test results
[INFO] 
[INFO] --- jacoco-maven-plugin:0.7.8:report (post-test) @ kylin-tomcat-ext ---
[INFO] Skipping JaCoCo execution due to missing execution data file.
[PMD] No report found for mojo report
[INFO] ------------------------------------------------------------------------
[INFO] Reactor Summary:
[INFO] 
[INFO] Apache Kylin ....................................... SUCCESS [01:04 min]
[INFO] Apache Kylin - External ............................ SUCCESS [ 15.422 s]
[INFO] Apache Kylin - Calcite Overrides ................... SUCCESS [ 14.536 s]
[INFO] Apache Kylin - Core Common ......................... FAILURE [  2.431 s]
[INFO] Apache Kylin - Core Metadata ....................... SKIPPED
[INFO] Apache Kylin - Core Dictionary ..................... SKIPPED
[INFO] Apache Kylin - Core Cube ........................... SKIPPED
[INFO] Apache Kylin - Core Metrics ........................ SKIPPED
[INFO] Apache Kylin - Core Job ............................ SKIPPED
[INFO] Apache Kylin - Core Storage ........................ SKIPPED
[INFO] Apache Kylin - MapReduce Engine .................... SKIPPED
[INFO] Apache Kylin - HBase Storage ....................... SKIPPED
[INFO] Apache Kylin - Spark Engine ........................ SKIPPED
[INFO] Apache Kylin - Hive Source ......................... SKIPPED
[INFO] Apache Kylin - Kafka Source ........................ SKIPPED
[INFO] Apache Kylin - Query ............................... SKIPPED
[INFO] Apache Kylin - Metrics Reporter Hive ............... SKIPPED
[INFO] Apache Kylin - Metrics Reporter Kafka .............. SKIPPED
[INFO] Apache Kylin - REST Server Base .................... SKIPPED
[INFO] Apache Kylin - REST Server ......................... SKIPPED
[INFO] Apache Kylin - JDBC Driver ......................... SUCCESS [ 20.221 s]
[INFO] Apache Kylin - Assembly ............................ SKIPPED
[INFO] Apache Kylin - Tool ................................ SKIPPED
[INFO] Apache Kylin - Tool Assembly ....................... SKIPPED
[INFO] Apache Kylin - Integration Test .................... SKIPPED
[INFO] Apache Kylin - Tomcat Extension .................... SUCCESS [  6.521 s]
[INFO] ------------------------------------------------------------------------
[INFO] BUILD FAILURE
[INFO] ------------------------------------------------------------------------
[INFO] Total time: 02:30 min
[INFO] Finished at: 2018-01-08T10:42:24+00:00
[INFO] Final Memory: 52M/689M
[INFO] ------------------------------------------------------------------------
[ERROR] Failed to execute goal on project kylin-core-common: Could not resolve dependencies
for project org.apache.kylin:kylin-core-common:jar:2.3.0-SNAPSHOT: Could not find artifact
org.apache.kylin:kylin-external-htrace:jar:2.3.0-SNAPSHOT in conjars (http://conjars.org/repo/)
-> [Help 1]
org.apache.maven.lifecycle.LifecycleExecutionException: Failed to execute goal on project
kylin-core-common: Could not resolve dependencies for project org.apache.kylin:kylin-core-common:jar:2.3.0-SNAPSHOT:
Could not find artifact org.apache.kylin:kylin-external-htrace:jar:2.3.0-SNAPSHOT in conjars
(http://conjars.org/repo/)
	at org.apache.maven.lifecycle.internal.LifecycleDependencyResolver.getDependencies(LifecycleDependencyResolver.java:220)
	at org.apache.maven.lifecycle.internal.LifecycleDependencyResolver.resolveProjectDependencies(LifecycleDependencyResolver.java:127)
	at org.apache.maven.lifecycle.internal.MojoExecutor.ensureDependenciesAreResolved(MojoExecutor.java:257)
	at org.apache.maven.lifecycle.internal.MojoExecutor.execute(MojoExecutor.java:200)
	at org.apache.maven.lifecycle.internal.MojoExecutor.execute(MojoExecutor.java:153)
	at org.apache.maven.lifecycle.internal.MojoExecutor.execute(MojoExecutor.java:145)
	at org.apache.maven.lifecycle.internal.LifecycleModuleBuilder.buildProject(LifecycleModuleBuilder.java:116)
	at org.apache.maven.lifecycle.internal.LifecycleModuleBuilder.buildProject(LifecycleModuleBuilder.java:80)
	at org.apache.maven.lifecycle.internal.builder.singlethreaded.SingleThreadedBuilder.build(SingleThreadedBuilder.java:51)
	at org.apache.maven.lifecycle.internal.LifecycleStarter.execute(LifecycleStarter.java:120)
	at org.apache.maven.DefaultMaven.doExecute(DefaultMaven.java:355)
	at org.apache.maven.DefaultMaven.execute(DefaultMaven.java:155)
	at org.jvnet.hudson.maven3.launcher.Maven32Launcher.main(Maven32Launcher.java:132)
	at sun.reflect.NativeMethodAccessorImpl.invoke0(Native Method)
	at sun.reflect.NativeMethodAccessorImpl.invoke(NativeMethodAccessorImpl.java:62)
	at sun.reflect.DelegatingMethodAccessorImpl.invoke(DelegatingMethodAccessorImpl.java:43)
	at java.lang.reflect.Method.invoke(Method.java:498)
	at org.codehaus.plexus.classworlds.launcher.Launcher.launchStandard(Launcher.java:330)
	at org.codehaus.plexus.classworlds.launcher.Launcher.launch(Launcher.java:238)
	at jenkins.maven3.agent.Maven32Main.launch(Maven32Main.java:186)
	at sun.reflect.NativeMethodAccessorImpl.invoke0(Native Method)
	at sun.reflect.NativeMethodAccessorImpl.invoke(NativeMethodAccessorImpl.java:62)
	at sun.reflect.DelegatingMethodAccessorImpl.invoke(DelegatingMethodAccessorImpl.java:43)
	at java.lang.reflect.Method.invoke(Method.java:498)
	at hudson.maven.Maven3Builder.call(Maven3Builder.java:139)
	at hudson.maven.Maven3Builder.call(Maven3Builder.java:70)
	at hudson.remoting.UserRequest.perform(UserRequest.java:207)
	at hudson.remoting.UserRequest.perform(UserRequest.java:53)
	at hudson.remoting.Request$2.run(Request.java:358)
	at hudson.remoting.InterceptingExecutorService$1.call(InterceptingExecutorService.java:72)
	at java.util.concurrent.FutureTask.run(FutureTask.java:266)
	at java.util.concurrent.ThreadPoolExecutor.runWorker(ThreadPoolExecutor.java:1149)
	at java.util.concurrent.ThreadPoolExecutor$Worker.run(ThreadPoolExecutor.java:624)
	at java.lang.Thread.run(Thread.java:748)
Caused by: org.apache.maven.project.DependencyResolutionException: Could not resolve dependencies
for project org.apache.kylin:kylin-core-common:jar:2.3.0-SNAPSHOT: Could not find artifact
org.apache.kylin:kylin-external-htrace:jar:2.3.0-SNAPSHOT in conjars (http://conjars.org/repo/)
	at org.apache.maven.project.DefaultProjectDependenciesResolver.resolve(DefaultProjectDependenciesResolver.java:211)
	at org.apache.maven.lifecycle.internal.LifecycleDependencyResolver.getDependencies(LifecycleDependencyResolver.java:195)
	... 33 more
Caused by: org.eclipse.aether.resolution.DependencyResolutionException: Could not find artifact
org.apache.kylin:kylin-external-htrace:jar:2.3.0-SNAPSHOT in conjars (http://conjars.org/repo/)
	at org.eclipse.aether.internal.impl.DefaultRepositorySystem.resolveDependencies(DefaultRepositorySystem.java:384)
	at org.apache.maven.project.DefaultProjectDependenciesResolver.resolve(DefaultProjectDependenciesResolver.java:205)
	... 34 more
Caused by: org.eclipse.aether.resolution.ArtifactResolutionException: Could not find artifact
org.apache.kylin:kylin-external-htrace:jar:2.3.0-SNAPSHOT in conjars (http://conjars.org/repo/)
	at org.eclipse.aether.internal.impl.DefaultArtifactResolver.resolve(DefaultArtifactResolver.java:444)
	at org.eclipse.aether.internal.impl.DefaultArtifactResolver.resolveArtifacts(DefaultArtifactResolver.java:246)
	at org.eclipse.aether.internal.impl.DefaultRepositorySystem.resolveDependencies(DefaultRepositorySystem.java:367)
	... 35 more
Caused by: org.eclipse.aether.transfer.ArtifactNotFoundException: Could not find artifact
org.apache.kylin:kylin-external-htrace:jar:2.3.0-SNAPSHOT in conjars (http://conjars.org/repo/)
	at org.eclipse.aether.connector.basic.ArtifactTransportListener.transferFailed(ArtifactTransportListener.java:39)
	at org.eclipse.aether.connector.basic.BasicRepositoryConnector$TaskRunner.run(BasicRepositoryConnector.java:355)
	at org.eclipse.aether.util.concurrency.RunnableErrorForwarder$1.run(RunnableErrorForwarder.java:67)
	at org.eclipse.aether.connector.basic.BasicRepositoryConnector$DirectExecutor.execute(BasicRepositoryConnector.java:581)
	at org.eclipse.aether.connector.basic.BasicRepositoryConnector.get(BasicRepositoryConnector.java:249)
	at org.eclipse.aether.internal.impl.DefaultArtifactResolver.performDownloads(DefaultArtifactResolver.java:520)
	at org.eclipse.aether.internal.impl.DefaultArtifactResolver.resolve(DefaultArtifactResolver.java:421)
	... 37 more
[ERROR] 
[ERROR] Re-run Maven using the -X switch to enable full debug logging.
[ERROR] 
[ERROR] For more information about the errors and possible solutions, please read the following
articles:
[ERROR] [Help 1] http://cwiki.apache.org/confluence/display/MAVEN/DependencyResolutionException
[ERROR] 
[ERROR] After correcting the problems, you can resume the build with the command
[ERROR]   mvn <goals> -rf :kylin-core-common
[JENKINS] Archiving <https://builds.apache.org/job/Kylin-Master-JDK-1.8/ws/server/pom.xml>
to org.apache.kylin/kylin-server/2.3.0-SNAPSHOT/kylin-server-2.3.0-SNAPSHOT.pom
[JENKINS] Archiving <https://builds.apache.org/job/Kylin-Master-JDK-1.8/ws/jdbc/pom.xml>
to org.apache.kylin/kylin-jdbc/2.3.0-SNAPSHOT/kylin-jdbc-2.3.0-SNAPSHOT.pom
[JENKINS] Archiving <https://builds.apache.org/job/Kylin-Master-JDK-1.8/ws/core-metadata/pom.xml>
to org.apache.kylin/kylin-core-metadata/2.3.0-SNAPSHOT/kylin-core-metadata-2.3.0-SNAPSHOT.pom
[JENKINS] Archiving <https://builds.apache.org/job/Kylin-Master-JDK-1.8/ws/storage-hbase/pom.xml>
to org.apache.kylin/kylin-storage-hbase/2.3.0-SNAPSHOT/kylin-storage-hbase-2.3.0-SNAPSHOT.pom
[JENKINS] Archiving <https://builds.apache.org/job/Kylin-Master-JDK-1.8/ws/source-hive/pom.xml>
to org.apache.kylin/kylin-source-hive/2.3.0-SNAPSHOT/kylin-source-hive-2.3.0-SNAPSHOT.pom
[JENKINS] Archiving <https://builds.apache.org/job/Kylin-Master-JDK-1.8/ws/external/pom.xml>
to org.apache.kylin/kylin-external/2.3.0-SNAPSHOT/kylin-external-2.3.0-SNAPSHOT.pom
[JENKINS] Archiving <https://builds.apache.org/job/Kylin-Master-JDK-1.8/ws/atopcalcite/pom.xml>
to org.apache.kylin/atopcalcite/2.3.0-SNAPSHOT/atopcalcite-2.3.0-SNAPSHOT.pom
[JENKINS] Archiving <https://builds.apache.org/job/Kylin-Master-JDK-1.8/ws/pom.xml>
to org.apache.kylin/kylin/2.3.0-SNAPSHOT/kylin-2.3.0-SNAPSHOT.pom
[Fast Archiver] Compressed 69.43 KB of artifacts by 92.2% relative to #957
[JENKINS] Archiving <https://builds.apache.org/job/Kylin-Master-JDK-1.8/ws/metrics-reporter-hive/pom.xml>
to org.apache.kylin/kylin-metrics-reporter-hive/2.3.0-SNAPSHOT/kylin-metrics-reporter-hive-2.3.0-SNAPSHOT.pom
[JENKINS] Archiving <https://builds.apache.org/job/Kylin-Master-JDK-1.8/ws/core-metrics/pom.xml>
to org.apache.kylin/kylin-core-metrics/2.3.0-SNAPSHOT/kylin-core-metrics-2.3.0-SNAPSHOT.pom
[JENKINS] Archiving <https://builds.apache.org/job/Kylin-Master-JDK-1.8/ws/core-cube/pom.xml>
to org.apache.kylin/kylin-core-cube/2.3.0-SNAPSHOT/kylin-core-cube-2.3.0-SNAPSHOT.pom
[JENKINS] Archiving <https://builds.apache.org/job/Kylin-Master-JDK-1.8/ws/metrics-reporter-kafka/pom.xml>
to org.apache.kylin/kylin-metrics-reporter-kafka/2.3.0-SNAPSHOT/kylin-metrics-reporter-kafka-2.3.0-SNAPSHOT.pom
[JENKINS] Archiving <https://builds.apache.org/job/Kylin-Master-JDK-1.8/ws/core-dictionary/pom.xml>
to org.apache.kylin/kylin-core-dictionary/2.3.0-SNAPSHOT/kylin-core-dictionary-2.3.0-SNAPSHOT.pom
[JENKINS] Archiving <https://builds.apache.org/job/Kylin-Master-JDK-1.8/ws/core-storage/pom.xml>
to org.apache.kylin/kylin-core-storage/2.3.0-SNAPSHOT/kylin-core-storage-2.3.0-SNAPSHOT.pom
[JENKINS] Archiving <https://builds.apache.org/job/Kylin-Master-JDK-1.8/ws/server-base/pom.xml>
to org.apache.kylin/kylin-server-base/2.3.0-SNAPSHOT/kylin-server-base-2.3.0-SNAPSHOT.pom
[JENKINS] Archiving <https://builds.apache.org/job/Kylin-Master-JDK-1.8/ws/core-job/pom.xml>
to org.apache.kylin/kylin-core-job/2.3.0-SNAPSHOT/kylin-core-job-2.3.0-SNAPSHOT.pom
[JENKINS] Archiving <https://builds.apache.org/job/Kylin-Master-JDK-1.8/ws/tool/pom.xml>
to org.apache.kylin/kylin-tool/2.3.0-SNAPSHOT/kylin-tool-2.3.0-SNAPSHOT.pom
[JENKINS] Archiving <https://builds.apache.org/job/Kylin-Master-JDK-1.8/ws/tomcat-ext/pom.xml>
to org.apache.kylin/kylin-tomcat-ext/2.3.0-SNAPSHOT/kylin-tomcat-ext-2.3.0-SNAPSHOT.pom
[JENKINS] Archiving <https://builds.apache.org/job/Kylin-Master-JDK-1.8/ws/engine-spark/pom.xml>
to org.apache.kylin/kylin-engine-spark/2.3.0-SNAPSHOT/kylin-engine-spark-2.3.0-SNAPSHOT.pom
[JENKINS] Archiving <https://builds.apache.org/job/Kylin-Master-JDK-1.8/ws/assembly/pom.xml>
to org.apache.kylin/kylin-assembly/2.3.0-SNAPSHOT/kylin-assembly-2.3.0-SNAPSHOT.pom
[JENKINS] Archiving <https://builds.apache.org/job/Kylin-Master-JDK-1.8/ws/core-common/pom.xml>
to org.apache.kylin/kylin-core-common/2.3.0-SNAPSHOT/kylin-core-common-2.3.0-SNAPSHOT.pom
[JENKINS] Archiving <https://builds.apache.org/job/Kylin-Master-JDK-1.8/ws/source-kafka/pom.xml>
to org.apache.kylin/kylin-source-kafka/2.3.0-SNAPSHOT/kylin-source-kafka-2.3.0-SNAPSHOT.pom
[JENKINS] Archiving <https://builds.apache.org/job/Kylin-Master-JDK-1.8/ws/tool-assembly/pom.xml>
to org.apache.kylin/kylin-tool-assembly/2.3.0-SNAPSHOT/kylin-tool-assembly-2.3.0-SNAPSHOT.pom
[JENKINS] Archiving <https://builds.apache.org/job/Kylin-Master-JDK-1.8/ws/query/pom.xml>
to org.apache.kylin/kylin-query/2.3.0-SNAPSHOT/kylin-query-2.3.0-SNAPSHOT.pom
[JENKINS] Archiving <https://builds.apache.org/job/Kylin-Master-JDK-1.8/ws/kylin-it/pom.xml>
to org.apache.kylin/kylin-it/2.3.0-SNAPSHOT/kylin-it-2.3.0-SNAPSHOT.pom
[JENKINS] Archiving <https://builds.apache.org/job/Kylin-Master-JDK-1.8/ws/engine-mr/pom.xml>
to org.apache.kylin/kylin-engine-mr/2.3.0-SNAPSHOT/kylin-engine-mr-2.3.0-SNAPSHOT.pom
channel stopped
Not sending mail to unregistered user 100650920@qq.com
Not sending mail to unregistered user 245915794@qq.com
Not sending mail to unregistered user 550175214@qq.com
Not sending mail to unregistered user cheng.wang@kyligence.io
Not sending mail to unregistered user chunen.ni@kyligence.io
Not sending mail to unregistered user event.dimlas@gmail.com
Not sending mail to unregistered user github@alasdairhodge.co.uk
Not sending mail to unregistered user liuyiming.vip@gmail.com
Not sending mail to unregistered user ma@kyligence.io
Not sending mail to unregistered user rogershijicheng@gmail.com
Not sending mail to unregistered user sheng.zhang@kyligence.io
Not sending mail to unregistered user zjsynce@sjtu.org

Mime
View raw message