kylin-commits mailing list archives

Site index · List index
Message view « Date » · « Thread »
Top « Date » · « Thread »
From Apache Jenkins Server <jenk...@builds.apache.org>
Subject Build failed in Jenkins: Kylin-Master-JDK-1.8 #819
Date Sun, 05 Nov 2017 08:51:58 GMT
See <https://builds.apache.org/job/Kylin-Master-JDK-1.8/819/display/redirect?page=changes>

Changes:

[shaofengshi] KYLIN-3008 add submit-patch.py

------------------------------------------
[...truncated 2.14 MB...]
2017-11-05 08:34:19,772 INFO  [main] common.KylinConfig:109 : Destroy KylinConfig
2017-11-05 08:34:19,804 INFO  [main] common.KylinConfig:315 : Loading kylin-defaults.properties
from /home/jenkins/jenkins-slave/workspace/Kylin-Master-JDK-1.8/core-common/target/classes/kylin-defaults.properties
2017-11-05 08:34:19,808 INFO  [main] common.KylinConfig:270 : Use KYLIN_CONF=../examples/test_metadata/
2017-11-05 08:34:19,809 INFO  [main] common.KylinConfig:95 : Initialized a new KylinConfig
from getInstanceFromEnv : 471110969
2017-11-05 08:34:19,809 INFO  [main] common.KylinConfigBase:162 : Kylin Config was updated
with kylin.metadata.url : ../examples/test_metadata/
2017-11-05 08:34:19,809 INFO  [main] common.KylinConfigBase:162 : Kylin Config was updated
with kylin.env.hdfs-working-dir : file:///tmp/kylin
2017-11-05 08:34:19,810 INFO  [main] hybrid.HybridManager:90 : Initializing HybridManager
with config ../examples/test_metadata/
2017-11-05 08:34:19,810 INFO  [main] persistence.ResourceStore:79 : Using metadata url ../examples/test_metadata/
for resource store
2017-11-05 08:34:19,810 DEBUG [main] hybrid.HybridManager:142 : Loading Hybrid from folder
/home/jenkins/jenkins-slave/workspace/Kylin-Master-JDK-1.8/tool/../examples/test_metadata/hybrid
2017-11-05 08:34:19,811 DEBUG [main] hybrid.HybridManager:148 : Loaded 2 Hybrid(s)
2017-11-05 08:34:19,811 DEBUG [main] cachesync.Broadcaster:122 : 1 nodes in the cluster: [localhost:7070]
2017-11-05 08:34:19,812 INFO  [main] cube.CubeManager:139 : Initializing CubeManager with
config ../examples/test_metadata/
2017-11-05 08:34:19,813 INFO  [main] cube.CubeManager:745 : Loading Cube from folder /home/jenkins/jenkins-slave/workspace/Kylin-Master-JDK-1.8/tool/../examples/test_metadata/cube
2017-11-05 08:34:19,813 INFO  [main] cube.CubeDescManager:104 : Initializing CubeDescManager
with config ../examples/test_metadata/
2017-11-05 08:34:19,813 INFO  [main] cube.CubeDescManager:306 : Reloading Cube Metadata from
folder /home/jenkins/jenkins-slave/workspace/Kylin-Master-JDK-1.8/tool/../examples/test_metadata/cube_desc
2017-11-05 08:34:19,815 INFO  [main] project.ProjectManager:97 : Initializing ProjectManager
with metadata url ../examples/test_metadata/
2017-11-05 08:34:19,815 DEBUG [main] project.ProjectManager:138 : Loading Project from folder
/home/jenkins/jenkins-slave/workspace/Kylin-Master-JDK-1.8/tool/../examples/test_metadata/project
2017-11-05 08:34:19,815 DEBUG [main] project.ProjectManager:144 : Loaded 1 Project(s)
2017-11-05 08:34:19,816 DEBUG [main] metadata.TableMetadataManager:448 : Reloading SourceTable
from folder /home/jenkins/jenkins-slave/workspace/Kylin-Master-JDK-1.8/tool/../examples/test_metadata/table
2017-11-05 08:34:19,823 DEBUG [main] metadata.TableMetadataManager:459 : Loaded 17 SourceTable(s)
2017-11-05 08:34:19,824 DEBUG [main] metadata.TableMetadataManager:360 : Reloading Table_exd
info from folder /home/jenkins/jenkins-slave/workspace/Kylin-Master-JDK-1.8/tool/../examples/test_metadata/table_exd
2017-11-05 08:34:19,824 DEBUG [main] metadata.TableMetadataManager:371 : Loaded 0 SourceTable
EXD(s)
2017-11-05 08:34:19,824 DEBUG [main] metadata.TableMetadataManager:432 : Reloading ExternalFilter
from folder /home/jenkins/jenkins-slave/workspace/Kylin-Master-JDK-1.8/tool/../examples/test_metadata/ext_filter
2017-11-05 08:34:19,825 DEBUG [main] metadata.TableMetadataManager:443 : Loaded 1 ExternalFilter(s)
2017-11-05 08:34:19,826 WARN  [main] metadata.TableMetadataManager:87 : More than one singleton
exist, current keys: 1999036805,1214357269,471110969
2017-11-05 08:34:19,826 DEBUG [main] model.DataModelManager:223 : Reloading DataModel from
folder /home/jenkins/jenkins-slave/workspace/Kylin-Master-JDK-1.8/tool/../examples/test_metadata/model_desc
2017-11-05 08:34:19,827 INFO  [main] model.DataModelManager:233 : Reloading data model at
/model_desc/ci_inner_join_model.json
2017-11-05 08:34:19,832 WARN  [main] model.DataModelDesc:541 : PK TableRef[SELLER_ACCOUNT:TEST_ACCOUNT].ACCOUNT_ID.bigint
are not consistent with FK TableRef[TEST_KYLIN_FACT].SELLER_ID.integer
2017-11-05 08:34:19,833 INFO  [main] model.DataModelManager:233 : Reloading data model at
/model_desc/ci_left_join_model.json
2017-11-05 08:34:19,834 WARN  [main] model.DataModelDesc:541 : PK TableRef[SELLER_ACCOUNT:TEST_ACCOUNT].ACCOUNT_ID.bigint
are not consistent with FK TableRef[TEST_KYLIN_FACT].SELLER_ID.integer
2017-11-05 08:34:19,836 INFO  [main] model.DataModelManager:233 : Reloading data model at
/model_desc/fifty_dim.json
2017-11-05 08:34:19,837 INFO  [main] model.DataModelManager:233 : Reloading data model at
/model_desc/ssb.json
2017-11-05 08:34:19,838 INFO  [main] model.DataModelManager:233 : Reloading data model at
/model_desc/test_kylin_inner_join_model_desc.json
2017-11-05 08:34:19,839 INFO  [main] model.DataModelManager:233 : Reloading data model at
/model_desc/test_kylin_left_join_model_desc.json
2017-11-05 08:34:19,839 INFO  [main] model.DataModelManager:233 : Reloading data model at
/model_desc/test_streaming_table_model_desc.json
2017-11-05 08:34:19,840 INFO  [main] model.DataModelManager:233 : Reloading data model at
/model_desc/twenty_dim.json
2017-11-05 08:34:19,840 INFO  [main] model.DataModelManager:233 : Reloading data model at
/model_desc/ut_large_dimension_number.json
2017-11-05 08:34:19,841 DEBUG [main] model.DataModelManager:241 : Loaded 9 DataModel(s)
2017-11-05 08:34:19,841 WARN  [main] model.DataModelManager:74 : More than one singleton exist,
current keys: 1999036805,1214357269,471110969
2017-11-05 08:34:20,442 INFO  [main] cube.CubeDescManager:335 : Loaded 13 Cube(s)
2017-11-05 08:34:20,442 INFO  [main] cube.CubeManager:797 : Reloaded cube ci_inner_join_cube
being CUBE[name=ci_inner_join_cube] having 0 segments
2017-11-05 08:34:20,443 INFO  [main] cube.CubeManager:797 : Reloaded cube ci_left_join_cube
being CUBE[name=ci_left_join_cube] having 0 segments
2017-11-05 08:34:20,443 INFO  [main] cube.CubeManager:797 : Reloaded cube ssb being CUBE[name=ssb]
having 0 segments
2017-11-05 08:34:20,444 INFO  [main] cube.CubeManager:797 : Reloaded cube ssb_cube1 being
CUBE[name=ssb_cube1] having 0 segments
2017-11-05 08:34:20,444 INFO  [main] cube.CubeManager:797 : Reloaded cube ssb_cube2 being
CUBE[name=ssb_cube2] having 0 segments
2017-11-05 08:34:20,445 INFO  [main] cube.CubeManager:797 : Reloaded cube ssb_cube3 being
CUBE[name=ssb_cube3] having 0 segments
2017-11-05 08:34:20,445 INFO  [main] cube.CubeManager:797 : Reloaded cube test_kylin_cube_with_slr_1_new_segment
being CUBE[name=test_kylin_cube_with_slr_1_new_segment] having 1 segments
2017-11-05 08:34:20,446 INFO  [main] cube.CubeManager:797 : Reloaded cube test_kylin_cube_with_slr_empty
being CUBE[name=test_kylin_cube_with_slr_empty] having 0 segments
2017-11-05 08:34:20,446 INFO  [main] cube.CubeManager:797 : Reloaded cube test_kylin_cube_with_slr_left_join_empty
being CUBE[name=test_kylin_cube_with_slr_left_join_empty] having 0 segments
2017-11-05 08:34:20,447 INFO  [main] cube.CubeManager:797 : Reloaded cube test_kylin_cube_with_slr_left_join_ready
being CUBE[name=test_kylin_cube_with_slr_left_join_ready] having 1 segments
2017-11-05 08:34:20,448 INFO  [main] cube.CubeManager:797 : Reloaded cube test_kylin_cube_with_slr_ready
being CUBE[name=test_kylin_cube_with_slr_ready] having 1 segments
2017-11-05 08:34:20,448 INFO  [main] cube.CubeManager:797 : Reloaded cube test_kylin_cube_with_slr_ready_2_segments
being CUBE[name=test_kylin_cube_with_slr_ready_2_segments] having 2 segments
2017-11-05 08:34:20,449 INFO  [main] cube.CubeManager:797 : Reloaded cube test_kylin_cube_with_slr_ready_3_segments
being CUBE[name=test_kylin_cube_with_slr_ready_3_segments] having 3 segments
2017-11-05 08:34:20,450 INFO  [main] cube.CubeManager:797 : Reloaded cube test_kylin_cube_without_slr_empty
being CUBE[name=test_kylin_cube_without_slr_empty] having 0 segments
2017-11-05 08:34:20,453 INFO  [main] cube.CubeManager:797 : Reloaded cube test_kylin_cube_without_slr_left_join_empty
being CUBE[name=test_kylin_cube_without_slr_left_join_empty] having 0 segments
2017-11-05 08:34:20,453 INFO  [main] cube.CubeManager:797 : Reloaded cube test_kylin_cube_without_slr_left_join_ready
being CUBE[name=test_kylin_cube_without_slr_left_join_ready] having 1 segments
2017-11-05 08:34:20,454 INFO  [main] cube.CubeManager:797 : Reloaded cube test_kylin_cube_without_slr_left_join_ready_2_segments
being CUBE[name=test_kylin_cube_without_slr_left_join_ready_2_segments] having 2 segments
2017-11-05 08:34:20,455 INFO  [main] cube.CubeManager:797 : Reloaded cube test_kylin_cube_without_slr_ready
being CUBE[name=test_kylin_cube_without_slr_ready] having 1 segments
2017-11-05 08:34:20,460 INFO  [main] cube.CubeManager:797 : Reloaded cube test_streaming_table_cube
being CUBE[name=test_streaming_table_cube] having 0 segments
2017-11-05 08:34:20,460 INFO  [main] cube.CubeManager:758 : Loaded 19 cubes, fail on 0 cubes
Abstract Application args:-name ssb_hybrid -project default -model ssb -cubes ssb_cube1,ssb_cube2
-action create
2017-11-05 08:34:20,464 DEBUG [pool-5-thread-1] cachesync.Broadcaster:141 : Servers in the
cluster: [localhost:7070]
2017-11-05 08:34:20,464 INFO  [main] job.HybridCubeCLI:161 : HybridInstance was created at:
/hybrid/ssb_hybrid.json
Abstract Application args:-name ssb_hybrid -project default -model ssb -action delete
2017-11-05 08:34:20,467 DEBUG [pool-5-thread-1] cachesync.Broadcaster:148 : Announcing new
broadcast event: BroadcastEvent{entity=project, event=update, cacheKey=default}
2017-11-05 08:34:20,471 DEBUG [main] hybrid.HybridManager:142 : Loading Hybrid from folder
/home/jenkins/jenkins-slave/workspace/Kylin-Master-JDK-1.8/tool/../examples/test_metadata/hybrid
2017-11-05 08:34:20,472 DEBUG [main] hybrid.HybridManager:148 : Loaded 2 Hybrid(s)
2017-11-05 08:34:20,472 INFO  [main] job.HybridCubeCLI:178 : HybridInstance was deleted at:
/hybrid/ssb_hybrid.json
2017-11-05 08:34:20,477 DEBUG [pool-5-thread-1] cachesync.Broadcaster:141 : Servers in the
cluster: [localhost:7070]
2017-11-05 08:34:20,477 DEBUG [pool-5-thread-1] cachesync.Broadcaster:148 : Announcing new
broadcast event: BroadcastEvent{entity=project, event=update, cacheKey=default}
2017-11-05 08:34:20,481 WARN  [pool-6-thread-1] cachesync.Broadcaster:157 : Thread failed
during wipe cache at BroadcastEvent{entity=project, event=update, cacheKey=default}, error
msg: org.apache.http.conn.HttpHostConnectException: Connection to http://localhost:7070 refused
2017-11-05 08:34:20,481 DEBUG [pool-5-thread-1] cachesync.Broadcaster:141 : Servers in the
cluster: [localhost:7070]
2017-11-05 08:34:20,481 DEBUG [pool-5-thread-1] cachesync.Broadcaster:148 : Announcing new
broadcast event: BroadcastEvent{entity=project, event=update, cacheKey=default}
2017-11-05 08:34:20,482 WARN  [pool-6-thread-1] cachesync.Broadcaster:157 : Thread failed
during wipe cache at BroadcastEvent{entity=project, event=update, cacheKey=default}, error
msg: org.apache.http.conn.HttpHostConnectException: Connection to http://localhost:7070 refused
2017-11-05 08:34:20,482 DEBUG [pool-5-thread-1] cachesync.Broadcaster:141 : Servers in the
cluster: [localhost:7070]
2017-11-05 08:34:20,483 DEBUG [pool-5-thread-1] cachesync.Broadcaster:148 : Announcing new
broadcast event: BroadcastEvent{entity=project, event=update, cacheKey=default}
2017-11-05 08:34:20,484 WARN  [pool-6-thread-1] cachesync.Broadcaster:157 : Thread failed
during wipe cache at BroadcastEvent{entity=project, event=update, cacheKey=default}, error
msg: org.apache.http.conn.HttpHostConnectException: Connection to http://localhost:7070 refused
2017-11-05 08:34:20,486 DEBUG [pool-5-thread-1] cachesync.Broadcaster:141 : Servers in the
cluster: [localhost:7070]
2017-11-05 08:34:20,486 DEBUG [pool-5-thread-1] cachesync.Broadcaster:148 : Announcing new
broadcast event: BroadcastEvent{entity=project, event=update, cacheKey=default}
2017-11-05 08:34:20,487 WARN  [pool-6-thread-1] cachesync.Broadcaster:157 : Thread failed
during wipe cache at BroadcastEvent{entity=project, event=update, cacheKey=default}, error
msg: org.apache.http.conn.HttpHostConnectException: Connection to http://localhost:7070 refused
2017-11-05 08:34:20,487 DEBUG [pool-5-thread-1] cachesync.Broadcaster:141 : Servers in the
cluster: [localhost:7070]
2017-11-05 08:34:20,488 DEBUG [pool-5-thread-1] cachesync.Broadcaster:148 : Announcing new
broadcast event: BroadcastEvent{entity=project, event=update, cacheKey=default}
2017-11-05 08:34:20,489 WARN  [pool-6-thread-1] cachesync.Broadcaster:157 : Thread failed
during wipe cache at BroadcastEvent{entity=project, event=update, cacheKey=default}, error
msg: org.apache.http.conn.HttpHostConnectException: Connection to http://localhost:7070 refused
2017-11-05 08:34:20,491 INFO  [main] common.KylinConfig:109 : Destroy KylinConfig
2017-11-05 08:34:20,491 INFO  [pool-5-thread-1] cachesync.Broadcaster:136 : broadcastEvent
retry up to limit times, broadcastEvent:BroadcastEvent{entity=project, event=update, cacheKey=default}
Tests run: 3, Failures: 0, Errors: 0, Skipped: 0, Time elapsed: 5.56 sec - in org.apache.kylin.tool.HybridCubeCLITest
Running org.apache.kylin.tool.CubeMetaIngesterTest
2017-11-05 08:34:20,492 WARN  [pool-6-thread-1] cachesync.Broadcaster:157 : Thread failed
during wipe cache at BroadcastEvent{entity=project, event=update, cacheKey=default}, error
msg: org.apache.http.conn.HttpHostConnectException: Connection to http://localhost:7070 refused
2017-11-05 08:34:20,495 INFO  [pool-5-thread-1] cachesync.Broadcaster:136 : broadcastEvent
retry up to limit times, broadcastEvent:BroadcastEvent{entity=project, event=update, cacheKey=default}
Tests run: 1, Failures: 0, Errors: 0, Skipped: 1, Time elapsed: 0.003 sec - in org.apache.kylin.tool.CubeMetaIngesterTest
Running org.apache.kylin.tool.metrics.systemcube.SCCreatorTest
2017-11-05 08:34:20,504 INFO  [main] common.KylinConfig:109 : Destroy KylinConfig
2017-11-05 08:34:20,692 INFO  [main] common.KylinConfig:315 : Loading kylin-defaults.properties
from /home/jenkins/jenkins-slave/workspace/Kylin-Master-JDK-1.8/core-common/target/classes/kylin-defaults.properties
2017-11-05 08:34:20,699 INFO  [main] common.KylinConfig:270 : Use KYLIN_CONF=../examples/test_metadata/
2017-11-05 08:34:20,701 INFO  [main] common.KylinConfig:95 : Initialized a new KylinConfig
from getInstanceFromEnv : 1338926429
2017-11-05 08:34:20,706 INFO  [main] common.KylinConfigBase:162 : Kylin Config was updated
with kylin.metadata.url : ../examples/test_metadata/
2017-11-05 08:34:20,706 INFO  [main] common.KylinConfigBase:162 : Kylin Config was updated
with kylin.env.hdfs-working-dir : file:///tmp/kylin
2017-11-05 08:34:20,927 INFO  [main] common.KylinConfigBase:162 : Kylin Config was updated
with kylin.metadata.url : /tmp/org.apache.kylin.tool.metrics.systemcube.SCCreatorTest6529340943691446095system/meta
2017-11-05 08:34:20,927 INFO  [main] cube.CubeManager:139 : Initializing CubeManager with
config /tmp/org.apache.kylin.tool.metrics.systemcube.SCCreatorTest6529340943691446095system/meta
2017-11-05 08:34:20,928 INFO  [main] persistence.ResourceStore:79 : Using metadata url /tmp/org.apache.kylin.tool.metrics.systemcube.SCCreatorTest6529340943691446095system/meta
for resource store
2017-11-05 08:34:20,931 INFO  [main] cube.CubeManager:745 : Loading Cube from folder /tmp/org.apache.kylin.tool.metrics.systemcube.SCCreatorTest6529340943691446095system/meta/cube
2017-11-05 08:34:20,932 INFO  [main] cube.CubeDescManager:104 : Initializing CubeDescManager
with config /tmp/org.apache.kylin.tool.metrics.systemcube.SCCreatorTest6529340943691446095system/meta
2017-11-05 08:34:20,933 INFO  [main] cube.CubeDescManager:306 : Reloading Cube Metadata from
folder /tmp/org.apache.kylin.tool.metrics.systemcube.SCCreatorTest6529340943691446095system/meta/cube_desc
2017-11-05 08:34:20,934 INFO  [main] project.ProjectManager:97 : Initializing ProjectManager
with metadata url /tmp/org.apache.kylin.tool.metrics.systemcube.SCCreatorTest6529340943691446095system/meta
2017-11-05 08:34:20,935 DEBUG [main] project.ProjectManager:138 : Loading Project from folder
/tmp/org.apache.kylin.tool.metrics.systemcube.SCCreatorTest6529340943691446095system/meta/project
2017-11-05 08:34:20,935 DEBUG [main] project.ProjectManager:144 : Loaded 1 Project(s)
2017-11-05 08:34:20,936 DEBUG [main] cachesync.Broadcaster:122 : 1 nodes in the cluster: [localhost:7070]
2017-11-05 08:34:20,936 DEBUG [main] metadata.TableMetadataManager:448 : Reloading SourceTable
from folder /tmp/org.apache.kylin.tool.metrics.systemcube.SCCreatorTest6529340943691446095system/meta/table
2017-11-05 08:34:20,948 DEBUG [main] metadata.TableMetadataManager:459 : Loaded 5 SourceTable(s)
2017-11-05 08:34:20,948 DEBUG [main] metadata.TableMetadataManager:360 : Reloading Table_exd
info from folder /tmp/org.apache.kylin.tool.metrics.systemcube.SCCreatorTest6529340943691446095system/meta/table_exd
2017-11-05 08:34:20,948 DEBUG [main] metadata.TableMetadataManager:371 : Loaded 0 SourceTable
EXD(s)
2017-11-05 08:34:20,949 DEBUG [main] metadata.TableMetadataManager:432 : Reloading ExternalFilter
from folder /tmp/org.apache.kylin.tool.metrics.systemcube.SCCreatorTest6529340943691446095system/meta/ext_filter
2017-11-05 08:34:20,949 DEBUG [main] metadata.TableMetadataManager:443 : Loaded 0 ExternalFilter(s)
2017-11-05 08:34:20,951 WARN  [main] metadata.TableMetadataManager:87 : More than one singleton
exist, current keys: 1999036805,1214357269,471110969,1281894438
2017-11-05 08:34:20,951 DEBUG [main] model.DataModelManager:223 : Reloading DataModel from
folder /tmp/org.apache.kylin.tool.metrics.systemcube.SCCreatorTest6529340943691446095system/meta/model_desc
2017-11-05 08:34:20,951 INFO  [main] model.DataModelManager:233 : Reloading data model at
/model_desc/KYLIN_HIVE_METRICS_JOB_DEV.json
2017-11-05 08:34:20,952 INFO  [main] model.DataModelManager:233 : Reloading data model at
/model_desc/KYLIN_HIVE_METRICS_JOB_EXCEPTION_DEV.json
2017-11-05 08:34:20,953 INFO  [main] model.DataModelManager:233 : Reloading data model at
/model_desc/KYLIN_HIVE_METRICS_QUERY_CUBE_DEV.json
2017-11-05 08:34:20,954 INFO  [main] model.DataModelManager:233 : Reloading data model at
/model_desc/KYLIN_HIVE_METRICS_QUERY_DEV.json
2017-11-05 08:34:20,955 INFO  [main] model.DataModelManager:233 : Reloading data model at
/model_desc/KYLIN_HIVE_METRICS_QUERY_RPC_DEV.json
2017-11-05 08:34:20,955 DEBUG [main] model.DataModelManager:241 : Loaded 5 DataModel(s)
2017-11-05 08:34:20,956 WARN  [main] model.DataModelManager:74 : More than one singleton exist,
current keys: 1999036805,1214357269,471110969,1281894438
2017-11-05 08:34:20,963 INFO  [main] cube.CubeDescManager:335 : Loaded 5 Cube(s)
2017-11-05 08:34:20,963 INFO  [main] cube.CubeManager:797 : Reloaded cube KYLIN_HIVE_METRICS_JOB_DEV
being CUBE[name=KYLIN_HIVE_METRICS_JOB_DEV] having 0 segments
2017-11-05 08:34:20,963 INFO  [main] cube.CubeManager:797 : Reloaded cube KYLIN_HIVE_METRICS_JOB_EXCEPTION_DEV
being CUBE[name=KYLIN_HIVE_METRICS_JOB_EXCEPTION_DEV] having 0 segments
2017-11-05 08:34:20,964 INFO  [main] cube.CubeManager:797 : Reloaded cube KYLIN_HIVE_METRICS_QUERY_CUBE_DEV
being CUBE[name=KYLIN_HIVE_METRICS_QUERY_CUBE_DEV] having 0 segments
2017-11-05 08:34:20,964 INFO  [main] cube.CubeManager:797 : Reloaded cube KYLIN_HIVE_METRICS_QUERY_DEV
being CUBE[name=KYLIN_HIVE_METRICS_QUERY_DEV] having 0 segments
2017-11-05 08:34:20,964 INFO  [main] cube.CubeManager:797 : Reloaded cube KYLIN_HIVE_METRICS_QUERY_RPC_DEV
being CUBE[name=KYLIN_HIVE_METRICS_QUERY_RPC_DEV] having 0 segments
2017-11-05 08:34:20,964 INFO  [main] cube.CubeManager:758 : Loaded 5 cubes, fail on 0 cubes
System cubes: [CUBE[name=KYLIN_HIVE_METRICS_JOB_DEV], CUBE[name=KYLIN_HIVE_METRICS_JOB_EXCEPTION_DEV],
CUBE[name=KYLIN_HIVE_METRICS_QUERY_CUBE_DEV], CUBE[name=KYLIN_HIVE_METRICS_QUERY_DEV], CUBE[name=KYLIN_HIVE_METRICS_QUERY_RPC_DEV]]
2017-11-05 08:34:20,967 INFO  [main] common.KylinConfig:109 : Destroy KylinConfig
2017-11-05 08:34:20,968 INFO  [main] common.KylinConfig:109 : Destroy KylinConfig
2017-11-05 08:34:21,020 INFO  [main] common.KylinConfig:315 : Loading kylin-defaults.properties
from /home/jenkins/jenkins-slave/workspace/Kylin-Master-JDK-1.8/core-common/target/classes/kylin-defaults.properties
2017-11-05 08:34:21,024 INFO  [main] common.KylinConfig:270 : Use KYLIN_CONF=../examples/test_metadata/
2017-11-05 08:34:21,025 INFO  [main] common.KylinConfig:95 : Initialized a new KylinConfig
from getInstanceFromEnv : 2044934146
2017-11-05 08:34:21,025 INFO  [main] common.KylinConfigBase:162 : Kylin Config was updated
with kylin.metadata.url : ../examples/test_metadata/
2017-11-05 08:34:21,025 INFO  [main] common.KylinConfigBase:162 : Kylin Config was updated
with kylin.env.hdfs-working-dir : file:///tmp/kylin
2017-11-05 08:34:21,029 INFO  [main] common.KylinConfig:109 : Destroy KylinConfig
2017-11-05 08:34:21,030 INFO  [main] common.KylinConfig:109 : Destroy KylinConfig
2017-11-05 08:34:21,070 INFO  [main] common.KylinConfig:315 : Loading kylin-defaults.properties
from /home/jenkins/jenkins-slave/workspace/Kylin-Master-JDK-1.8/core-common/target/classes/kylin-defaults.properties
2017-11-05 08:34:21,074 INFO  [main] common.KylinConfig:270 : Use KYLIN_CONF=../examples/test_metadata/
2017-11-05 08:34:21,075 INFO  [main] common.KylinConfig:95 : Initialized a new KylinConfig
from getInstanceFromEnv : 482900198
2017-11-05 08:34:21,076 INFO  [main] common.KylinConfigBase:162 : Kylin Config was updated
with kylin.metadata.url : ../examples/test_metadata/
2017-11-05 08:34:21,076 INFO  [main] common.KylinConfigBase:162 : Kylin Config was updated
with kylin.env.hdfs-working-dir : file:///tmp/kylin
2017-11-05 08:34:21,085 INFO  [main] common.KylinConfig:109 : Destroy KylinConfig
Tests run: 3, Failures: 0, Errors: 0, Skipped: 0, Time elapsed: 0.583 sec - in org.apache.kylin.tool.metrics.systemcube.SCCreatorTest
Running org.apache.kylin.tool.KylinConfigCLITest
2017-11-05 08:34:21,088 INFO  [main] common.KylinConfig:109 : Destroy KylinConfig
2017-11-05 08:34:21,159 INFO  [main] common.KylinConfig:315 : Loading kylin-defaults.properties
from /home/jenkins/jenkins-slave/workspace/Kylin-Master-JDK-1.8/core-common/target/classes/kylin-defaults.properties
2017-11-05 08:34:21,165 INFO  [main] common.KylinConfig:270 : Use KYLIN_CONF=../examples/test_metadata/
2017-11-05 08:34:21,166 INFO  [main] common.KylinConfig:95 : Initialized a new KylinConfig
from getInstanceFromEnv : 134250967
2017-11-05 08:34:21,166 INFO  [main] common.KylinConfigBase:162 : Kylin Config was updated
with kylin.metadata.url : ../examples/test_metadata/
2017-11-05 08:34:21,167 INFO  [main] common.KylinConfigBase:162 : Kylin Config was updated
with kylin.env.hdfs-working-dir : file:///tmp/kylin
2017-11-05 08:34:21,187 INFO  [main] common.KylinConfig:109 : Destroy KylinConfig
2017-11-05 08:34:21,188 INFO  [main] common.KylinConfig:109 : Destroy KylinConfig
2017-11-05 08:34:21,225 INFO  [main] common.KylinConfig:315 : Loading kylin-defaults.properties
from /home/jenkins/jenkins-slave/workspace/Kylin-Master-JDK-1.8/core-common/target/classes/kylin-defaults.properties
2017-11-05 08:34:21,230 INFO  [main] common.KylinConfig:270 : Use KYLIN_CONF=../examples/test_metadata/
2017-11-05 08:34:21,231 INFO  [main] common.KylinConfig:95 : Initialized a new KylinConfig
from getInstanceFromEnv : 2075455645
2017-11-05 08:34:21,231 INFO  [main] common.KylinConfigBase:162 : Kylin Config was updated
with kylin.metadata.url : ../examples/test_metadata/
2017-11-05 08:34:21,232 INFO  [main] common.KylinConfigBase:162 : Kylin Config was updated
with kylin.env.hdfs-working-dir : file:///tmp/kylin
2017-11-05 08:34:21,237 WARN  [main] common.BackwardCompatibilityConfig:101 : Config 'kylin.cube.engine.'
is deprecated, use 'kylin.engine.provider.' instead
2017-11-05 08:34:21,256 INFO  [main] common.KylinConfig:109 : Destroy KylinConfig
Tests run: 2, Failures: 0, Errors: 0, Skipped: 0, Time elapsed: 0.169 sec - in org.apache.kylin.tool.KylinConfigCLITest

Results :

Tests run: 9, Failures: 0, Errors: 0, Skipped: 1

[JENKINS] Recording test results
[INFO] 
[INFO] --- jacoco-maven-plugin:0.7.8:report (post-test) @ kylin-tool ---
[INFO] Skipping JaCoCo execution due to missing execution data file.
[PMD] No report found for mojo report
[INFO]                                                                         
[INFO] ------------------------------------------------------------------------
[INFO] Building Apache Kylin - Tool Assembly 2.3.0-SNAPSHOT
[INFO] ------------------------------------------------------------------------
[INFO] 
[INFO] --- maven-clean-plugin:2.5:clean (default-clean) @ kylin-tool-assembly ---
[INFO] Deleting /home/jenkins/jenkins-slave/workspace/Kylin-Master-JDK-1.8/tool-assembly/target
[INFO] 
[INFO] --- maven-checkstyle-plugin:2.17:check (check-style) @ kylin-tool-assembly ---
[INFO] Starting audit...
Audit done.
[CHECKSTYLE] Parsing file /home/jenkins/jenkins-slave/workspace/Kylin-Master-JDK-1.8/tool-assembly/target/checkstyle-result.xml
[CHECKSTYLE] Successfully parsed file /home/jenkins/jenkins-slave/workspace/Kylin-Master-JDK-1.8/tool-assembly/target/checkstyle-result.xml
of module Apache Kylin - Tool Assembly with 0 unique warnings and 0 duplicates.
[CHECKSTYLE] Computing warning deltas based on reference build #818
[PMD] No report found for mojo check
[INFO] 
[INFO] --- jacoco-maven-plugin:0.7.8:prepare-agent (pre-test) @ kylin-tool-assembly ---
[INFO] surefireArgLine set to -javaagent:/home/jenkins/jenkins-slave/maven-repositories/0/org/jacoco/org.jacoco.agent/0.7.8/org.jacoco.agent-0.7.8-runtime.jar=destfile=/home/jenkins/jenkins-slave/workspace/Kylin-Master-JDK-1.8/tool-assembly/../target/jacoco.exec,append=true
[INFO] 
[INFO] --- maven-remote-resources-plugin:1.5:process (default) @ kylin-tool-assembly ---
[INFO] 
[INFO] --- maven-resources-plugin:3.0.1:resources (default-resources) @ kylin-tool-assembly
---
[INFO] Using 'UTF-8' encoding to copy filtered resources.
[INFO] skip non existing resourceDirectory /home/jenkins/jenkins-slave/workspace/Kylin-Master-JDK-1.8/tool-assembly/src/main/resources
[INFO] Copying 3 resources
[INFO] 
[INFO] --- maven-compiler-plugin:3.5.1:compile (default-compile) @ kylin-tool-assembly ---
[INFO] No sources to compile
[INFO] 
[INFO] --- maven-dependency-plugin:2.10:copy (copy-jamm) @ kylin-tool-assembly ---
[INFO] Configured Artifact: com.github.jbellis:jamm:?:jar
[INFO] Copying jamm-0.3.1.jar to /home/jenkins/jenkins-slave/workspace/Kylin-Master-JDK-1.8/tool-assembly/target/test-classes/jamm.jar
[INFO] 
[INFO] --- maven-resources-plugin:3.0.1:testResources (default-testResources) @ kylin-tool-assembly
---
[INFO] Using 'UTF-8' encoding to copy filtered resources.
[INFO] skip non existing resourceDirectory /home/jenkins/jenkins-slave/workspace/Kylin-Master-JDK-1.8/tool-assembly/src/test/resources
[INFO] Copying 3 resources
[INFO] 
[INFO] --- maven-compiler-plugin:3.5.1:testCompile (default-testCompile) @ kylin-tool-assembly
---
[INFO] No sources to compile
[INFO] 
[INFO] --- maven-surefire-plugin:2.19.1:test (default-test) @ kylin-tool-assembly ---
[JENKINS] Recording test results
[INFO] 
[INFO] --- jacoco-maven-plugin:0.7.8:report (post-test) @ kylin-tool-assembly ---
[INFO] Skipping JaCoCo execution due to missing execution data file.
[PMD] No report found for mojo report
ERROR: Failed to parse POMs
java.io.IOException: Backing channel 'H4' is disconnected.
	at hudson.remoting.RemoteInvocationHandler.channelOrFail(RemoteInvocationHandler.java:192)
	at hudson.remoting.RemoteInvocationHandler.invoke(RemoteInvocationHandler.java:257)
	at com.sun.proxy.$Proxy136.isAlive(Unknown Source)
	at hudson.Launcher$RemoteLauncher$ProcImpl.isAlive(Launcher.java:1138)
	at hudson.maven.ProcessCache$MavenProcess.call(ProcessCache.java:166)
	at hudson.maven.MavenModuleSetBuild$MavenModuleSetBuildExecution.doRun(MavenModuleSetBuild.java:879)
	at hudson.model.AbstractBuild$AbstractBuildExecution.run(AbstractBuild.java:496)
	at hudson.model.Run.execute(Run.java:1737)
	at hudson.maven.MavenModuleSetBuild.run(MavenModuleSetBuild.java:543)
	at hudson.model.ResourceController.execute(ResourceController.java:97)
	at hudson.model.Executor.run(Executor.java:419)
Caused by: hudson.remoting.Channel$OrderlyShutdown
	at hudson.remoting.Channel$CloseCommand.execute(Channel.java:1138)
	at hudson.remoting.Channel$1.handle(Channel.java:535)
	at hudson.remoting.SynchronousCommandTransport$ReaderThread.run(SynchronousCommandTransport.java:83)
Caused by: Command close created at
	at hudson.remoting.Command.<init>(Command.java:60)
	at hudson.remoting.Channel$CloseCommand.<init>(Channel.java:1132)
	at hudson.remoting.Channel$CloseCommand.<init>(Channel.java:1130)
	at hudson.remoting.Channel.close(Channel.java:1290)
	at hudson.remoting.Channel.close(Channel.java:1272)
	at hudson.remoting.Channel$CloseCommand.execute(Channel.java:1137)
	... 2 more
ERROR: H4 is offline; cannot locate JDK 1.8 (latest)
ERROR: H4 is offline; cannot locate Maven 3.2.5
ERROR: H4 is offline; cannot locate JDK 1.8 (latest)
ERROR: H4 is offline; cannot locate Maven 3.2.5

Mime
View raw message