kylin-commits mailing list archives

Site index · List index
Message view « Date » · « Thread »
Top « Date » · « Thread »
From Apache Jenkins Server <jenk...@builds.apache.org>
Subject Build failed in Jenkins: Kylin-Master-JDK-1.8 #431
Date Fri, 28 Apr 2017 01:54:11 GMT
See <https://builds.apache.org/job/Kylin-Master-JDK-1.8/431/display/redirect>

------------------------------------------
[...truncated 1.58 MB...]
[INFO] Apache Kylin - Core Metadata ....................... SUCCESS [ 37.441 s]
[INFO] Apache Kylin - Core Dictionary ..................... SUCCESS [01:15 min]
[INFO] Apache Kylin - Core Cube ........................... SUCCESS [01:47 min]
[INFO] Apache Kylin - Core Job ............................ SUCCESS [02:06 min]
[INFO] Apache Kylin - Core Storage ........................ SUCCESS [ 49.002 s]
[INFO] Apache Kylin - MapReduce Engine .................... SUCCESS [ 30.248 s]
[INFO] Apache Kylin - HBase Storage ....................... SUCCESS [ 23.788 s]
[INFO] Apache Kylin - Spark Engine ........................ FAILURE [  3.812 s]
[INFO] Apache Kylin - Hive Source ......................... FAILURE [  0.739 s]
[INFO] Apache Kylin - Kafka Source ........................ SUCCESS [ 11.253 s]
[INFO] Apache Kylin - Query ............................... SKIPPED
[INFO] Apache Kylin - Tool ................................ SKIPPED
[INFO] Apache Kylin - REST Server Base .................... SKIPPED
[INFO] Apache Kylin - REST Server ......................... SKIPPED
[INFO] Apache Kylin - JDBC Driver ......................... SUCCESS [  9.211 s]
[INFO] Apache Kylin - Assembly ............................ SKIPPED
[INFO] Apache Kylin - Tool Assembly ....................... SKIPPED
[INFO] Apache Kylin - Integration Test .................... SKIPPED
[INFO] Apache Kylin - Tomcat Extension .................... SUCCESS [  5.173 s]
[INFO] ------------------------------------------------------------------------
[INFO] BUILD FAILURE
[INFO] ------------------------------------------------------------------------
[INFO] Total time: 15:44 min
[INFO] Finished at: 2017-04-28T01:53:46+00:00
[INFO] Final Memory: 64M/671M
[INFO] ------------------------------------------------------------------------
Waiting for Jenkins to finish collecting data
[ERROR] Failed to execute goal on project atopcalcite: Could not resolve dependencies for
project org.apache.kylin:atopcalcite:jar:2.1.0-SNAPSHOT: Could not transfer artifact org.apache.calcite:calcite-core:jar:1.12.0-kylin-r2-20170418.131200-1
from/to nexus (http://repository.kyligence.io:8081/repository/maven-public/): GET request
of: org/apache/calcite/calcite-core/1.12.0-kylin-r2-SNAPSHOT/calcite-core-1.12.0-kylin-r2-20170418.131200-1.jar
from nexus failed: Premature end of Content-Length delimited message body (expected: 4315427;
received: 3488616 -> [Help 1]
org.apache.maven.lifecycle.LifecycleExecutionException: Failed to execute goal on project
atopcalcite: Could not resolve dependencies for project org.apache.kylin:atopcalcite:jar:2.1.0-SNAPSHOT:
Could not transfer artifact org.apache.calcite:calcite-core:jar:1.12.0-kylin-r2-20170418.131200-1
from/to nexus (http://repository.kyligence.io:8081/repository/maven-public/): GET request
of: org/apache/calcite/calcite-core/1.12.0-kylin-r2-SNAPSHOT/calcite-core-1.12.0-kylin-r2-20170418.131200-1.jar
from nexus failed
	at org.apache.maven.lifecycle.internal.LifecycleDependencyResolver.getDependencies(LifecycleDependencyResolver.java:221)
	at org.apache.maven.lifecycle.internal.LifecycleDependencyResolver.resolveProjectDependencies(LifecycleDependencyResolver.java:127)
	at org.apache.maven.lifecycle.internal.MojoExecutor.ensureDependenciesAreResolved(MojoExecutor.java:245)
	at org.apache.maven.lifecycle.internal.MojoExecutor.execute(MojoExecutor.java:199)
	at org.apache.maven.lifecycle.internal.MojoExecutor.execute(MojoExecutor.java:153)
	at org.apache.maven.lifecycle.internal.MojoExecutor.execute(MojoExecutor.java:145)
	at org.apache.maven.lifecycle.internal.LifecycleModuleBuilder.buildProject(LifecycleModuleBuilder.java:116)
	at org.apache.maven.lifecycle.internal.LifecycleModuleBuilder.buildProject(LifecycleModuleBuilder.java:80)
	at org.apache.maven.lifecycle.internal.builder.singlethreaded.SingleThreadedBuilder.build(SingleThreadedBuilder.java:51)
	at org.apache.maven.lifecycle.internal.LifecycleStarter.execute(LifecycleStarter.java:128)
	at org.apache.maven.DefaultMaven.doExecute(DefaultMaven.java:307)
	at org.apache.maven.DefaultMaven.doExecute(DefaultMaven.java:193)
	at org.apache.maven.DefaultMaven.execute(DefaultMaven.java:106)
	at org.jvnet.hudson.maven3.launcher.Maven33Launcher.main(Maven33Launcher.java:129)
	at sun.reflect.NativeMethodAccessorImpl.invoke0(Native Method)
	at sun.reflect.NativeMethodAccessorImpl.invoke(NativeMethodAccessorImpl.java:62)
	at sun.reflect.DelegatingMethodAccessorImpl.invoke(DelegatingMethodAccessorImpl.java:43)
	at java.lang.reflect.Method.invoke(Method.java:498)
	at org.codehaus.plexus.classworlds.launcher.Launcher.launchStandard(Launcher.java:330)
	at org.codehaus.plexus.classworlds.launcher.Launcher.launch(Launcher.java:238)
	at jenkins.maven3.agent.Maven33Main.launch(Maven33Main.java:176)
	at sun.reflect.NativeMethodAccessorImpl.invoke0(Native Method)
	at sun.reflect.NativeMethodAccessorImpl.invoke(NativeMethodAccessorImpl.java:62)
	at sun.reflect.DelegatingMethodAccessorImpl.invoke(DelegatingMethodAccessorImpl.java:43)
	at java.lang.reflect.Method.invoke(Method.java:498)
	at hudson.maven.Maven3Builder.call(Maven3Builder.java:139)
	at hudson.maven.Maven3Builder.call(Maven3Builder.java:70)
	at hudson.remoting.UserRequest.perform(UserRequest.java:153)
	at hudson.remoting.UserRequest.perform(UserRequest.java:50)
	at hudson.remoting.Request$2.run(Request.java:336)
	at hudson.remoting.InterceptingExecutorService$1.call(InterceptingExecutorService.java:68)
	at java.util.concurrent.FutureTask.run(FutureTask.java:266)
	at java.util.concurrent.ThreadPoolExecutor.runWorker(ThreadPoolExecutor.java:1142)
	at java.util.concurrent.ThreadPoolExecutor$Worker.run(ThreadPoolExecutor.java:617)
	at java.lang.Thread.run(Thread.java:745)
Caused by: org.apache.maven.project.DependencyResolutionException: Could not resolve dependencies
for project org.apache.kylin:atopcalcite:jar:2.1.0-SNAPSHOT: Could not transfer artifact org.apache.calcite:calcite-core:jar:1.12.0-kylin-r2-20170418.131200-1
from/to nexus (http://repository.kyligence.io:8081/repository/maven-public/): GET request
of: org/apache/calcite/calcite-core/1.12.0-kylin-r2-SNAPSHOT/calcite-core-1.12.0-kylin-r2-20170418.131200-1.jar
from nexus failed
	at org.apache.maven.project.DefaultProjectDependenciesResolver.resolve(DefaultProjectDependenciesResolver.java:211)
	at org.apache.maven.lifecycle.internal.LifecycleDependencyResolver.getDependencies(LifecycleDependencyResolver.java:195)
	... 34 more
Caused by: org.eclipse.aether.resolution.DependencyResolutionException: Could not transfer
artifact org.apache.calcite:calcite-core:jar:1.12.0-kylin-r2-20170418.131200-1 from/to nexus
(http://repository.kyligence.io:8081/repository/maven-public/): GET request of: org/apache/calcite/calcite-core/1.12.0-kylin-r2-SNAPSHOT/calcite-core-1.12.0-kylin-r2-20170418.131200-1.jar
from nexus failed
	at org.eclipse.aether.internal.impl.DefaultRepositorySystem.resolveDependencies(DefaultRepositorySystem.java:384)
	at org.apache.maven.project.DefaultProjectDependenciesResolver.resolve(DefaultProjectDependenciesResolver.java:205)
	... 35 more
Caused by: org.eclipse.aether.resolution.ArtifactResolutionException: Could not transfer artifact
org.apache.calcite:calcite-core:jar:1.12.0-kylin-r2-20170418.131200-1 from/to nexus (http://repository.kyligence.io:8081/repository/maven-public/):
GET request of: org/apache/calcite/calcite-core/1.12.0-kylin-r2-SNAPSHOT/calcite-core-1.12.0-kylin-r2-20170418.131200-1.jar
from nexus failed
	at org.eclipse.aether.internal.impl.DefaultArtifactResolver.resolve(DefaultArtifactResolver.java:444)
	at org.eclipse.aether.internal.impl.DefaultArtifactResolver.resolveArtifacts(DefaultArtifactResolver.java:246)
	at org.eclipse.aether.internal.impl.DefaultRepositorySystem.resolveDependencies(DefaultRepositorySystem.java:367)
	... 36 more
Caused by: org.eclipse.aether.transfer.ArtifactTransferException: Could not transfer artifact
org.apache.calcite:calcite-core:jar:1.12.0-kylin-r2-20170418.131200-1 from/to nexus (http://repository.kyligence.io:8081/repository/maven-public/):
GET request of: org/apache/calcite/calcite-core/1.12.0-kylin-r2-SNAPSHOT/calcite-core-1.12.0-kylin-r2-20170418.131200-1.jar
from nexus failed
	at org.eclipse.aether.connector.basic.ArtifactTransportListener.transferFailed(ArtifactTransportListener.java:43)
	at org.eclipse.aether.connector.basic.BasicRepositoryConnector$TaskRunner.run(BasicRepositoryConnector.java:355)
	at org.eclipse.aether.util.concurrency.RunnableErrorForwarder$1.run(RunnableErrorForwarder.java:67)
	... 3 more
Caused by: org.apache.maven.wagon.TransferFailedException: GET request of: org/apache/calcite/calcite-core/1.12.0-kylin-r2-SNAPSHOT/calcite-core-1.12.0-kylin-r2-20170418.131200-1.jar
from nexus failed
	at org.apache.maven.wagon.AbstractWagon.getTransfer(AbstractWagon.java:363)
	at org.apache.maven.wagon.AbstractWagon.getTransfer(AbstractWagon.java:316)
	at org.apache.maven.wagon.AbstractWagon.getTransfer(AbstractWagon.java:285)
	at org.apache.maven.wagon.StreamWagon.getIfNewer(StreamWagon.java:97)
	at org.apache.maven.wagon.StreamWagon.get(StreamWagon.java:61)
	at org.eclipse.aether.transport.wagon.WagonTransporter$GetTaskRunner.run(WagonTransporter.java:560)
	at org.eclipse.aether.transport.wagon.WagonTransporter.execute(WagonTransporter.java:427)
	at org.eclipse.aether.transport.wagon.WagonTransporter.get(WagonTransporter.java:404)
	at org.eclipse.aether.connector.basic.BasicRepositoryConnector$GetTaskRunner.runTask(BasicRepositoryConnector.java:447)
	at org.eclipse.aether.connector.basic.BasicRepositoryConnector$TaskRunner.run(BasicRepositoryConnector.java:350)
	... 4 more
Caused by: org.apache.maven.wagon.providers.http.httpclient.ConnectionClosedException: Premature
end of Content-Length delimited message body (expected: 4315427; received: 3488616
	at org.apache.maven.wagon.providers.http.httpclient.impl.io.ContentLengthInputStream.read(ContentLengthInputStream.java:180)
	at org.apache.maven.wagon.providers.http.httpclient.conn.EofSensorInputStream.read(EofSensorInputStream.java:137)
	at org.apache.maven.wagon.AbstractWagon.transfer(AbstractWagon.java:531)
	at org.apache.maven.wagon.AbstractWagon.getTransfer(AbstractWagon.java:353)
	... 13 more
[ERROR] Failed to execute goal on project kylin-engine-spark: Could not resolve dependencies
for project org.apache.kylin:kylin-engine-spark:jar:2.1.0-SNAPSHOT: Failure to transfer org.apache.calcite:calcite-core:jar:1.12.0-kylin-r2-20170418.131200-1
from http://repository.kyligence.io:8081/repository/maven-public/ was cached in the local
repository, resolution will not be reattempted until the update interval of nexus has elapsed
or updates are forced. Original error: Could not transfer artifact org.apache.calcite:calcite-core:jar:1.12.0-kylin-r2-20170418.131200-1
from/to nexus (http://repository.kyligence.io:8081/repository/maven-public/): GET request
of: org/apache/calcite/calcite-core/1.12.0-kylin-r2-SNAPSHOT/calcite-core-1.12.0-kylin-r2-20170418.131200-1.jar
from nexus failed -> [Help 1]
org.apache.maven.lifecycle.LifecycleExecutionException: Failed to execute goal on project
kylin-engine-spark: Could not resolve dependencies for project org.apache.kylin:kylin-engine-spark:jar:2.1.0-SNAPSHOT:
Failure to transfer org.apache.calcite:calcite-core:jar:1.12.0-kylin-r2-20170418.131200-1
from http://repository.kyligence.io:8081/repository/maven-public/ was cached in the local
repository, resolution will not be reattempted until the update interval of nexus has elapsed
or updates are forced. Original error: Could not transfer artifact org.apache.calcite:calcite-core:jar:1.12.0-kylin-r2-20170418.131200-1
from/to nexus (http://repository.kyligence.io:8081/repository/maven-public/): GET request
of: org/apache/calcite/calcite-core/1.12.0-kylin-r2-SNAPSHOT/calcite-core-1.12.0-kylin-r2-20170418.131200-1.jar
from nexus failed
	at org.apache.maven.lifecycle.internal.LifecycleDependencyResolver.getDependencies(LifecycleDependencyResolver.java:221)
	at org.apache.maven.lifecycle.internal.LifecycleDependencyResolver.resolveProjectDependencies(LifecycleDependencyResolver.java:127)
	at org.apache.maven.lifecycle.internal.MojoExecutor.ensureDependenciesAreResolved(MojoExecutor.java:245)
	at org.apache.maven.lifecycle.internal.MojoExecutor.execute(MojoExecutor.java:199)
	at org.apache.maven.lifecycle.internal.MojoExecutor.execute(MojoExecutor.java:153)
	at org.apache.maven.lifecycle.internal.MojoExecutor.execute(MojoExecutor.java:145)
	at org.apache.maven.lifecycle.internal.LifecycleModuleBuilder.buildProject(LifecycleModuleBuilder.java:116)
	at org.apache.maven.lifecycle.internal.LifecycleModuleBuilder.buildProject(LifecycleModuleBuilder.java:80)
	at org.apache.maven.lifecycle.internal.builder.singlethreaded.SingleThreadedBuilder.build(SingleThreadedBuilder.java:51)
	at org.apache.maven.lifecycle.internal.LifecycleStarter.execute(LifecycleStarter.java:128)
	at org.apache.maven.DefaultMaven.doExecute(DefaultMaven.java:307)
	at org.apache.maven.DefaultMaven.doExecute(DefaultMaven.java:193)
	at org.apache.maven.DefaultMaven.execute(DefaultMaven.java:106)
	at org.jvnet.hudson.maven3.launcher.Maven33Launcher.main(Maven33Launcher.java:129)
	at sun.reflect.NativeMethodAccessorImpl.invoke0(Native Method)
	at sun.reflect.NativeMethodAccessorImpl.invoke(NativeMethodAccessorImpl.java:62)
	at sun.reflect.DelegatingMethodAccessorImpl.invoke(DelegatingMethodAccessorImpl.java:43)
	at java.lang.reflect.Method.invoke(Method.java:498)
	at org.codehaus.plexus.classworlds.launcher.Launcher.launchStandard(Launcher.java:330)
	at org.codehaus.plexus.classworlds.launcher.Launcher.launch(Launcher.java:238)
	at jenkins.maven3.agent.Maven33Main.launch(Maven33Main.java:176)
	at sun.reflect.NativeMethodAccessorImpl.invoke0(Native Method)
	at sun.reflect.NativeMethodAccessorImpl.invoke(NativeMethodAccessorImpl.java:62)
	at sun.reflect.DelegatingMethodAccessorImpl.invoke(DelegatingMethodAccessorImpl.java:43)
	at java.lang.reflect.Method.invoke(Method.java:498)
	at hudson.maven.Maven3Builder.call(Maven3Builder.java:139)
	at hudson.maven.Maven3Builder.call(Maven3Builder.java:70)
	at hudson.remoting.UserRequest.perform(UserRequest.java:153)
	at hudson.remoting.UserRequest.perform(UserRequest.java:50)
	at hudson.remoting.Request$2.run(Request.java:336)
	at hudson.remoting.InterceptingExecutorService$1.call(InterceptingExecutorService.java:68)
	at java.util.concurrent.FutureTask.run(FutureTask.java:266)
	at java.util.concurrent.ThreadPoolExecutor.runWorker(ThreadPoolExecutor.java:1142)
	at java.util.concurrent.ThreadPoolExecutor$Worker.run(ThreadPoolExecutor.java:617)
	at java.lang.Thread.run(Thread.java:745)
Caused by: org.apache.maven.project.DependencyResolutionException: Could not resolve dependencies
for project org.apache.kylin:kylin-engine-spark:jar:2.1.0-SNAPSHOT: Failure to transfer org.apache.calcite:calcite-core:jar:1.12.0-kylin-r2-20170418.131200-1
from http://repository.kyligence.io:8081/repository/maven-public/ was cached in the local
repository, resolution will not be reattempted until the update interval of nexus has elapsed
or updates are forced. Original error: Could not transfer artifact org.apache.calcite:calcite-core:jar:1.12.0-kylin-r2-20170418.131200-1
from/to nexus (http://repository.kyligence.io:8081/repository/maven-public/): GET request
of: org/apache/calcite/calcite-core/1.12.0-kylin-r2-SNAPSHOT/calcite-core-1.12.0-kylin-r2-20170418.131200-1.jar
from nexus failed
	at org.apache.maven.project.DefaultProjectDependenciesResolver.resolve(DefaultProjectDependenciesResolver.java:211)
	at org.apache.maven.lifecycle.internal.LifecycleDependencyResolver.getDependencies(LifecycleDependencyResolver.java:195)
	... 34 more
Caused by: org.eclipse.aether.resolution.DependencyResolutionException: Failure to transfer
org.apache.calcite:calcite-core:jar:1.12.0-kylin-r2-20170418.131200-1 from http://repository.kyligence.io:8081/repository/maven-public/
was cached in the local repository, resolution will not be reattempted until the update interval
of nexus has elapsed or updates are forced. Original error: Could not transfer artifact org.apache.calcite:calcite-core:jar:1.12.0-kylin-r2-20170418.131200-1
from/to nexus (http://repository.kyligence.io:8081/repository/maven-public/): GET request
of: org/apache/calcite/calcite-core/1.12.0-kylin-r2-SNAPSHOT/calcite-core-1.12.0-kylin-r2-20170418.131200-1.jar
from nexus failed
	at org.eclipse.aether.internal.impl.DefaultRepositorySystem.resolveDependencies(DefaultRepositorySystem.java:384)
	at org.apache.maven.project.DefaultProjectDependenciesResolver.resolve(DefaultProjectDependenciesResolver.java:205)
	... 35 more
Caused by: org.eclipse.aether.resolution.ArtifactResolutionException: Failure to transfer
org.apache.calcite:calcite-core:jar:1.12.0-kylin-r2-20170418.131200-1 from http://repository.kyligence.io:8081/repository/maven-public/
was cached in the local repository, resolution will not be reattempted until the update interval
of nexus has elapsed or updates are forced. Original error: Could not transfer artifact org.apache.calcite:calcite-core:jar:1.12.0-kylin-r2-20170418.131200-1
from/to nexus (http://repository.kyligence.io:8081/repository/maven-public/): GET request
of: org/apache/calcite/calcite-core/1.12.0-kylin-r2-SNAPSHOT/calcite-core-1.12.0-kylin-r2-20170418.131200-1.jar
from nexus failed
	at org.eclipse.aether.internal.impl.DefaultArtifactResolver.resolve(DefaultArtifactResolver.java:444)
	at org.eclipse.aether.internal.impl.DefaultArtifactResolver.resolveArtifacts(DefaultArtifactResolver.java:246)
	at org.eclipse.aether.internal.impl.DefaultRepositorySystem.resolveDependencies(DefaultRepositorySystem.java:367)
	... 36 more
Caused by: org.eclipse.aether.transfer.ArtifactTransferException: Failure to transfer org.apache.calcite:calcite-core:jar:1.12.0-kylin-r2-20170418.131200-1
from http://repository.kyligence.io:8081/repository/maven-public/ was cached in the local
repository, resolution will not be reattempted until the update interval of nexus has elapsed
or updates are forced. Original error: Could not transfer artifact org.apache.calcite:calcite-core:jar:1.12.0-kylin-r2-20170418.131200-1
from/to nexus (http://repository.kyligence.io:8081/repository/maven-public/): GET request
of: org/apache/calcite/calcite-core/1.12.0-kylin-r2-SNAPSHOT/calcite-core-1.12.0-kylin-r2-20170418.131200-1.jar
from nexus failed
	at org.eclipse.aether.internal.impl.DefaultUpdateCheckManager.newException(DefaultUpdateCheckManager.java:238)
	at org.eclipse.aether.internal.impl.DefaultUpdateCheckManager.checkArtifact(DefaultUpdateCheckManager.java:183)
	at org.eclipse.aether.internal.impl.DefaultArtifactResolver.gatherDownloads(DefaultArtifactResolver.java:585)
	at org.eclipse.aether.internal.impl.DefaultArtifactResolver.performDownloads(DefaultArtifactResolver.java:503)
	at org.eclipse.aether.internal.impl.DefaultArtifactResolver.resolve(DefaultArtifactResolver.java:421)
	... 38 more
[ERROR] Failed to execute goal on project kylin-source-hive: Could not resolve dependencies
for project org.apache.kylin:kylin-source-hive:jar:2.1.0-SNAPSHOT: Failure to transfer org.apache.calcite:calcite-core:jar:1.12.0-kylin-r2-20170418.131200-1
from http://repository.kyligence.io:8081/repository/maven-public/ was cached in the local
repository, resolution will not be reattempted until the update interval of nexus has elapsed
or updates are forced. Original error: Could not transfer artifact org.apache.calcite:calcite-core:jar:1.12.0-kylin-r2-20170418.131200-1
from/to nexus (http://repository.kyligence.io:8081/repository/maven-public/): GET request
of: org/apache/calcite/calcite-core/1.12.0-kylin-r2-SNAPSHOT/calcite-core-1.12.0-kylin-r2-20170418.131200-1.jar
from nexus failed -> [Help 1]
org.apache.maven.lifecycle.LifecycleExecutionException: Failed to execute goal on project
kylin-source-hive: Could not resolve dependencies for project org.apache.kylin:kylin-source-hive:jar:2.1.0-SNAPSHOT:
Failure to transfer org.apache.calcite:calcite-core:jar:1.12.0-kylin-r2-20170418.131200-1
from http://repository.kyligence.io:8081/repository/maven-public/ was cached in the local
repository, resolution will not be reattempted until the update interval of nexus has elapsed
or updates are forced. Original error: Could not transfer artifact org.apache.calcite:calcite-core:jar:1.12.0-kylin-r2-20170418.131200-1
from/to nexus (http://repository.kyligence.io:8081/repository/maven-public/): GET request
of: org/apache/calcite/calcite-core/1.12.0-kylin-r2-SNAPSHOT/calcite-core-1.12.0-kylin-r2-20170418.131200-1.jar
from nexus failed
	at org.apache.maven.lifecycle.internal.LifecycleDependencyResolver.getDependencies(LifecycleDependencyResolver.java:221)
	at org.apache.maven.lifecycle.internal.LifecycleDependencyResolver.resolveProjectDependencies(LifecycleDependencyResolver.java:127)
	at org.apache.maven.lifecycle.internal.MojoExecutor.ensureDependenciesAreResolved(MojoExecutor.java:245)
	at org.apache.maven.lifecycle.internal.MojoExecutor.execute(MojoExecutor.java:199)
	at org.apache.maven.lifecycle.internal.MojoExecutor.execute(MojoExecutor.java:153)
	at org.apache.maven.lifecycle.internal.MojoExecutor.execute(MojoExecutor.java:145)
	at org.apache.maven.lifecycle.internal.LifecycleModuleBuilder.buildProject(LifecycleModuleBuilder.java:116)
	at org.apache.maven.lifecycle.internal.LifecycleModuleBuilder.buildProject(LifecycleModuleBuilder.java:80)
	at org.apache.maven.lifecycle.internal.builder.singlethreaded.SingleThreadedBuilder.build(SingleThreadedBuilder.java:51)
	at org.apache.maven.lifecycle.internal.LifecycleStarter.execute(LifecycleStarter.java:128)
	at org.apache.maven.DefaultMaven.doExecute(DefaultMaven.java:307)
	at org.apache.maven.DefaultMaven.doExecute(DefaultMaven.java:193)
	at org.apache.maven.DefaultMaven.execute(DefaultMaven.java:106)
	at org.jvnet.hudson.maven3.launcher.Maven33Launcher.main(Maven33Launcher.java:129)
	at sun.reflect.NativeMethodAccessorImpl.invoke0(Native Method)
	at sun.reflect.NativeMethodAccessorImpl.invoke(NativeMethodAccessorImpl.java:62)
	at sun.reflect.DelegatingMethodAccessorImpl.invoke(DelegatingMethodAccessorImpl.java:43)
	at java.lang.reflect.Method.invoke(Method.java:498)
	at org.codehaus.plexus.classworlds.launcher.Launcher.launchStandard(Launcher.java:330)
	at org.codehaus.plexus.classworlds.launcher.Launcher.launch(Launcher.java:238)
	at jenkins.maven3.agent.Maven33Main.launch(Maven33Main.java:176)
	at sun.reflect.NativeMethodAccessorImpl.invoke0(Native Method)
	at sun.reflect.NativeMethodAccessorImpl.invoke(NativeMethodAccessorImpl.java:62)
	at sun.reflect.DelegatingMethodAccessorImpl.invoke(DelegatingMethodAccessorImpl.java:43)
	at java.lang.reflect.Method.invoke(Method.java:498)
	at hudson.maven.Maven3Builder.call(Maven3Builder.java:139)
	at hudson.maven.Maven3Builder.call(Maven3Builder.java:70)
	at hudson.remoting.UserRequest.perform(UserRequest.java:153)
	at hudson.remoting.UserRequest.perform(UserRequest.java:50)
	at hudson.remoting.Request$2.run(Request.java:336)
	at hudson.remoting.InterceptingExecutorService$1.call(InterceptingExecutorService.java:68)
	at java.util.concurrent.FutureTask.run(FutureTask.java:266)
	at java.util.concurrent.ThreadPoolExecutor.runWorker(ThreadPoolExecutor.java:1142)
	at java.util.concurrent.ThreadPoolExecutor$Worker.run(ThreadPoolExecutor.java:617)
	at java.lang.Thread.run(Thread.java:745)
Caused by: org.apache.maven.project.DependencyResolutionException: Could not resolve dependencies
for project org.apache.kylin:kylin-source-hive:jar:2.1.0-SNAPSHOT: Failure to transfer org.apache.calcite:calcite-core:jar:1.12.0-kylin-r2-20170418.131200-1
from http://repository.kyligence.io:8081/repository/maven-public/ was cached in the local
repository, resolution will not be reattempted until the update interval of nexus has elapsed
or updates are forced. Original error: Could not transfer artifact org.apache.calcite:calcite-core:jar:1.12.0-kylin-r2-20170418.131200-1
from/to nexus (http://repository.kyligence.io:8081/repository/maven-public/): GET request
of: org/apache/calcite/calcite-core/1.12.0-kylin-r2-SNAPSHOT/calcite-core-1.12.0-kylin-r2-20170418.131200-1.jar
from nexus failed
	at org.apache.maven.project.DefaultProjectDependenciesResolver.resolve(DefaultProjectDependenciesResolver.java:211)
	at org.apache.maven.lifecycle.internal.LifecycleDependencyResolver.getDependencies(LifecycleDependencyResolver.java:195)
	... 34 more
Caused by: org.eclipse.aether.resolution.DependencyResolutionException: Failure to transfer
org.apache.calcite:calcite-core:jar:1.12.0-kylin-r2-20170418.131200-1 from http://repository.kyligence.io:8081/repository/maven-public/
was cached in the local repository, resolution will not be reattempted until the update interval
of nexus has elapsed or updates are forced. Original error: Could not transfer artifact org.apache.calcite:calcite-core:jar:1.12.0-kylin-r2-20170418.131200-1
from/to nexus (http://repository.kyligence.io:8081/repository/maven-public/): GET request
of: org/apache/calcite/calcite-core/1.12.0-kylin-r2-SNAPSHOT/calcite-core-1.12.0-kylin-r2-20170418.131200-1.jar
from nexus failed
	at org.eclipse.aether.internal.impl.DefaultRepositorySystem.resolveDependencies(DefaultRepositorySystem.java:384)
	at org.apache.maven.project.DefaultProjectDependenciesResolver.resolve(DefaultProjectDependenciesResolver.java:205)
	... 35 more
Caused by: org.eclipse.aether.resolution.ArtifactResolutionException: Failure to transfer
org.apache.calcite:calcite-core:jar:1.12.0-kylin-r2-20170418.131200-1 from http://repository.kyligence.io:8081/repository/maven-public/
was cached in the local repository, resolution will not be reattempted until the update interval
of nexus has elapsed or updates are forced. Original error: Could not transfer artifact org.apache.calcite:calcite-core:jar:1.12.0-kylin-r2-20170418.131200-1
from/to nexus (http://repository.kyligence.io:8081/repository/maven-public/): GET request
of: org/apache/calcite/calcite-core/1.12.0-kylin-r2-SNAPSHOT/calcite-core-1.12.0-kylin-r2-20170418.131200-1.jar
from nexus failed
	at org.eclipse.aether.internal.impl.DefaultArtifactResolver.resolve(DefaultArtifactResolver.java:444)
	at org.eclipse.aether.internal.impl.DefaultArtifactResolver.resolveArtifacts(DefaultArtifactResolver.java:246)
	at org.eclipse.aether.internal.impl.DefaultRepositorySystem.resolveDependencies(DefaultRepositorySystem.java:367)
	... 36 more
Caused by: org.eclipse.aether.transfer.ArtifactTransferException: Failure to transfer org.apache.calcite:calcite-core:jar:1.12.0-kylin-r2-20170418.131200-1
from http://repository.kyligence.io:8081/repository/maven-public/ was cached in the local
repository, resolution will not be reattempted until the update interval of nexus has elapsed
or updates are forced. Original error: Could not transfer artifact org.apache.calcite:calcite-core:jar:1.12.0-kylin-r2-20170418.131200-1
from/to nexus (http://repository.kyligence.io:8081/repository/maven-public/): GET request
of: org/apache/calcite/calcite-core/1.12.0-kylin-r2-SNAPSHOT/calcite-core-1.12.0-kylin-r2-20170418.131200-1.jar
from nexus failed
	at org.eclipse.aether.internal.impl.DefaultUpdateCheckManager.newException(DefaultUpdateCheckManager.java:238)
	at org.eclipse.aether.internal.impl.DefaultUpdateCheckManager.checkArtifact(DefaultUpdateCheckManager.java:183)
	at org.eclipse.aether.internal.impl.DefaultArtifactResolver.gatherDownloads(DefaultArtifactResolver.java:585)
	at org.eclipse.aether.internal.impl.DefaultArtifactResolver.performDownloads(DefaultArtifactResolver.java:503)
	at org.eclipse.aether.internal.impl.DefaultArtifactResolver.resolve(DefaultArtifactResolver.java:421)
	... 38 more
[ERROR] 
[ERROR] Re-run Maven using the -X switch to enable full debug logging.
[ERROR] 
[ERROR] For more information about the errors and possible solutions, please read the following
articles:
[ERROR] [Help 1] http://cwiki.apache.org/confluence/display/MAVEN/DependencyResolutionException
[ERROR] 
[ERROR] After correcting the problems, you can resume the build with the command
[ERROR]   mvn <goals> -rf :atopcalcite
[JENKINS] Archiving <https://builds.apache.org/job/Kylin-Master-JDK-1.8/ws/server/pom.xml>
to org.apache.kylin/kylin-server/2.1.0-SNAPSHOT/kylin-server-2.1.0-SNAPSHOT.pom
[JENKINS] Archiving <https://builds.apache.org/job/Kylin-Master-JDK-1.8/ws/jdbc/pom.xml>
to org.apache.kylin/kylin-jdbc/2.1.0-SNAPSHOT/kylin-jdbc-2.1.0-SNAPSHOT.pom
[JENKINS] Archiving <https://builds.apache.org/job/Kylin-Master-JDK-1.8/ws/core-metadata/pom.xml>
to org.apache.kylin/kylin-core-metadata/2.1.0-SNAPSHOT/kylin-core-metadata-2.1.0-SNAPSHOT.pom
[JENKINS] Archiving <https://builds.apache.org/job/Kylin-Master-JDK-1.8/ws/storage-hbase/pom.xml>
to org.apache.kylin/kylin-storage-hbase/2.1.0-SNAPSHOT/kylin-storage-hbase-2.1.0-SNAPSHOT.pom
[JENKINS] Archiving <https://builds.apache.org/job/Kylin-Master-JDK-1.8/ws/server-base/pom.xml>
to org.apache.kylin/kylin-server-base/2.1.0-SNAPSHOT/kylin-server-base-2.1.0-SNAPSHOT.pom
[JENKINS] Archiving <https://builds.apache.org/job/Kylin-Master-JDK-1.8/ws/source-hive/pom.xml>
to org.apache.kylin/kylin-source-hive/2.1.0-SNAPSHOT/kylin-source-hive-2.1.0-SNAPSHOT.pom
[JENKINS] Archiving <https://builds.apache.org/job/Kylin-Master-JDK-1.8/ws/core-job/pom.xml>
to org.apache.kylin/kylin-core-job/2.1.0-SNAPSHOT/kylin-core-job-2.1.0-SNAPSHOT.pom
[JENKINS] Archiving <https://builds.apache.org/job/Kylin-Master-JDK-1.8/ws/atopcalcite/pom.xml>
to org.apache.kylin/atopcalcite/2.1.0-SNAPSHOT/atopcalcite-2.1.0-SNAPSHOT.pom
[JENKINS] Archiving <https://builds.apache.org/job/Kylin-Master-JDK-1.8/ws/tool/pom.xml>
to org.apache.kylin/kylin-tool/2.1.0-SNAPSHOT/kylin-tool-2.1.0-SNAPSHOT.pom
[JENKINS] Archiving <https://builds.apache.org/job/Kylin-Master-JDK-1.8/ws/tomcat-ext/pom.xml>
to org.apache.kylin/kylin-tomcat-ext/2.1.0-SNAPSHOT/kylin-tomcat-ext-2.1.0-SNAPSHOT.pom
[JENKINS] Archiving <https://builds.apache.org/job/Kylin-Master-JDK-1.8/ws/pom.xml>
to org.apache.kylin/kylin/2.1.0-SNAPSHOT/kylin-2.1.0-SNAPSHOT.pom
Compressed 65.68 KB of artifacts by 97.4% relative to #430
[JENKINS] Archiving <https://builds.apache.org/job/Kylin-Master-JDK-1.8/ws/engine-spark/pom.xml>
to org.apache.kylin/kylin-engine-spark/2.1.0-SNAPSHOT/kylin-engine-spark-2.1.0-SNAPSHOT.pom
[JENKINS] Archiving <https://builds.apache.org/job/Kylin-Master-JDK-1.8/ws/core-cube/pom.xml>
to org.apache.kylin/kylin-core-cube/2.1.0-SNAPSHOT/kylin-core-cube-2.1.0-SNAPSHOT.pom
[JENKINS] Archiving <https://builds.apache.org/job/Kylin-Master-JDK-1.8/ws/assembly/pom.xml>
to org.apache.kylin/kylin-assembly/2.1.0-SNAPSHOT/kylin-assembly-2.1.0-SNAPSHOT.pom
[JENKINS] Archiving <https://builds.apache.org/job/Kylin-Master-JDK-1.8/ws/core-common/pom.xml>
to org.apache.kylin/kylin-core-common/2.1.0-SNAPSHOT/kylin-core-common-2.1.0-SNAPSHOT.pom
[JENKINS] Archiving <https://builds.apache.org/job/Kylin-Master-JDK-1.8/ws/source-kafka/pom.xml>
to org.apache.kylin/kylin-source-kafka/2.1.0-SNAPSHOT/kylin-source-kafka-2.1.0-SNAPSHOT.pom
[JENKINS] Archiving <https://builds.apache.org/job/Kylin-Master-JDK-1.8/ws/tool-assembly/pom.xml>
to org.apache.kylin/kylin-tool-assembly/2.1.0-SNAPSHOT/kylin-tool-assembly-2.1.0-SNAPSHOT.pom
[JENKINS] Archiving <https://builds.apache.org/job/Kylin-Master-JDK-1.8/ws/query/pom.xml>
to org.apache.kylin/kylin-query/2.1.0-SNAPSHOT/kylin-query-2.1.0-SNAPSHOT.pom
[JENKINS] Archiving <https://builds.apache.org/job/Kylin-Master-JDK-1.8/ws/kylin-it/pom.xml>
to org.apache.kylin/kylin-it/2.1.0-SNAPSHOT/kylin-it-2.1.0-SNAPSHOT.pom
[JENKINS] Archiving <https://builds.apache.org/job/Kylin-Master-JDK-1.8/ws/core-dictionary/pom.xml>
to org.apache.kylin/kylin-core-dictionary/2.1.0-SNAPSHOT/kylin-core-dictionary-2.1.0-SNAPSHOT.pom
[JENKINS] Archiving <https://builds.apache.org/job/Kylin-Master-JDK-1.8/ws/core-storage/pom.xml>
to org.apache.kylin/kylin-core-storage/2.1.0-SNAPSHOT/kylin-core-storage-2.1.0-SNAPSHOT.pom
[JENKINS] Archiving <https://builds.apache.org/job/Kylin-Master-JDK-1.8/ws/engine-mr/pom.xml>
to org.apache.kylin/kylin-engine-mr/2.1.0-SNAPSHOT/kylin-engine-mr-2.1.0-SNAPSHOT.pom
channel stopped
Not sending mail to unregistered user 958034172@qq.com
Not sending mail to unregistered user chunen.ni@kyligence.io
Not sending mail to unregistered user ma@kyligence.io

Mime
View raw message