kylin-commits mailing list archives

Site index · List index
Message view « Date » · « Thread »
Top « Date » · « Thread »
From Apache Jenkins Server <jenk...@builds.apache.org>
Subject Build failed in Jenkins: Kylin-Master-SonarQube #14
Date Thu, 29 Dec 2016 00:22:35 GMT
See <https://builds.apache.org/job/Kylin-Master-SonarQube/14/changes>

Changes:

[liyang] KYLIN-2330 fix CubeDesc returning redundant DeriveInfo

------------------------------------------
Started by upstream project "Kylin-Master-JDK-1.7" build number 14
originally caused by:
 Started by timer
[EnvInject] - Loading node environment variables.
Building remotely on H18 (ubuntu) in workspace <https://builds.apache.org/job/Kylin-Master-SonarQube/ws/>
 > git rev-parse --is-inside-work-tree # timeout=10
Fetching changes from the remote Git repository
 > git config remote.origin.url https://git-wip-us.apache.org/repos/asf/kylin.git # timeout=10
Fetching upstream changes from https://git-wip-us.apache.org/repos/asf/kylin.git
 > git --version # timeout=10
 > git -c core.askpass=true fetch --tags --progress https://git-wip-us.apache.org/repos/asf/kylin.git
+refs/heads/*:refs/remotes/origin/*
 > git rev-parse refs/remotes/origin/master^{commit} # timeout=10
 > git rev-parse refs/remotes/origin/origin/master^{commit} # timeout=10
Checking out Revision 1a190ecfcaad88e2551c5aff3bd4938719ba46a6 (refs/remotes/origin/master)
 > git config core.sparsecheckout # timeout=10
 > git checkout -f 1a190ecfcaad88e2551c5aff3bd4938719ba46a6
 > git rev-list fdecf0937802a2d17418595e6c0543c9668ac8a4 # timeout=10
Injecting SonarQube environment variables using the configuration: ASF Sonar Analysis
Parsing POMs
Established TCP socket on 38795
maven32-agent.jar already up to date
maven32-interceptor.jar already up to date
maven3-interceptor-commons.jar already up to date
[Kylin-Master-SonarQube] $ /home/jenkins/tools/java/latest1.7/bin/java -Xmx2g -Xms256m -XX:MaxPermSize=512m
-cp /home/jenkins/jenkins-slave/maven32-agent.jar:/home/jenkins/tools/maven/latest3/boot/plexus-classworlds-2.5.2.jar:/home/jenkins/tools/maven/latest3/conf/logging
jenkins.maven3.agent.Maven32Main /home/jenkins/tools/maven/latest3/ /home/jenkins/jenkins-slave/slave.jar
/home/jenkins/jenkins-slave/maven32-interceptor.jar /home/jenkins/jenkins-slave/maven3-interceptor-commons.jar
38795
<===[JENKINS REMOTING CAPACITY]===>   channel started
Executing Maven:  -B -f <https://builds.apache.org/job/Kylin-Master-SonarQube/ws/pom.xml>
-Dmaven.repo.local=/home/jenkins/jenkins-slave/maven-repositories/1 clean compile
[INFO] Scanning for projects...
[INFO] ------------------------------------------------------------------------
[INFO] Reactor Build Order:
[INFO] 
[INFO] Apache Kylin
[INFO] Apache Kylin - Calcite Overrides
[INFO] Apache Kylin - Core Common
[INFO] Apache Kylin - Core Metadata
[INFO] Apache Kylin - Core Dictionary
[INFO] Apache Kylin - Core Cube
[INFO] Apache Kylin - Core Job
[INFO] Apache Kylin - Core Storage
[INFO] Apache Kylin - MapReduce Engine
[INFO] Apache Kylin - HBase Storage
[INFO] Apache Kylin - Spark Engine
[INFO] Apache Kylin - Hive Source
[INFO] Apache Kylin - Kafka Source
[INFO] Apache Kylin - Query
[INFO] Apache Kylin - Tool
[INFO] Apache Kylin - REST Server Base
[INFO] Apache Kylin - REST Server
[INFO] Apache Kylin - JDBC Driver
[INFO] Apache Kylin - Assembly
[INFO] Apache Kylin - Integration Test
[INFO] Apache Kylin - Tomcat Extension
[INFO]                                                                         
[INFO] ------------------------------------------------------------------------
[INFO] Building Apache Kylin 1.6.1-SNAPSHOT
[INFO] ------------------------------------------------------------------------
[INFO] 
[INFO] --- maven-clean-plugin:2.5:clean (default-clean) @ kylin ---
[INFO] Deleting <https://builds.apache.org/job/Kylin-Master-SonarQube/ws/target>
[INFO] 
[INFO] --- maven-checkstyle-plugin:2.17:check (check-style) @ kylin ---
[INFO] Starting audit...
Audit done.
[INFO] 
[INFO] --- maven-remote-resources-plugin:1.5:process (default) @ kylin ---
[INFO]                                                                         
[INFO] ------------------------------------------------------------------------
[INFO] Building Apache Kylin - Calcite Overrides 1.6.1-SNAPSHOT
[INFO] ------------------------------------------------------------------------
[INFO] 
[INFO] --- maven-clean-plugin:2.5:clean (default-clean) @ atopcalcite ---
[INFO] Deleting <https://builds.apache.org/job/Kylin-Master-SonarQube/ws/atopcalcite/target>
[INFO] 
[INFO] --- maven-checkstyle-plugin:2.17:check (check-style) @ atopcalcite ---
[INFO] Starting audit...
Audit done.
[INFO] 
[INFO] --- maven-remote-resources-plugin:1.5:process (default) @ atopcalcite ---
[INFO] 
[INFO] --- maven-resources-plugin:3.0.1:resources (default-resources) @ atopcalcite ---
[INFO] Using 'UTF-8' encoding to copy filtered resources.
[INFO] skip non existing resourceDirectory <https://builds.apache.org/job/Kylin-Master-SonarQube/ws/atopcalcite/src/main/resources>
[INFO] Copying 3 resources
[INFO] 
[INFO] --- maven-compiler-plugin:3.5.1:compile (default-compile) @ atopcalcite ---
[INFO] Changes detected - recompiling the module!
[INFO] Compiling 6 source files to <https://builds.apache.org/job/Kylin-Master-SonarQube/ws/atopcalcite/target/classes>
[INFO]                                                                         
[INFO] ------------------------------------------------------------------------
[INFO] Building Apache Kylin - Core Common 1.6.1-SNAPSHOT
[INFO] ------------------------------------------------------------------------
[INFO] 
[INFO] --- maven-clean-plugin:2.5:clean (default-clean) @ kylin-core-common ---
[INFO] Deleting <https://builds.apache.org/job/Kylin-Master-SonarQube/ws/core-common/target>
[INFO] 
[INFO] --- maven-checkstyle-plugin:2.17:check (check-style) @ kylin-core-common ---
[INFO] Starting audit...
Audit done.
[INFO] 
[INFO] --- maven-remote-resources-plugin:1.5:process (default) @ kylin-core-common ---
[INFO] 
[INFO] --- maven-resources-plugin:3.0.1:resources (default-resources) @ kylin-core-common
---
[INFO] Using 'UTF-8' encoding to copy filtered resources.
[INFO] Copying 1 resource
[INFO] Copying 3 resources
[INFO] 
[INFO] --- maven-compiler-plugin:3.5.1:compile (default-compile) @ kylin-core-common ---
[INFO] Changes detected - recompiling the module!
[INFO] Compiling 73 source files to <https://builds.apache.org/job/Kylin-Master-SonarQube/ws/core-common/target/classes>
[WARNING] <https://builds.apache.org/job/Kylin-Master-SonarQube/ws/core-common/src/main/java/org/apache/kylin/common/util/Bytes.java>:[44,15]
Unsafe is internal proprietary API and may be removed in a future release
[WARNING] <https://builds.apache.org/job/Kylin-Master-SonarQube/ws/core-common/src/main/java/org/apache/kylin/common/util/Bytes.java>:[1033,25]
Unsafe is internal proprietary API and may be removed in a future release
[WARNING] <https://builds.apache.org/job/Kylin-Master-SonarQube/ws/core-common/src/main/java/org/apache/kylin/common/util/Bytes.java>:[1041,29]
Unsafe is internal proprietary API and may be removed in a future release
[WARNING] <https://builds.apache.org/job/Kylin-Master-SonarQube/ws/core-common/src/main/java/org/apache/kylin/common/util/Bytes.java>:[1045,38]
Unsafe is internal proprietary API and may be removed in a future release
[INFO]                                                                         
[INFO] ------------------------------------------------------------------------
[INFO] Building Apache Kylin - Core Metadata 1.6.1-SNAPSHOT
[INFO] ------------------------------------------------------------------------
[INFO] Downloading: http://repository.apache.org/snapshots/org/apache/kylin/kylin-core-common/1.6.1-SNAPSHOT/maven-metadata.xml
[INFO] Downloading: http://conjars.org/repo/org/apache/kylin/kylin-core-common/1.6.1-SNAPSHOT/maven-metadata.xml
[INFO] Downloading: http://conjars.org/repo/org/apache/kylin/kylin-core-common/1.6.1-SNAPSHOT/kylin-core-common-1.6.1-SNAPSHOT-tests.jar
[INFO] Downloading: http://repository.apache.org/snapshots/org/apache/kylin/kylin-core-common/1.6.1-SNAPSHOT/kylin-core-common-1.6.1-SNAPSHOT-tests.jar
[INFO] ------------------------------------------------------------------------
[INFO] Reactor Summary:
[INFO] 
[INFO] Apache Kylin ....................................... SUCCESS [  2.943 s]
[INFO] Apache Kylin - Calcite Overrides ................... SUCCESS [  5.127 s]
[INFO] Apache Kylin - Core Common ......................... SUCCESS [  4.378 s]
[INFO] Apache Kylin - Core Metadata ....................... FAILURE [  0.975 s]
[INFO] Apache Kylin - Core Dictionary ..................... SKIPPED
[INFO] Apache Kylin - Core Cube ........................... SKIPPED
[INFO] Apache Kylin - Core Job ............................ SKIPPED
[INFO] Apache Kylin - Core Storage ........................ SKIPPED
[INFO] Apache Kylin - MapReduce Engine .................... SKIPPED
[INFO] Apache Kylin - HBase Storage ....................... SKIPPED
[INFO] Apache Kylin - Spark Engine ........................ SKIPPED
[INFO] Apache Kylin - Hive Source ......................... SKIPPED
[INFO] Apache Kylin - Kafka Source ........................ SKIPPED
[INFO] Apache Kylin - Query ............................... SKIPPED
[INFO] Apache Kylin - Tool ................................ SKIPPED
[INFO] Apache Kylin - REST Server Base .................... SKIPPED
[INFO] Apache Kylin - REST Server ......................... SKIPPED
[INFO] Apache Kylin - JDBC Driver ......................... SKIPPED
[INFO] Apache Kylin - Assembly ............................ SKIPPED
[INFO] Apache Kylin - Integration Test .................... SKIPPED
[INFO] Apache Kylin - Tomcat Extension .................... SKIPPED
[INFO] ------------------------------------------------------------------------
[INFO] BUILD FAILURE
[INFO] ------------------------------------------------------------------------
[INFO] Total time: 19.343 s
[INFO] Finished at: 2016-12-29T00:22:38+00:00
[INFO] Final Memory: 40M/709M
[INFO] ------------------------------------------------------------------------
Waiting for Jenkins to finish collecting data
[ERROR] Failed to execute goal on project kylin-core-metadata: Could not resolve dependencies
for project org.apache.kylin:kylin-core-metadata:jar:1.6.1-SNAPSHOT: Could not find artifact
org.apache.kylin:kylin-core-common:jar:tests:1.6.1-SNAPSHOT in conjars (http://conjars.org/repo/)
-> [Help 1]
[ERROR] 
[ERROR] To see the full stack trace of the errors, re-run Maven with the -e switch.
[ERROR] Re-run Maven using the -X switch to enable full debug logging.
[ERROR] 
[ERROR] For more information about the errors and possible solutions, please read the following
articles:
[ERROR] [Help 1] http://cwiki.apache.org/confluence/display/MAVEN/DependencyResolutionException
[ERROR] 
[ERROR] After correcting the problems, you can resume the build with the command
[ERROR]   mvn <goals> -rf :kylin-core-metadata
[JENKINS] Archiving <https://builds.apache.org/job/Kylin-Master-SonarQube/ws/server/pom.xml>
to org.apache.kylin/kylin-server/1.6.1-SNAPSHOT/kylin-server-1.6.1-SNAPSHOT.pom
[JENKINS] Archiving <https://builds.apache.org/job/Kylin-Master-SonarQube/ws/jdbc/pom.xml>
to org.apache.kylin/kylin-jdbc/1.6.1-SNAPSHOT/kylin-jdbc-1.6.1-SNAPSHOT.pom
[JENKINS] Archiving <https://builds.apache.org/job/Kylin-Master-SonarQube/ws/core-metadata/pom.xml>
to org.apache.kylin/kylin-core-metadata/1.6.1-SNAPSHOT/kylin-core-metadata-1.6.1-SNAPSHOT.pom
[JENKINS] Archiving <https://builds.apache.org/job/Kylin-Master-SonarQube/ws/storage-hbase/pom.xml>
to org.apache.kylin/kylin-storage-hbase/1.6.1-SNAPSHOT/kylin-storage-hbase-1.6.1-SNAPSHOT.pom
[JENKINS] Archiving <https://builds.apache.org/job/Kylin-Master-SonarQube/ws/server-base/pom.xml>
to org.apache.kylin/kylin-server-base/1.6.1-SNAPSHOT/kylin-server-base-1.6.1-SNAPSHOT.pom
[JENKINS] Archiving <https://builds.apache.org/job/Kylin-Master-SonarQube/ws/source-hive/pom.xml>
to org.apache.kylin/kylin-source-hive/1.6.1-SNAPSHOT/kylin-source-hive-1.6.1-SNAPSHOT.pom
[JENKINS] Archiving <https://builds.apache.org/job/Kylin-Master-SonarQube/ws/core-job/pom.xml>
to org.apache.kylin/kylin-core-job/1.6.1-SNAPSHOT/kylin-core-job-1.6.1-SNAPSHOT.pom
[JENKINS] Archiving <https://builds.apache.org/job/Kylin-Master-SonarQube/ws/atopcalcite/pom.xml>
to org.apache.kylin/atopcalcite/1.6.1-SNAPSHOT/atopcalcite-1.6.1-SNAPSHOT.pom
[JENKINS] Archiving <https://builds.apache.org/job/Kylin-Master-SonarQube/ws/tool/pom.xml>
to org.apache.kylin/kylin-tool/1.6.1-SNAPSHOT/kylin-tool-1.6.1-SNAPSHOT.pom
[JENKINS] Archiving <https://builds.apache.org/job/Kylin-Master-SonarQube/ws/tomcat-ext/pom.xml>
to org.apache.kylin/kylin-tomcat-ext/1.6.1-SNAPSHOT/kylin-tomcat-ext-1.6.1-SNAPSHOT.pom
[JENKINS] Archiving <https://builds.apache.org/job/Kylin-Master-SonarQube/ws/pom.xml>
to org.apache.kylin/kylin/1.6.1-SNAPSHOT/kylin-1.6.1-SNAPSHOT.pom
Compressed 55.85 KB of artifacts by 57.3% relative to #13
[JENKINS] Archiving <https://builds.apache.org/job/Kylin-Master-SonarQube/ws/engine-spark/pom.xml>
to org.apache.kylin/kylin-engine-spark/1.6.1-SNAPSHOT/kylin-engine-spark-1.6.1-SNAPSHOT.pom
[JENKINS] Archiving <https://builds.apache.org/job/Kylin-Master-SonarQube/ws/core-cube/pom.xml>
to org.apache.kylin/kylin-core-cube/1.6.1-SNAPSHOT/kylin-core-cube-1.6.1-SNAPSHOT.pom
[JENKINS] Archiving <https://builds.apache.org/job/Kylin-Master-SonarQube/ws/assembly/pom.xml>
to org.apache.kylin/kylin-assembly/1.6.1-SNAPSHOT/kylin-assembly-1.6.1-SNAPSHOT.pom
[JENKINS] Archiving <https://builds.apache.org/job/Kylin-Master-SonarQube/ws/core-common/pom.xml>
to org.apache.kylin/kylin-core-common/1.6.1-SNAPSHOT/kylin-core-common-1.6.1-SNAPSHOT.pom
[JENKINS] Archiving <https://builds.apache.org/job/Kylin-Master-SonarQube/ws/source-kafka/pom.xml>
to org.apache.kylin/kylin-source-kafka/1.6.1-SNAPSHOT/kylin-source-kafka-1.6.1-SNAPSHOT.pom
[JENKINS] Archiving <https://builds.apache.org/job/Kylin-Master-SonarQube/ws/query/pom.xml>
to org.apache.kylin/kylin-query/1.6.1-SNAPSHOT/kylin-query-1.6.1-SNAPSHOT.pom
[JENKINS] Archiving <https://builds.apache.org/job/Kylin-Master-SonarQube/ws/kylin-it/pom.xml>
to org.apache.kylin/kylin-it/1.6.1-SNAPSHOT/kylin-it-1.6.1-SNAPSHOT.pom
[JENKINS] Archiving <https://builds.apache.org/job/Kylin-Master-SonarQube/ws/core-dictionary/pom.xml>
to org.apache.kylin/kylin-core-dictionary/1.6.1-SNAPSHOT/kylin-core-dictionary-1.6.1-SNAPSHOT.pom
[JENKINS] Archiving <https://builds.apache.org/job/Kylin-Master-SonarQube/ws/core-storage/pom.xml>
to org.apache.kylin/kylin-core-storage/1.6.1-SNAPSHOT/kylin-core-storage-1.6.1-SNAPSHOT.pom
[JENKINS] Archiving <https://builds.apache.org/job/Kylin-Master-SonarQube/ws/engine-mr/pom.xml>
to org.apache.kylin/kylin-engine-mr/1.6.1-SNAPSHOT/kylin-engine-mr-1.6.1-SNAPSHOT.pom
channel stopped

Mime
View raw message