karaf-issues mailing list archives

Site index · List index
Message view « Date » · « Thread »
Top « Date » · « Thread »
From "James Carman (JIRA)" <j...@apache.org>
Subject [jira] [Commented] (KARAF-4006) karaf-maven-plugin does not seem to use the local repository
Date Wed, 02 Mar 2016 23:53:18 GMT

    [ https://issues.apache.org/jira/browse/KARAF-4006?page=com.atlassian.jira.plugin.system.issuetabpanels:comment-tabpanel&focusedCommentId=15176742#comment-15176742
] 

James Carman commented on KARAF-4006:
-------------------------------------

Is it necessary to set the localRepository property for it to use it?  Or does this "just
work"?  I'm having failures with 4.0.4 after upgrading from 3.0.5 which worked flawlessly.
 I am not setting localRepository yet, because we didn't have to before.  Regression?

> karaf-maven-plugin does not seem to use the local repository
> ------------------------------------------------------------
>
>                 Key: KARAF-4006
>                 URL: https://issues.apache.org/jira/browse/KARAF-4006
>             Project: Karaf
>          Issue Type: Bug
>          Components: karaf-tooling
>    Affects Versions: 4.0.1
>            Reporter: Christian Schneider
>            Assignee: Guillaume Nodet
>             Fix For: 4.0.2
>
>
> I am using the karaf-maven-plugin to verify the Aries JPA feature for karaf.
> After the release I get a build error on jenkins there. As this was the first build for
this version the artifact is not yet in apache snapshot repo.
> For these kinds of build to work we must make sure that the plugin by default also uses
the local repository the build uses.
> Also see https://builds.apache.org/job/Aries-JPA-Trunk-JDK7/53/console
> [INFO] ------------------------------------------------------------------------
> [INFO] Building Apache Aries JPA features 2.3.0-SNAPSHOT
> [INFO] ------------------------------------------------------------------------
> [INFO] 
> [INFO] --- maven-clean-plugin:2.5:clean (default-clean) @ jpa-features ---
> [INFO] Deleting /home/jenkins/jenkins-slave/workspace/Aries-JPA-Trunk-JDK7/jpa-features/target
> [INFO] 
> [INFO] --- maven-remote-resources-plugin:1.5:process (default) @ jpa-features ---
> [INFO] 
> [INFO] --- karaf-maven-plugin:4.0.1:features-generate-descriptor (compile) @ jpa-features
---
> [INFO] Generating feature descriptor file /home/jenkins/jenkins-slave/workspace/Aries-JPA-Trunk-JDK7/jpa-features/target/feature/feature.xml
> [INFO] ...done!
> [INFO] 
> [INFO] --- karaf-maven-plugin:4.0.1:verify (verify) @ jpa-features ---
> [INFO] Using repositories: http://repository.apache.org/snapshots@id=Nexus@noreleases@snapshots,https://repo.maven.apache.org/maven2@id=central
> [INFO] Verification of feature persistence-api/2.0.0 succeeded
> [INFO] Verification of feature persistence-api/2.1.0 succeeded
> [WARNING] Error resolving artifactorg.apache.aries.jpa:org.apache.aries.jpa.blueprint:jar:2.3.0-SNAPSHOT:Could
not find artifact org.apache.aries.jpa:org.apache.aries.jpa.blueprint:jar:2.3.0-SNAPSHOT in
Nexus (http://repository.apache.org/snapshots/)
> shaded.org.eclipse.aether.resolution.ArtifactResolutionException: Could not find artifact
org.apache.aries.jpa:org.apache.aries.jpa.blueprint:jar:2.3.0-SNAPSHOT in Nexus (http://repository.apache.org/snapshots/)
> 	at shaded.org.eclipse.aether.internal.impl.DefaultArtifactResolver.resolve(DefaultArtifactResolver.java:444)
> 	at shaded.org.eclipse.aether.internal.impl.DefaultArtifactResolver.resolveArtifacts(DefaultArtifactResolver.java:246)
> 	at shaded.org.eclipse.aether.internal.impl.DefaultArtifactResolver.resolveArtifact(DefaultArtifactResolver.java:223)
> 	at shaded.org.eclipse.aether.internal.impl.DefaultRepositorySystem.resolveArtifact(DefaultRepositorySystem.java:294)
> 	at org.ops4j.pax.url.mvn.internal.AetherBasedResolver.resolve(AetherBasedResolver.java:573)
> 	at org.ops4j.pax.url.mvn.internal.AetherBasedResolver.resolve(AetherBasedResolver.java:528)
> 	at org.ops4j.pax.url.mvn.internal.AetherBasedResolver.resolve(AetherBasedResolver.java:506)
> 	at org.ops4j.pax.url.mvn.internal.AetherBasedResolver.resolve(AetherBasedResolver.java:481)
> 	at org.apache.karaf.features.internal.download.impl.MavenDownloadTask.download(MavenDownloadTask.java:34)
> 	at org.apache.karaf.features.internal.download.impl.AbstractRetryableDownloadTask.run(AbstractRetryableDownloadTask.java:58)
> 	at java.util.concurrent.Executors$RunnableAdapter.call(Executors.java:471)
> 	at java.util.concurrent.FutureTask$Sync.innerRun(FutureTask.java:334)
> 	at java.util.concurrent.FutureTask.run(FutureTask.java:166)
> 	at java.util.concurrent.ScheduledThreadPoolExecutor$ScheduledFutureTask.access$201(ScheduledThreadPoolExecutor.java:178)
> 	at java.util.concurrent.ScheduledThreadPoolExecutor$ScheduledFutureTask.run(ScheduledThreadPoolExecutor.java:292)
> 	at java.util.concurrent.ThreadPoolExecutor.runWorker(ThreadPoolExecutor.java:1145)
> 	at java.util.concurrent.ThreadPoolExecutor$Worker.run(ThreadPoolExecutor.java:615)
> 	at java.lang.Thread.run(Thread.java:724)
> Caused by: shaded.org.eclipse.aether.transfer.ArtifactNotFoundException: Could not find
artifact org.apache.aries.jpa:org.apache.aries.jpa.blueprint:jar:2.3.0-SNAPSHOT in Nexus (http://repository.apache.org/snapshots/)
> 	at shaded.org.eclipse.aether.connector.basic.ArtifactTransportListener.transferFailed(ArtifactTransportListener.java:39)
> 	at shaded.org.eclipse.aether.connector.basic.BasicRepositoryConnector$TaskRunner.run(BasicRepositoryConnector.java:355)
> 	at shaded.org.eclipse.aether.util.concurrency.RunnableErrorForwarder$1.run(RunnableErrorForwarder.java:67)
> 	at shaded.org.eclipse.aether.connector.basic.BasicRepositoryConnector$DirectExecutor.execute(BasicRepositoryConnector.java:581)
> 	at shaded.org.eclipse.aether.connector.basic.BasicRepositoryConnector.get(BasicRepositoryConnector.java:249)
> 	at shaded.org.eclipse.aether.internal.impl.DefaultArtifactResolver.performDownloads(DefaultArtifactResolver.java:520)
> 	at shaded.org.eclipse.aether.internal.impl.DefaultArtifactResolver.resolve(DefaultArtifactResolver.java:421)
> 	... 17 more
> [WARNING] 
> org.apache.maven.plugin.MojoExecutionException: Feature resolution failed for [jpa/2.3.0.SNAPSHOT]
> Message: Error
> Repositories: {
> 	file:/home/jenkins/jenkins-slave/workspace/Aries-JPA-Trunk-JDK7/jpa-features/target/feature/feature.xml
> 	mvn:org.apache.karaf.features/framework/4.0.1/xml/features
> }
> Resources: {
> 	file:/home/jenkins/jenkins-slave/workspace/Aries-JPA-Trunk-JDK7/jpa-features/target/feature/feature.xml
> 	mvn:org.apache.aries.jpa/org.apache.aries.jpa.blueprint/2.3.0-SNAPSHOT
> 	mvn:org.apache.felix/org.apache.felix.configadmin/1.8.4
> 	mvn:org.apache.felix/org.apache.felix.fileinstall/3.5.0
> 	mvn:org.apache.geronimo.specs/geronimo-jpa_2.0_spec/1.1
> 	mvn:org.apache.karaf.features/framework/4.0.1/xml/features
> 	mvn:org.apache.karaf.features/org.apache.karaf.features.core/4.0.1
> 	mvn:org.eclipse.persistence/javax.persistence/2.1.0
> 	mvn:org.ops4j.pax.logging/pax-logging-api/1.8.3
> 	mvn:org.ops4j.pax.logging/pax-logging-service/1.8.3
> 	mvn:org.ops4j.pax.url/pax-url-aether/2.4.1
> }
> 	at org.apache.karaf.tooling.VerifyMojo.verifyResolution(VerifyMojo.java:405)
> 	at org.apache.karaf.tooling.VerifyMojo.doExecute(VerifyMojo.java:288)
> 	at org.apache.karaf.tooling.VerifyMojo.execute(VerifyMojo.java:171)
> 	at org.apache.maven.plugin.DefaultBuildPluginManager.executeMojo(DefaultBuildPluginManager.java:132)
> 	at org.apache.maven.lifecycle.internal.MojoExecutor.execute(MojoExecutor.java:208)
> 	at org.apache.maven.lifecycle.internal.MojoExecutor.execute(MojoExecutor.java:153)
> 	at org.apache.maven.lifecycle.internal.MojoExecutor.execute(MojoExecutor.java:145)
> 	at org.apache.maven.lifecycle.internal.LifecycleModuleBuilder.buildProject(LifecycleModuleBuilder.java:116)
> 	at org.apache.maven.lifecycle.internal.LifecycleModuleBuilder.buildProject(LifecycleModuleBuilder.java:80)
> 	at org.apache.maven.lifecycle.internal.builder.singlethreaded.SingleThreadedBuilder.build(SingleThreadedBuilder.java:51)
> 	at org.apache.maven.lifecycle.internal.LifecycleStarter.execute(LifecycleStarter.java:120)
> 	at org.apache.maven.DefaultMaven.doExecute(DefaultMaven.java:355)
> 	at org.apache.maven.DefaultMaven.execute(DefaultMaven.java:155)
> 	at org.jvnet.hudson.maven3.launcher.Maven31Launcher.main(Maven31Launcher.java:132)
> 	at sun.reflect.NativeMethodAccessorImpl.invoke0(Native Method)
> 	at sun.reflect.NativeMethodAccessorImpl.invoke(NativeMethodAccessorImpl.java:57)
> 	at sun.reflect.DelegatingMethodAccessorImpl.invoke(DelegatingMethodAccessorImpl.java:43)
> 	at java.lang.reflect.Method.invoke(Method.java:606)
> 	at org.codehaus.plexus.classworlds.launcher.Launcher.launchStandard(Launcher.java:330)
> 	at org.codehaus.plexus.classworlds.launcher.Launcher.launch(Launcher.java:238)
> 	at jenkins.maven3.agent.Maven31Main.launch(Maven31Main.java:181)
> 	at sun.reflect.NativeMethodAccessorImpl.invoke0(Native Method)
> 	at sun.reflect.NativeMethodAccessorImpl.invoke(NativeMethodAccessorImpl.java:57)
> 	at sun.reflect.DelegatingMethodAccessorImpl.invoke(DelegatingMethodAccessorImpl.java:43)
> 	at java.lang.reflect.Method.invoke(Method.java:606)
> 	at hudson.maven.Maven3Builder.call(Maven3Builder.java:136)
> 	at hudson.maven.Maven3Builder.call(Maven3Builder.java:71)
> 	at hudson.remoting.UserRequest.perform(UserRequest.java:118)
> 	at hudson.remoting.UserRequest.perform(UserRequest.java:48)
> 	at hudson.remoting.Request$2.run(Request.java:328)
> 	at hudson.remoting.InterceptingExecutorService$1.call(InterceptingExecutorService.java:72)
> 	at java.util.concurrent.FutureTask$Sync.innerRun(FutureTask.java:334)
> 	at java.util.concurrent.FutureTask.run(FutureTask.java:166)
> 	at java.util.concurrent.ThreadPoolExecutor.runWorker(ThreadPoolExecutor.java:1145)
> 	at java.util.concurrent.ThreadPoolExecutor$Worker.run(ThreadPoolExecutor.java:615)
> 	at java.lang.Thread.run(Thread.java:724)
> Caused by: org.apache.karaf.features.internal.util.MultiException: Error
> 	at org.apache.karaf.features.internal.download.impl.MavenDownloadManager$MavenDownloader.<init>(MavenDownloadManager.java:84)
> 	at org.apache.karaf.features.internal.download.impl.MavenDownloadManager.createDownloader(MavenDownloadManager.java:72)
> 	at org.apache.karaf.features.internal.region.Subsystem.downloadBundles(Subsystem.java:358)
> 	at org.apache.karaf.features.internal.region.Subsystem.downloadBundles(Subsystem.java:355)
> 	at org.apache.karaf.features.internal.region.Subsystem.downloadBundles(Subsystem.java:355)
> 	at org.apache.karaf.features.internal.region.SubsystemResolver.resolve(SubsystemResolver.java:191)
> 	at org.apache.karaf.features.internal.service.Deployer.deploy(Deployer.java:263)
> 	at org.apache.karaf.tooling.VerifyMojo.verifyResolution(VerifyMojo.java:393)
> 	... 35 more
> 	Suppressed: java.io.IOException: Error downloading mvn:org.apache.aries.jpa/org.apache.aries.jpa.blueprint/2.3.0-SNAPSHOT
> 		at org.apache.karaf.features.internal.download.impl.AbstractRetryableDownloadTask.run(AbstractRetryableDownloadTask.java:67)
> 		at java.util.concurrent.Executors$RunnableAdapter.call(Executors.java:471)
> 		at java.util.concurrent.FutureTask$Sync.innerRun(FutureTask.java:334)
> 		at java.util.concurrent.FutureTask.run(FutureTask.java:166)
> 		at java.util.concurrent.ScheduledThreadPoolExecutor$ScheduledFutureTask.access$201(ScheduledThreadPoolExecutor.java:178)
> 		at java.util.concurrent.ScheduledThreadPoolExecutor$ScheduledFutureTask.run(ScheduledThreadPoolExecutor.java:292)
> 		... 3 more
> 	Caused by: java.io.IOException: Error resolving artifact org.apache.aries.jpa:org.apache.aries.jpa.blueprint:jar:2.3.0-SNAPSHOT:
Could not find artifact org.apache.aries.jpa:org.apache.aries.jpa.blueprint:jar:2.3.0-SNAPSHOT
in Nexus (http://repository.apache.org/snapshots/)
> 		at org.ops4j.pax.url.mvn.internal.AetherBasedResolver.resolve(AetherBasedResolver.java:584)
> 		at org.ops4j.pax.url.mvn.internal.AetherBasedResolver.resolve(AetherBasedResolver.java:528)
> 		at org.ops4j.pax.url.mvn.internal.AetherBasedResolver.resolve(AetherBasedResolver.java:506)
> 		at org.ops4j.pax.url.mvn.internal.AetherBasedResolver.resolve(AetherBasedResolver.java:481)
> 		at org.apache.karaf.features.internal.download.impl.MavenDownloadTask.download(MavenDownloadTask.java:34)
> 		at org.apache.karaf.features.internal.download.impl.AbstractRetryableDownloadTask.run(AbstractRetryableDownloadTask.java:58)
> 		... 8 more
> [WARNING] 
> org.apache.maven.plugin.MojoExecutionException: Feature resolution failed for [jpa/2.3.0.SNAPSHOT,
aries-blueprint]
> Message: Error
> Repositories: {
> 	file:/home/jenkins/jenkins-slave/workspace/Aries-JPA-Trunk-JDK7/jpa-features/target/feature/feature.xml
> 	mvn:org.apache.karaf.features/framework/4.0.1/xml/features
> }
> Resources: {
> 	file:/home/jenkins/jenkins-slave/workspace/Aries-JPA-Trunk-JDK7/jpa-features/target/feature/feature.xml
> 	mvn:org.apache.aries.jpa/org.apache.aries.jpa.blueprint/2.3.0-SNAPSHOT
> 	mvn:org.apache.felix/org.apache.felix.configadmin/1.8.4
> 	mvn:org.apache.felix/org.apache.felix.fileinstall/3.5.0
> 	mvn:org.apache.geronimo.specs/geronimo-jpa_2.0_spec/1.1
> 	mvn:org.apache.karaf.features/framework/4.0.1/xml/features
> 	mvn:org.apache.karaf.features/org.apache.karaf.features.core/4.0.1
> 	mvn:org.eclipse.persistence/javax.persistence/2.1.0
> 	mvn:org.ops4j.pax.logging/pax-logging-api/1.8.3
> 	mvn:org.ops4j.pax.logging/pax-logging-service/1.8.3
> 	mvn:org.ops4j.pax.url/pax-url-aether/2.4.1
> }
> 	at org.apache.karaf.tooling.VerifyMojo.verifyResolution(VerifyMojo.java:405)
> 	at org.apache.karaf.tooling.VerifyMojo.doExecute(VerifyMojo.java:306)
> 	at org.apache.karaf.tooling.VerifyMojo.execute(VerifyMojo.java:171)
> 	at org.apache.maven.plugin.DefaultBuildPluginManager.executeMojo(DefaultBuildPluginManager.java:132)
> 	at org.apache.maven.lifecycle.internal.MojoExecutor.execute(MojoExecutor.java:208)
> 	at org.apache.maven.lifecycle.internal.MojoExecutor.execute(MojoExecutor.java:153)
> 	at org.apache.maven.lifecycle.internal.MojoExecutor.execute(MojoExecutor.java:145)
> 	at org.apache.maven.lifecycle.internal.LifecycleModuleBuilder.buildProject(LifecycleModuleBuilder.java:116)
> 	at org.apache.maven.lifecycle.internal.LifecycleModuleBuilder.buildProject(LifecycleModuleBuilder.java:80)
> 	at org.apache.maven.lifecycle.internal.builder.singlethreaded.SingleThreadedBuilder.build(SingleThreadedBuilder.java:51)
> 	at org.apache.maven.lifecycle.internal.LifecycleStarter.execute(LifecycleStarter.java:120)
> 	at org.apache.maven.DefaultMaven.doExecute(DefaultMaven.java:355)
> 	at org.apache.maven.DefaultMaven.execute(DefaultMaven.java:155)
> 	at org.jvnet.hudson.maven3.launcher.Maven31Launcher.main(Maven31Launcher.java:132)
> 	at sun.reflect.NativeMethodAccessorImpl.invoke0(Native Method)
> 	at sun.reflect.NativeMethodAccessorImpl.invoke(NativeMethodAccessorImpl.java:57)
> 	at sun.reflect.DelegatingMethodAccessorImpl.invoke(DelegatingMethodAccessorImpl.java:43)
> 	at java.lang.reflect.Method.invoke(Method.java:606)
> 	at org.codehaus.plexus.classworlds.launcher.Launcher.launchStandard(Launcher.java:330)
> 	at org.codehaus.plexus.classworlds.launcher.Launcher.launch(Launcher.java:238)
> 	at jenkins.maven3.agent.Maven31Main.launch(Maven31Main.java:181)
> 	at sun.reflect.NativeMethodAccessorImpl.invoke0(Native Method)
> 	at sun.reflect.NativeMethodAccessorImpl.invoke(NativeMethodAccessorImpl.java:57)
> 	at sun.reflect.DelegatingMethodAccessorImpl.invoke(DelegatingMethodAccessorImpl.java:43)
> 	at java.lang.reflect.Method.invoke(Method.java:606)
> 	at hudson.maven.Maven3Builder.call(Maven3Builder.java:136)
> 	at hudson.maven.Maven3Builder.call(Maven3Builder.java:71)
> 	at hudson.remoting.UserRequest.perform(UserRequest.java:118)
> 	at hudson.remoting.UserRequest.perform(UserRequest.java:48)
> 	at hudson.remoting.Request$2.run(Request.java:328)
> 	at hudson.remoting.InterceptingExecutorService$1.call(InterceptingExecutorService.java:72)
> 	at java.util.concurrent.FutureTask$Sync.innerRun(FutureTask.java:334)
> 	at java.util.concurrent.FutureTask.run(FutureTask.java:166)
> 	at java.util.concurrent.ThreadPoolExecutor.runWorker(ThreadPoolExecutor.java:1145)
> 	at java.util.concurrent.ThreadPoolExecutor$Worker.run(ThreadPoolExecutor.java:615)
> 	at java.lang.Thread.run(Thread.java:724)
> Caused by: org.apache.karaf.features.internal.util.MultiException: Error
> 	at org.apache.karaf.features.internal.download.impl.MavenDownloadManager$MavenDownloader.<init>(MavenDownloadManager.java:84)
> 	at org.apache.karaf.features.internal.download.impl.MavenDownloadManager.createDownloader(MavenDownloadManager.java:72)
> 	at org.apache.karaf.features.internal.region.Subsystem.downloadBundles(Subsystem.java:358)
> 	at org.apache.karaf.features.internal.region.Subsystem.downloadBundles(Subsystem.java:355)
> 	at org.apache.karaf.features.internal.region.Subsystem.downloadBundles(Subsystem.java:355)
> 	at org.apache.karaf.features.internal.region.SubsystemResolver.resolve(SubsystemResolver.java:191)
> 	at org.apache.karaf.features.internal.service.Deployer.deploy(Deployer.java:263)
> 	at org.apache.karaf.tooling.VerifyMojo.verifyResolution(VerifyMojo.java:393)
> 	... 35 more
> 	Suppressed: java.io.IOException: Error downloading mvn:org.apache.aries.jpa/org.apache.aries.jpa.blueprint/2.3.0-SNAPSHOT
> 		at org.apache.karaf.features.internal.download.impl.AbstractRetryableDownloadTask.run(AbstractRetryableDownloadTask.java:67)
> 		at java.util.concurrent.Executors$RunnableAdapter.call(Executors.java:471)
> 		at java.util.concurrent.FutureTask$Sync.innerRun(FutureTask.java:334)
> 		at java.util.concurrent.FutureTask.run(FutureTask.java:166)
> 		at java.util.concurrent.ScheduledThreadPoolExecutor$ScheduledFutureTask.access$201(ScheduledThreadPoolExecutor.java:178)
> 		at java.util.concurrent.ScheduledThreadPoolExecutor$ScheduledFutureTask.run(ScheduledThreadPoolExecutor.java:292)
> 		... 3 more
> 	Caused by: java.io.IOException: Error resolving artifact org.apache.aries.jpa:org.apache.aries.jpa.blueprint:jar:2.3.0-SNAPSHOT:
Could not find artifact org.apache.aries.jpa:org.apache.aries.jpa.blueprint:jar:2.3.0-SNAPSHOT
in Nexus (http://repository.apache.org/snapshots/)
> 		at org.ops4j.pax.url.mvn.internal.AetherBasedResolver.resolve(AetherBasedResolver.java:584)
> 		at org.ops4j.pax.url.mvn.internal.AetherBasedResolver.resolve(AetherBasedResolver.java:528)
> 		at org.ops4j.pax.url.mvn.internal.AetherBasedResolver.resolve(AetherBasedResolver.java:506)
> 		at org.ops4j.pax.url.mvn.internal.AetherBasedResolver.resolve(AetherBasedResolver.java:481)
> 		at org.apache.karaf.features.internal.download.impl.MavenDownloadTask.download(MavenDownloadTask.java:34)
> 		at org.apache.karaf.features.internal.download.impl.AbstractRetryableDownloadTask.run(AbstractRetryableDownloadTask.java:58)
> 		... 8 more
> [INFO] Verification of feature framework/4.0.1 succeeded
> [INFO] ------------------------------------------------------------------------
> [INFO] Reactor Summary:
> [INFO] 
> [INFO] Apache Aries JPA parent ............................ SUCCESS [  2.957 s]
> [INFO] Apache Aries JPA Container API ..................... SUCCESS [  4.535 s]
> [INFO] Apache Aries JPA container ......................... SUCCESS [  9.179 s]
> [INFO] Apache Aries JPA support ........................... SUCCESS [  3.761 s]
> [INFO] Apache Aries JPA blueprint ......................... SUCCESS [  2.756 s]
> [INFO] Apache Aries JPA Container adapter for EclipseLink . SUCCESS [  2.714 s]
> [INFO] Apache Aries JPA example parent .................... SUCCESS [  0.411 s]
> [INFO] Apache Aries JPA example tasklist model ............ SUCCESS [  2.097 s]
> [INFO] Apache Aries JPA example tasklist blueprint ........ SUCCESS [  5.884 s]
> [INFO] Apache Aries JPA example tasklist DS ............... SUCCESS [  3.122 s]
> [INFO] Apache Aries JPA features .......................... FAILURE [  4.566 s]
> [INFO] Apache Aries JPA itests parent ..................... SKIPPED
> [INFO] Apache Aries JPA test bundle container ............. SKIPPED
> [INFO] Apache Aries JPA test bundle blueprint integration . SKIPPED
> [INFO] Apache Aries JPA test bundle Eclipselink ........... SKIPPED
> [INFO] Apache Aries JPA iTests ............................ SKIPPED
> [INFO] Apache Aries JPA iTests on Karaf ................... SKIPPED
> [INFO] Apache Aries JPA parent ............................ SKIPPED
> [INFO] ------------------------------------------------------------------------
> [INFO] BUILD FAILURE
> [INFO] ------------------------------------------------------------------------
> [INFO] Total time: 53.059 s
> [INFO] Finished at: 2015-09-22T09:14:07+00:00
> [INFO] Final Memory: 52M/768M
> [INFO] ------------------------------------------------------------------------
> Waiting for Jenkins to finish collecting data[ERROR] Failed to execute goal org.apache.karaf.tooling:karaf-maven-plugin:4.0.1:verify
(verify) on project jpa-features: Verification failures -> [Help 1]
> org.apache.maven.lifecycle.LifecycleExecutionException: Failed to execute goal org.apache.karaf.tooling:karaf-maven-plugin:4.0.1:verify
(verify) on project jpa-features: Verification failures
> 	at org.apache.maven.lifecycle.internal.MojoExecutor.execute(MojoExecutor.java:216)
> 	at org.apache.maven.lifecycle.internal.MojoExecutor.execute(MojoExecutor.java:153)
> 	at org.apache.maven.lifecycle.internal.MojoExecutor.execute(MojoExecutor.java:145)
> 	at org.apache.maven.lifecycle.internal.LifecycleModuleBuilder.buildProject(LifecycleModuleBuilder.java:116)
> 	at org.apache.maven.lifecycle.internal.LifecycleModuleBuilder.buildProject(LifecycleModuleBuilder.java:80)
> 	at org.apache.maven.lifecycle.internal.builder.singlethreaded.SingleThreadedBuilder.build(SingleThreadedBuilder.java:51)
> 	at org.apache.maven.lifecycle.internal.LifecycleStarter.execute(LifecycleStarter.java:120)
> 	at org.apache.maven.DefaultMaven.doExecute(DefaultMaven.java:355)
> 	at org.apache.maven.DefaultMaven.execute(DefaultMaven.java:155)
> 	at org.jvnet.hudson.maven3.launcher.Maven31Launcher.main(Maven31Launcher.java:132)
> 	at sun.reflect.NativeMethodAccessorImpl.invoke0(Native Method)
> 	at sun.reflect.NativeMethodAccessorImpl.invoke(NativeMethodAccessorImpl.java:57)
> 	at sun.reflect.DelegatingMethodAccessorImpl.invoke(DelegatingMethodAccessorImpl.java:43)
> 	at java.lang.reflect.Method.invoke(Method.java:606)
> 	at org.codehaus.plexus.classworlds.launcher.Launcher.launchStandard(Launcher.java:330)
> 	at org.codehaus.plexus.classworlds.launcher.Launcher.launch(Launcher.java:238)
> 	at jenkins.maven3.agent.Maven31Main.launch(Maven31Main.java:181)
> 	at sun.reflect.NativeMethodAccessorImpl.invoke0(Native Method)
> 	at sun.reflect.NativeMethodAccessorImpl.invoke(NativeMethodAccessorImpl.java:57)
> 	at sun.reflect.DelegatingMethodAccessorImpl.invoke(DelegatingMethodAccessorImpl.java:43)
> 	at java.lang.reflect.Method.invoke(Method.java:606)
> 	at hudson.maven.Maven3Builder.call(Maven3Builder.java:136)
> 	at hudson.maven.Maven3Builder.call(Maven3Builder.java:71)
> 	at hudson.remoting.UserRequest.perform(UserRequest.java:118)
> 	at hudson.remoting.UserRequest.perform(UserRequest.java:48)
> 	at hudson.remoting.Request$2.run(Request.java:328)
> 	at hudson.remoting.InterceptingExecutorService$1.call(InterceptingExecutorService.java:72)
> 	at java.util.concurrent.FutureTask$Sync.innerRun(FutureTask.java:334)
> 	at java.util.concurrent.FutureTask.run(FutureTask.java:166)
> 	at java.util.concurrent.ThreadPoolExecutor.runWorker(ThreadPoolExecutor.java:1145)
> 	at java.util.concurrent.ThreadPoolExecutor$Worker.run(ThreadPoolExecutor.java:615)
> 	at java.lang.Thread.run(Thread.java:724)
> Caused by: org.apache.maven.plugin.MojoExecutionException: Verification failures
> 	at org.apache.karaf.tooling.VerifyMojo.doExecute(VerifyMojo.java:336)
> 	at org.apache.karaf.tooling.VerifyMojo.execute(VerifyMojo.java:171)
> 	at org.apache.maven.plugin.DefaultBuildPluginManager.executeMojo(DefaultBuildPluginManager.java:132)
> 	at org.apache.maven.lifecycle.internal.MojoExecutor.execute(MojoExecutor.java:208)
> 	... 31 more
> Caused by: org.apache.karaf.features.internal.util.MultiException: Verification failures
> 	... 35 more
> 	Suppressed: org.apache.maven.plugin.MojoExecutionException: Feature resolution failed
for [jpa/2.3.0.SNAPSHOT]
> Message: Error
> Repositories: {
> 	file:/home/jenkins/jenkins-slave/workspace/Aries-JPA-Trunk-JDK7/jpa-features/target/feature/feature.xml
> 	mvn:org.apache.karaf.features/framework/4.0.1/xml/features
> }
> Resources: {
> 	file:/home/jenkins/jenkins-slave/workspace/Aries-JPA-Trunk-JDK7/jpa-features/target/feature/feature.xml
> 	mvn:org.apache.aries.jpa/org.apache.aries.jpa.blueprint/2.3.0-SNAPSHOT
> 	mvn:org.apache.felix/org.apache.felix.configadmin/1.8.4
> 	mvn:org.apache.felix/org.apache.felix.fileinstall/3.5.0
> 	mvn:org.apache.geronimo.specs/geronimo-jpa_2.0_spec/1.1
> 	mvn:org.apache.karaf.features/framework/4.0.1/xml/features
> 	mvn:org.apache.karaf.features/org.apache.karaf.features.core/4.0.1
> 	mvn:org.eclipse.persistence/javax.persistence/2.1.0
> 	mvn:org.ops4j.pax.logging/pax-logging-api/1.8.3
> 	mvn:org.ops4j.pax.logging/pax-logging-service/1.8.3
> 	mvn:org.ops4j.pax.url/pax-url-aether/2.4.1
> }
> 		at org.apache.karaf.tooling.VerifyMojo.verifyResolution(VerifyMojo.java:405)
> 		at org.apache.karaf.tooling.VerifyMojo.doExecute(VerifyMojo.java:288)
> 		... 34 more
> 	Caused by: org.apache.karaf.features.internal.util.MultiException: Error
> 		at org.apache.karaf.features.internal.download.impl.MavenDownloadManager$MavenDownloader.<init>(MavenDownloadManager.java:84)
> 		at org.apache.karaf.features.internal.download.impl.MavenDownloadManager.createDownloader(MavenDownloadManager.java:72)
> 		at org.apache.karaf.features.internal.region.Subsystem.downloadBundles(Subsystem.java:358)
> 		at org.apache.karaf.features.internal.region.Subsystem.downloadBundles(Subsystem.java:355)
> 		at org.apache.karaf.features.internal.region.Subsystem.downloadBundles(Subsystem.java:355)
> 		at org.apache.karaf.features.internal.region.SubsystemResolver.resolve(SubsystemResolver.java:191)
> 		at org.apache.karaf.features.internal.service.Deployer.deploy(Deployer.java:263)
> 		at org.apache.karaf.tooling.VerifyMojo.verifyResolution(VerifyMojo.java:393)
> 		... 35 more
> 		Suppressed: java.io.IOException: Error downloading mvn:org.apache.aries.jpa/org.apache.aries.jpa.blueprint/2.3.0-SNAPSHOT
> 			at org.apache.karaf.features.internal.download.impl.AbstractRetryableDownloadTask.run(AbstractRetryableDownloadTask.java:67)
> 			at java.util.concurrent.Executors$RunnableAdapter.call(Executors.java:471)
> 			at java.util.concurrent.FutureTask$Sync.innerRun(FutureTask.java:334)
> 			at java.util.concurrent.FutureTask.run(FutureTask.java:166)
> 			at java.util.concurrent.ScheduledThreadPoolExecutor$ScheduledFutureTask.access$201(ScheduledThreadPoolExecutor.java:178)
> 			at java.util.concurrent.ScheduledThreadPoolExecutor$ScheduledFutureTask.run(ScheduledThreadPoolExecutor.java:292)
> 			... 3 more
> 		Caused by: java.io.IOException: Error resolving artifact org.apache.aries.jpa:org.apache.aries.jpa.blueprint:jar:2.3.0-SNAPSHOT:
Could not find artifact org.apache.aries.jpa:org.apache.aries.jpa.blueprint:jar:2.3.0-SNAPSHOT
in Nexus (http://repository.apache.org/snapshots/)
> 			at org.ops4j.pax.url.mvn.internal.AetherBasedResolver.resolve(AetherBasedResolver.java:584)
> 			at org.ops4j.pax.url.mvn.internal.AetherBasedResolver.resolve(AetherBasedResolver.java:528)
> 			at org.ops4j.pax.url.mvn.internal.AetherBasedResolver.resolve(AetherBasedResolver.java:506)
> 			at org.ops4j.pax.url.mvn.internal.AetherBasedResolver.resolve(AetherBasedResolver.java:481)
> 			at org.apache.karaf.features.internal.download.impl.MavenDownloadTask.download(MavenDownloadTask.java:34)
> 			at org.apache.karaf.features.internal.download.impl.AbstractRetryableDownloadTask.run(AbstractRetryableDownloadTask.java:58)
> 			... 8 more
> 	Suppressed: org.apache.maven.plugin.MojoExecutionException: Feature resolution failed
for [jpa/2.3.0.SNAPSHOT, aries-blueprint]
> Message: Error
> Repositories: {
> 	file:/home/jenkins/jenkins-slave/workspace/Aries-JPA-Trunk-JDK7/jpa-features/target/feature/feature.xml
> 	mvn:org.apache.karaf.features/framework/4.0.1/xml/features
> }
> Resources: {
> 	file:/home/jenkins/jenkins-slave/workspace/Aries-JPA-Trunk-JDK7/jpa-features/target/feature/feature.xml
> 	mvn:org.apache.aries.jpa/org.apache.aries.jpa.blueprint/2.3.0-SNAPSHOT
> 	mvn:org.apache.felix/org.apache.felix.configadmin/1.8.4
> 	mvn:org.apache.felix/org.apache.felix.fileinstall/3.5.0
> 	mvn:org.apache.geronimo.specs/geronimo-jpa_2.0_spec/1.1
> 	mvn:org.apache.karaf.features/framework/4.0.1/xml/features
> 	mvn:org.apache.karaf.features/org.apache.karaf.features.core/4.0.1
> 	mvn:org.eclipse.persistence/javax.persistence/2.1.0
> 	mvn:org.ops4j.pax.logging/pax-logging-api/1.8.3
> 	mvn:org.ops4j.pax.logging/pax-logging-service/1.8.3
> 	mvn:org.ops4j.pax.url/pax-url-aether/2.4.1
> }
> 		at org.apache.karaf.tooling.VerifyMojo.verifyResolution(VerifyMojo.java:405)
> 		at org.apache.karaf.tooling.VerifyMojo.doExecute(VerifyMojo.java:306)
> 		... 34 more
> 	Caused by: org.apache.karaf.features.internal.util.MultiException: Error
> 		at org.apache.karaf.features.internal.download.impl.MavenDownloadManager$MavenDownloader.<init>(MavenDownloadManager.java:84)
> 		at org.apache.karaf.features.internal.download.impl.MavenDownloadManager.createDownloader(MavenDownloadManager.java:72)
> 		at org.apache.karaf.features.internal.region.Subsystem.downloadBundles(Subsystem.java:358)
> 		at org.apache.karaf.features.internal.region.Subsystem.downloadBundles(Subsystem.java:355)
> 		at org.apache.karaf.features.internal.region.Subsystem.downloadBundles(Subsystem.java:355)
> 		at org.apache.karaf.features.internal.region.SubsystemResolver.resolve(SubsystemResolver.java:191)
> 		at org.apache.karaf.features.internal.service.Deployer.deploy(Deployer.java:263)
> 		at org.apache.karaf.tooling.VerifyMojo.verifyResolution(VerifyMojo.java:393)
> 		... 35 more
> 	[CIRCULAR REFERENCE:java.io.IOException: Error downloading mvn:org.apache.aries.jpa/org.apache.aries.jpa.blueprint/2.3.0-SNAPSHOT]



--
This message was sent by Atlassian JIRA
(v6.3.4#6332)

Mime
View raw message