karaf-dev mailing list archives

Site index · List index
Message view « Date » · « Thread »
Top « Date » · « Thread »
From SvS <DumpAcco...@solcon.nl>
Subject Re: Problem with hibernate-envers 3.x
Date Thu, 20 Mar 2014 13:49:32 GMT
Hi JB,

I didn't need the enterprise feature, but the feature validator has a
problem with the hibernate-envers artifact.

[INFO]  - validation of
mvn:org.apache.karaf.assemblies.features/enterprise/2.3.4/xml/features
Downloading: <...>
/org/hibernate/hibernate-envers/3.3.2.GA/hibernate-envers-3.3.2.GA.jar
<...>
[INFO]
------------------------------------------------------------------------
[INFO] BUILD FAILURE
[INFO]
------------------------------------------------------------------------
<...>
[ERROR] Failed to execute goal
org.apache.karaf.tooling:features-maven-plugin:2.3.4:validate (validate) on
project <...> Could not find artifact
org.hibernate:hibernate-envers:jar:3.3.2.GA in <...>
[ERROR] 

Is there a workaround for it?

Regards,
Sam.



--
View this message in context: http://karaf.922171.n3.nabble.com/Problem-with-hibernate-envers-3-x-tp4031792p4032358.html
Sent from the Karaf - Dev mailing list archive at Nabble.com.

Mime
View raw message