karaf-commits mailing list archives

Site index · List index
Message view « Date » · « Thread »
Top « Date » · « Thread »
From Apache Jenkins Server <jenk...@builds.apache.org>
Subject Build failed in Jenkins: karaf-4.1.x #1200
Date Sun, 06 Oct 2019 17:00:09 GMT
See <https://builds.apache.org/job/karaf-4.1.x/1200/display/redirect>

Changes:


------------------------------------------
Started by timer
Running as SYSTEM
[EnvInject] - Loading node environment variables.
Building remotely on H34 (ubuntu) in workspace <https://builds.apache.org/job/karaf-4.1.x/ws/>
No credentials specified
 > git rev-parse --is-inside-work-tree # timeout=10
Fetching changes from the remote Git repository
 > git config remote.origin.url https://gitbox.apache.org/repos/asf/karaf.git # timeout=10
Fetching upstream changes from https://gitbox.apache.org/repos/asf/karaf.git
 > git --version # timeout=10
 > git fetch --tags --progress -- https://gitbox.apache.org/repos/asf/karaf.git +refs/heads/*:refs/remotes/origin/*
 > git rev-parse refs/remotes/origin/karaf-4.1.x^{commit} # timeout=10
 > git rev-parse refs/remotes/origin/origin/karaf-4.1.x^{commit} # timeout=10
Checking out Revision 05ec02300e3569dcf0b1506de7ad9ae20a9007bb (refs/remotes/origin/karaf-4.1.x)
 > git config core.sparsecheckout # timeout=10
 > git checkout -f 05ec02300e3569dcf0b1506de7ad9ae20a9007bb
Commit message: "[KARAF-6296] Upgrade to Jasypt 1.9.3"
 > git rev-list --no-walk 05ec02300e3569dcf0b1506de7ad9ae20a9007bb # timeout=10
Parsing POMs
ERROR: Failed to parse POMs
hudson.remoting.ProxyException: hudson.maven.MavenModuleSetBuild$MavenExecutionException:
org.apache.maven.project.ProjectBuildingException: Some problems were encountered while processing
the POMs:
[FATAL] Non-resolvable parent POM for org.apache.karaf:manual:[unknown-version]: Could not
find artifact org.apache.karaf:karaf:pom:4.1.7-SNAPSHOT and 'parent.relativePath' points at
wrong local POM @ line 17, column 10
[WARNING] 'build.plugins.plugin.(groupId:artifactId)' must be unique but found duplicate declaration
of plugin org.apache.maven.plugins:maven-resources-plugin @ org.apache.karaf.instance:org.apache.karaf.instance.core:[unknown-version],
<https://builds.apache.org/job/karaf-4.1.x/ws/instance/pom.xml,> line 177, column 21

	at hudson.maven.MavenModuleSetBuild$PomParser.invoke(MavenModuleSetBuild.java:1390)
	at hudson.maven.MavenModuleSetBuild$PomParser.invoke(MavenModuleSetBuild.java:1126)
	at hudson.FilePath$FileCallableWrapper.call(FilePath.java:3052)
	at hudson.remoting.UserRequest.perform(UserRequest.java:212)
	at hudson.remoting.UserRequest.perform(UserRequest.java:54)
	at hudson.remoting.Request$2.run(Request.java:369)
	at hudson.remoting.InterceptingExecutorService$1.call(InterceptingExecutorService.java:72)
	at java.util.concurrent.FutureTask.run(FutureTask.java:266)
	at java.util.concurrent.ThreadPoolExecutor.runWorker(ThreadPoolExecutor.java:1149)
	at java.util.concurrent.ThreadPoolExecutor$Worker.run(ThreadPoolExecutor.java:624)
	at java.lang.Thread.run(Thread.java:748)
	Suppressed: hudson.remoting.Channel$CallSiteStackTrace: Remote call to H34
		at hudson.remoting.Channel.attachCallSiteStackTrace(Channel.java:1743)
		at hudson.remoting.UserRequest$ExceptionResponse.retrieve(UserRequest.java:357)
		at hudson.remoting.Channel.call(Channel.java:957)
		at hudson.FilePath.act(FilePath.java:1072)
		at hudson.FilePath.act(FilePath.java:1061)
		at hudson.maven.MavenModuleSetBuild$MavenModuleSetBuildExecution.parsePoms(MavenModuleSetBuild.java:987)
		at hudson.maven.MavenModuleSetBuild$MavenModuleSetBuildExecution.doRun(MavenModuleSetBuild.java:691)
		at hudson.model.AbstractBuild$AbstractBuildExecution.run(AbstractBuild.java:504)
		at hudson.model.Run.execute(Run.java:1815)
		at hudson.maven.MavenModuleSetBuild.run(MavenModuleSetBuild.java:543)
		at hudson.model.ResourceController.execute(ResourceController.java:97)
		at hudson.model.Executor.run(Executor.java:429)
Caused by: hudson.remoting.ProxyException: org.apache.maven.project.ProjectBuildingException:
Some problems were encountered while processing the POMs:
[FATAL] Non-resolvable parent POM for org.apache.karaf:manual:[unknown-version]: Could not
find artifact org.apache.karaf:karaf:pom:4.1.7-SNAPSHOT and 'parent.relativePath' points at
wrong local POM @ line 17, column 10
[WARNING] 'build.plugins.plugin.(groupId:artifactId)' must be unique but found duplicate declaration
of plugin org.apache.maven.plugins:maven-resources-plugin @ org.apache.karaf.instance:org.apache.karaf.instance.core:[unknown-version],
<https://builds.apache.org/job/karaf-4.1.x/ws/instance/pom.xml,> line 177, column 21

	at org.apache.maven.project.DefaultProjectBuilder.build(DefaultProjectBuilder.java:383)
	at hudson.maven.MavenEmbedder.buildProjects(MavenEmbedder.java:370)
	at hudson.maven.MavenEmbedder.readProjects(MavenEmbedder.java:340)
	at hudson.maven.MavenModuleSetBuild$PomParser.invoke(MavenModuleSetBuild.java:1329)
	... 10 more

Mime
View raw message