karaf-commits mailing list archives

Site index · List index
Message view « Date » · « Thread »
Top « Date » · « Thread »
From Apache Jenkins Server <jenk...@builds.apache.org>
Subject Build failed in Jenkins: karaf-4.1.x #1048
Date Mon, 06 May 2019 17:09:47 GMT
See <https://builds.apache.org/job/karaf-4.1.x/1048/display/redirect>

------------------------------------------
[...truncated 103.71 KB...]
Waiting for Jenkins to finish collecting data
[ERROR] Failed to execute goal org.apache.maven.plugins:maven-surefire-plugin:2.18.1:test
(default-test) on project org.apache.karaf.main: Execution default-test of goal org.apache.maven.plugins:maven-surefire-plugin:2.18.1:test
failed: The forked VM terminated without properly saying goodbye. VM crash or System.exit
called?
[ERROR] Command was /bin/sh -c cd <https://builds.apache.org/job/karaf-4.1.x/ws/main>
&& /usr/local/asfpackages/java/jdk1.8.0_191/jre/bin/java -jar <https://builds.apache.org/job/karaf-4.1.x/ws/main/target/surefire/surefirebooter7293284407085396093.jar>
<https://builds.apache.org/job/karaf-4.1.x/ws/main/target/surefire/surefire2445974385137480498tmp>
<https://builds.apache.org/job/karaf-4.1.x/ws/main/target/surefire/surefire_12136072703456011090tmp>
[ERROR] -> [Help 1]
org.apache.maven.lifecycle.LifecycleExecutionException: Failed to execute goal org.apache.maven.plugins:maven-surefire-plugin:2.18.1:test
(default-test) on project org.apache.karaf.main: Execution default-test of goal org.apache.maven.plugins:maven-surefire-plugin:2.18.1:test
failed: The forked VM terminated without properly saying goodbye. VM crash or System.exit
called?
Command was /bin/sh -c cd <https://builds.apache.org/job/karaf-4.1.x/ws/main> &&
/usr/local/asfpackages/java/jdk1.8.0_191/jre/bin/java -jar <https://builds.apache.org/job/karaf-4.1.x/ws/main/target/surefire/surefirebooter7293284407085396093.jar>
<https://builds.apache.org/job/karaf-4.1.x/ws/main/target/surefire/surefire2445974385137480498tmp>
<https://builds.apache.org/job/karaf-4.1.x/ws/main/target/surefire/surefire_12136072703456011090tmp>
    at org.apache.maven.lifecycle.internal.MojoExecutor.execute (MojoExecutor.java:215)
    at org.apache.maven.lifecycle.internal.MojoExecutor.execute (MojoExecutor.java:156)
    at org.apache.maven.lifecycle.internal.MojoExecutor.execute (MojoExecutor.java:148)
    at org.apache.maven.lifecycle.internal.LifecycleModuleBuilder.buildProject (LifecycleModuleBuilder.java:117)
    at org.apache.maven.lifecycle.internal.LifecycleModuleBuilder.buildProject (LifecycleModuleBuilder.java:81)
    at org.apache.maven.lifecycle.internal.builder.singlethreaded.SingleThreadedBuilder.build
(SingleThreadedBuilder.java:56)
    at org.apache.maven.lifecycle.internal.LifecycleStarter.execute (LifecycleStarter.java:128)
    at org.apache.maven.DefaultMaven.doExecute (DefaultMaven.java:305)
    at org.apache.maven.DefaultMaven.doExecute (DefaultMaven.java:192)
    at org.apache.maven.DefaultMaven.execute (DefaultMaven.java:105)
    at org.jvnet.hudson.maven3.launcher.Maven35Launcher.main (Maven35Launcher.java:130)
    at sun.reflect.NativeMethodAccessorImpl.invoke0 (Native Method)
    at sun.reflect.NativeMethodAccessorImpl.invoke (NativeMethodAccessorImpl.java:62)
    at sun.reflect.DelegatingMethodAccessorImpl.invoke (DelegatingMethodAccessorImpl.java:43)
    at java.lang.reflect.Method.invoke (Method.java:498)
    at org.codehaus.plexus.classworlds.launcher.Launcher.launchEnhanced (Launcher.java:289)
    at org.codehaus.plexus.classworlds.launcher.Launcher.launch (Launcher.java:229)
    at jenkins.maven3.agent.Maven35Main.launch (Maven35Main.java:176)
    at sun.reflect.NativeMethodAccessorImpl.invoke0 (Native Method)
    at sun.reflect.NativeMethodAccessorImpl.invoke (NativeMethodAccessorImpl.java:62)
    at sun.reflect.DelegatingMethodAccessorImpl.invoke (DelegatingMethodAccessorImpl.java:43)
    at java.lang.reflect.Method.invoke (Method.java:498)
    at hudson.maven.Maven3Builder.call (Maven3Builder.java:139)
    at hudson.maven.Maven3Builder.call (Maven3Builder.java:70)
    at hudson.remoting.UserRequest.perform (UserRequest.java:212)
    at hudson.remoting.UserRequest.perform (UserRequest.java:54)
    at hudson.remoting.Request$2.run (Request.java:369)
    at hudson.remoting.InterceptingExecutorService$1.call (InterceptingExecutorService.java:72)
    at java.util.concurrent.FutureTask.run (FutureTask.java:266)
    at java.util.concurrent.ThreadPoolExecutor.runWorker (ThreadPoolExecutor.java:1149)
    at java.util.concurrent.ThreadPoolExecutor$Worker.run (ThreadPoolExecutor.java:624)
    at java.lang.Thread.run (Thread.java:748)
Caused by: org.apache.maven.plugin.PluginExecutionException: Execution default-test of goal
org.apache.maven.plugins:maven-surefire-plugin:2.18.1:test failed: The forked VM terminated
without properly saying goodbye. VM crash or System.exit called?
Command was /bin/sh -c cd <https://builds.apache.org/job/karaf-4.1.x/ws/main> &&
/usr/local/asfpackages/java/jdk1.8.0_191/jre/bin/java -jar <https://builds.apache.org/job/karaf-4.1.x/ws/main/target/surefire/surefirebooter7293284407085396093.jar>
<https://builds.apache.org/job/karaf-4.1.x/ws/main/target/surefire/surefire2445974385137480498tmp>
<https://builds.apache.org/job/karaf-4.1.x/ws/main/target/surefire/surefire_12136072703456011090tmp>
    at org.apache.maven.plugin.DefaultBuildPluginManager.executeMojo (DefaultBuildPluginManager.java:148)
    at org.apache.maven.lifecycle.internal.MojoExecutor.execute (MojoExecutor.java:210)
    at org.apache.maven.lifecycle.internal.MojoExecutor.execute (MojoExecutor.java:156)
    at org.apache.maven.lifecycle.internal.MojoExecutor.execute (MojoExecutor.java:148)
    at org.apache.maven.lifecycle.internal.LifecycleModuleBuilder.buildProject (LifecycleModuleBuilder.java:117)
    at org.apache.maven.lifecycle.internal.LifecycleModuleBuilder.buildProject (LifecycleModuleBuilder.java:81)
    at org.apache.maven.lifecycle.internal.builder.singlethreaded.SingleThreadedBuilder.build
(SingleThreadedBuilder.java:56)
    at org.apache.maven.lifecycle.internal.LifecycleStarter.execute (LifecycleStarter.java:128)
    at org.apache.maven.DefaultMaven.doExecute (DefaultMaven.java:305)
    at org.apache.maven.DefaultMaven.doExecute (DefaultMaven.java:192)
    at org.apache.maven.DefaultMaven.execute (DefaultMaven.java:105)
    at org.jvnet.hudson.maven3.launcher.Maven35Launcher.main (Maven35Launcher.java:130)
    at sun.reflect.NativeMethodAccessorImpl.invoke0 (Native Method)
    at sun.reflect.NativeMethodAccessorImpl.invoke (NativeMethodAccessorImpl.java:62)
    at sun.reflect.DelegatingMethodAccessorImpl.invoke (DelegatingMethodAccessorImpl.java:43)
    at java.lang.reflect.Method.invoke (Method.java:498)
    at org.codehaus.plexus.classworlds.launcher.Launcher.launchEnhanced (Launcher.java:289)
    at org.codehaus.plexus.classworlds.launcher.Launcher.launch (Launcher.java:229)
    at jenkins.maven3.agent.Maven35Main.launch (Maven35Main.java:176)
    at sun.reflect.NativeMethodAccessorImpl.invoke0 (Native Method)
    at sun.reflect.NativeMethodAccessorImpl.invoke (NativeMethodAccessorImpl.java:62)
    at sun.reflect.DelegatingMethodAccessorImpl.invoke (DelegatingMethodAccessorImpl.java:43)
    at java.lang.reflect.Method.invoke (Method.java:498)
    at hudson.maven.Maven3Builder.call (Maven3Builder.java:139)
    at hudson.maven.Maven3Builder.call (Maven3Builder.java:70)
    at hudson.remoting.UserRequest.perform (UserRequest.java:212)
    at hudson.remoting.UserRequest.perform (UserRequest.java:54)
    at hudson.remoting.Request$2.run (Request.java:369)
    at hudson.remoting.InterceptingExecutorService$1.call (InterceptingExecutorService.java:72)
    at java.util.concurrent.FutureTask.run (FutureTask.java:266)
    at java.util.concurrent.ThreadPoolExecutor.runWorker (ThreadPoolExecutor.java:1149)
    at java.util.concurrent.ThreadPoolExecutor$Worker.run (ThreadPoolExecutor.java:624)
    at java.lang.Thread.run (Thread.java:748)
Caused by: java.lang.RuntimeException: The forked VM terminated without properly saying goodbye.
VM crash or System.exit called?
Command was /bin/sh -c cd <https://builds.apache.org/job/karaf-4.1.x/ws/main> &&
/usr/local/asfpackages/java/jdk1.8.0_191/jre/bin/java -jar <https://builds.apache.org/job/karaf-4.1.x/ws/main/target/surefire/surefirebooter7293284407085396093.jar>
<https://builds.apache.org/job/karaf-4.1.x/ws/main/target/surefire/surefire2445974385137480498tmp>
<https://builds.apache.org/job/karaf-4.1.x/ws/main/target/surefire/surefire_12136072703456011090tmp>
    at org.apache.maven.plugin.surefire.booterclient.ForkStarter.fork (ForkStarter.java:515)
    at org.apache.maven.plugin.surefire.booterclient.ForkStarter.fork (ForkStarter.java:380)
    at org.apache.maven.plugin.surefire.booterclient.ForkStarter.run (ForkStarter.java:167)
    at org.apache.maven.plugin.surefire.AbstractSurefireMojo.executeProvider (AbstractSurefireMojo.java:990)
    at org.apache.maven.plugin.surefire.AbstractSurefireMojo.executeAfterPreconditionsChecked
(AbstractSurefireMojo.java:824)
    at org.apache.maven.plugin.surefire.AbstractSurefireMojo.execute (AbstractSurefireMojo.java:722)
    at org.apache.maven.plugin.DefaultBuildPluginManager.executeMojo (DefaultBuildPluginManager.java:137)
    at org.apache.maven.lifecycle.internal.MojoExecutor.execute (MojoExecutor.java:210)
    at org.apache.maven.lifecycle.internal.MojoExecutor.execute (MojoExecutor.java:156)
    at org.apache.maven.lifecycle.internal.MojoExecutor.execute (MojoExecutor.java:148)
    at org.apache.maven.lifecycle.internal.LifecycleModuleBuilder.buildProject (LifecycleModuleBuilder.java:117)
    at org.apache.maven.lifecycle.internal.LifecycleModuleBuilder.buildProject (LifecycleModuleBuilder.java:81)
    at org.apache.maven.lifecycle.internal.builder.singlethreaded.SingleThreadedBuilder.build
(SingleThreadedBuilder.java:56)
    at org.apache.maven.lifecycle.internal.LifecycleStarter.execute (LifecycleStarter.java:128)
    at org.apache.maven.DefaultMaven.doExecute (DefaultMaven.java:305)
    at org.apache.maven.DefaultMaven.doExecute (DefaultMaven.java:192)
    at org.apache.maven.DefaultMaven.execute (DefaultMaven.java:105)
    at org.jvnet.hudson.maven3.launcher.Maven35Launcher.main (Maven35Launcher.java:130)
    at sun.reflect.NativeMethodAccessorImpl.invoke0 (Native Method)
    at sun.reflect.NativeMethodAccessorImpl.invoke (NativeMethodAccessorImpl.java:62)
    at sun.reflect.DelegatingMethodAccessorImpl.invoke (DelegatingMethodAccessorImpl.java:43)
    at java.lang.reflect.Method.invoke (Method.java:498)
    at org.codehaus.plexus.classworlds.launcher.Launcher.launchEnhanced (Launcher.java:289)
    at org.codehaus.plexus.classworlds.launcher.Launcher.launch (Launcher.java:229)
    at jenkins.maven3.agent.Maven35Main.launch (Maven35Main.java:176)
    at sun.reflect.NativeMethodAccessorImpl.invoke0 (Native Method)
    at sun.reflect.NativeMethodAccessorImpl.invoke (NativeMethodAccessorImpl.java:62)
    at sun.reflect.DelegatingMethodAccessorImpl.invoke (DelegatingMethodAccessorImpl.java:43)
    at java.lang.reflect.Method.invoke (Method.java:498)
    at hudson.maven.Maven3Builder.call (Maven3Builder.java:139)
    at hudson.maven.Maven3Builder.call (Maven3Builder.java:70)
    at hudson.remoting.UserRequest.perform (UserRequest.java:212)
    at hudson.remoting.UserRequest.perform (UserRequest.java:54)
    at hudson.remoting.Request$2.run (Request.java:369)
    at hudson.remoting.InterceptingExecutorService$1.call (InterceptingExecutorService.java:72)
    at java.util.concurrent.FutureTask.run (FutureTask.java:266)
    at java.util.concurrent.ThreadPoolExecutor.runWorker (ThreadPoolExecutor.java:1149)
    at java.util.concurrent.ThreadPoolExecutor$Worker.run (ThreadPoolExecutor.java:624)
    at java.lang.Thread.run (Thread.java:748)
[ERROR] 
[ERROR] Re-run Maven using the -X switch to enable full debug logging.
[ERROR] 
[ERROR] For more information about the errors and possible solutions, please read the following
articles:
[ERROR] [Help 1] http://cwiki.apache.org/confluence/display/MAVEN/PluginExecutionException
[ERROR] 
[ERROR] After correcting the problems, you can resume the build with the command
[ERROR]   mvn <goals> -rf :org.apache.karaf.main
[JENKINS] Archiving <https://builds.apache.org/job/karaf-4.1.x/ws/archetypes/blueprint/pom.xml>
to org.apache.karaf.archetypes/karaf-blueprint-archetype/4.1.8-SNAPSHOT/karaf-blueprint-archetype-4.1.8-SNAPSHOT.pom
[JENKINS] Archiving <https://builds.apache.org/job/karaf-4.1.x/ws/webconsole/gogo/pom.xml>
to org.apache.karaf.webconsole/org.apache.karaf.webconsole.gogo/4.1.8-SNAPSHOT/org.apache.karaf.webconsole.gogo-4.1.8-SNAPSHOT.pom
[JENKINS] Archiving <https://builds.apache.org/job/karaf-4.1.x/ws/management/pom.xml>
to org.apache.karaf.management/management/4.1.8-SNAPSHOT/management-4.1.8-SNAPSHOT.pom
[JENKINS] Archiving <https://builds.apache.org/job/karaf-4.1.x/ws/jpa/hibernate/pom.xml>
to org.apache.karaf.jpa/hibernate/4.1.8-SNAPSHOT/hibernate-4.1.8-SNAPSHOT.pom
[JENKINS] Archiving <https://builds.apache.org/job/karaf-4.1.x/ws/archetypes/pom.xml>
to org.apache.karaf/archetypes/4.1.8-SNAPSHOT/archetypes-4.1.8-SNAPSHOT.pom
[JENKINS] Archiving <https://builds.apache.org/job/karaf-4.1.x/ws/demos/profiles/pom.xml>
to org.apache.karaf.demos.profiles/profiles/4.1.8-SNAPSHOT/profiles-4.1.8-SNAPSHOT.pom
[JENKINS] Archiving <https://builds.apache.org/job/karaf-4.1.x/ws/assemblies/features/pom.xml>
to org.apache.karaf.assemblies.features/features/4.1.8-SNAPSHOT/features-4.1.8-SNAPSHOT.pom
[JENKINS] Archiving <https://builds.apache.org/job/karaf-4.1.x/ws/features/core/pom.xml>
to org.apache.karaf.features/org.apache.karaf.features.core/4.1.8-SNAPSHOT/org.apache.karaf.features.core-4.1.8-SNAPSHOT.pom
[JENKINS] Archiving <https://builds.apache.org/job/karaf-4.1.x/ws/demos/profiles/dynamic/pom.xml>
to org.apache.karaf.demos.profiles/dynamic/4.1.8-SNAPSHOT/dynamic-4.1.8-SNAPSHOT.pom
[JENKINS] Archiving <https://builds.apache.org/job/karaf-4.1.x/ws/demos/dump/pom.xml>
to org.apache.karaf.demos/dump/4.1.8-SNAPSHOT/dump-4.1.8-SNAPSHOT.pom
[JENKINS] Archiving <https://builds.apache.org/job/karaf-4.1.x/ws/services/coordinator/pom.xml>
to org.apache.karaf.services/org.apache.karaf.services.coordinator/4.1.8-SNAPSHOT/org.apache.karaf.services.coordinator-4.1.8-SNAPSHOT.pom
[JENKINS] Archiving <https://builds.apache.org/job/karaf-4.1.x/ws/system/pom.xml> to
org.apache.karaf.system/org.apache.karaf.system.core/4.1.8-SNAPSHOT/org.apache.karaf.system.core-4.1.8-SNAPSHOT.pom
[JENKINS] Archiving <https://builds.apache.org/job/karaf-4.1.x/ws/manual/pom.xml> to
org.apache.karaf/manual/4.1.7-SNAPSHOT/manual-4.1.7-SNAPSHOT.pom
[JENKINS] Archiving <https://builds.apache.org/job/karaf-4.1.x/ws/client/pom.xml> to
org.apache.karaf/org.apache.karaf.client/4.1.8-SNAPSHOT/org.apache.karaf.client-4.1.8-SNAPSHOT.pom
[JENKINS] Archiving <https://builds.apache.org/job/karaf-4.1.x/ws/jpa/pom.xml> to org.apache.karaf.jpa/jpa-parent/4.1.8-SNAPSHOT/jpa-parent-4.1.8-SNAPSHOT.pom
[JENKINS] Archiving <https://builds.apache.org/job/karaf-4.1.x/ws/assemblies/demos/pom.xml>
to org.apache.karaf/demos/4.1.8-SNAPSHOT/demos-4.1.8-SNAPSHOT.pom
[JENKINS] Archiving <https://builds.apache.org/job/karaf-4.1.x/ws/bundle/blueprintstate/pom.xml>
to org.apache.karaf.bundle/org.apache.karaf.bundle.blueprintstate/4.1.8-SNAPSHOT/org.apache.karaf.bundle.blueprintstate-4.1.8-SNAPSHOT.pom
[JENKINS] Archiving <https://builds.apache.org/job/karaf-4.1.x/ws/main/pom.xml> to org.apache.karaf/org.apache.karaf.main/4.1.8-SNAPSHOT/org.apache.karaf.main-4.1.8-SNAPSHOT.pom
[JENKINS] Archiving <https://builds.apache.org/job/karaf-4.1.x/ws/main/target/org.apache.karaf.main-4.1.8-SNAPSHOT-sources.jar>
to org.apache.karaf/org.apache.karaf.main/4.1.8-SNAPSHOT/org.apache.karaf.main-4.1.8-SNAPSHOT-sources.jar
[JENKINS] Archiving <https://builds.apache.org/job/karaf-4.1.x/ws/scr/management/pom.xml>
to org.apache.karaf.scr/org.apache.karaf.scr.management/4.1.8-SNAPSHOT/org.apache.karaf.scr.management-4.1.8-SNAPSHOT.pom
[JENKINS] Archiving <https://builds.apache.org/job/karaf-4.1.x/ws/assemblies/pom.xml>
to org.apache.karaf.assemblies/assemblies/4.1.8-SNAPSHOT/assemblies-4.1.8-SNAPSHOT.pom
[JENKINS] Archiving <https://builds.apache.org/job/karaf-4.1.x/ws/assemblies/apache-karaf-minimal/pom.xml>
to org.apache.karaf/apache-karaf-minimal/4.1.8-SNAPSHOT/apache-karaf-minimal-4.1.8-SNAPSHOT.pom
[JENKINS] Archiving <https://builds.apache.org/job/karaf-4.1.x/ws/bundle/springstate/pom.xml>
to org.apache.karaf.bundle/org.apache.karaf.bundle.springstate/4.1.8-SNAPSHOT/org.apache.karaf.bundle.springstate-4.1.8-SNAPSHOT.pom
[JENKINS] Archiving <https://builds.apache.org/job/karaf-4.1.x/ws/diagnostic/core/pom.xml>
to org.apache.karaf.diagnostic/org.apache.karaf.diagnostic.core/4.1.8-SNAPSHOT/org.apache.karaf.diagnostic.core-4.1.8-SNAPSHOT.pom
[JENKINS] Archiving <https://builds.apache.org/job/karaf-4.1.x/ws/deployer/spring/pom.xml>
to org.apache.karaf.deployer/org.apache.karaf.deployer.spring/4.1.8-SNAPSHOT/org.apache.karaf.deployer.spring-4.1.8-SNAPSHOT.pom
[JENKINS] Archiving <https://builds.apache.org/job/karaf-4.1.x/ws/deployer/pom.xml>
to org.apache.karaf.deployer/deployer/4.1.8-SNAPSHOT/deployer-4.1.8-SNAPSHOT.pom
[JENKINS] Archiving <https://builds.apache.org/job/karaf-4.1.x/ws/jms/core/pom.xml>
to org.apache.karaf.jms/org.apache.karaf.jms.core/4.1.8-SNAPSHOT/org.apache.karaf.jms.core-4.1.8-SNAPSHOT.pom
[JENKINS] Archiving <https://builds.apache.org/job/karaf-4.1.x/ws/bundle/core/pom.xml>
to org.apache.karaf.bundle/org.apache.karaf.bundle.core/4.1.8-SNAPSHOT/org.apache.karaf.bundle.core-4.1.8-SNAPSHOT.pom
[JENKINS] Archiving <https://builds.apache.org/job/karaf-4.1.x/ws/shell/ssh/pom.xml>
to org.apache.karaf.shell/org.apache.karaf.shell.ssh/4.1.8-SNAPSHOT/org.apache.karaf.shell.ssh-4.1.8-SNAPSHOT.pom
[JENKINS] Archiving <https://builds.apache.org/job/karaf-4.1.x/ws/webconsole/instance/pom.xml>
to org.apache.karaf.webconsole/org.apache.karaf.webconsole.instance/4.1.8-SNAPSHOT/org.apache.karaf.webconsole.instance-4.1.8-SNAPSHOT.pom
[JENKINS] Archiving <https://builds.apache.org/job/karaf-4.1.x/ws/demos/deployer/bundle/pom.xml>
to org.apache.karaf.demos.deployer.bundle/my-bundle/4.1.8-SNAPSHOT/my-bundle-4.1.8-SNAPSHOT.pom
[JENKINS] Archiving <https://builds.apache.org/job/karaf-4.1.x/ws/deployer/features/pom.xml>
to org.apache.karaf.deployer/org.apache.karaf.deployer.features/4.1.8-SNAPSHOT/org.apache.karaf.deployer.features-4.1.8-SNAPSHOT.pom
[JENKINS] Archiving <https://builds.apache.org/job/karaf-4.1.x/ws/jaas/jasypt/pom.xml>
to org.apache.karaf.jaas/org.apache.karaf.jaas.jasypt/4.1.8-SNAPSHOT/org.apache.karaf.jaas.jasypt-4.1.8-SNAPSHOT.pom
[JENKINS] Archiving <https://builds.apache.org/job/karaf-4.1.x/ws/services/pom.xml>
to org.apache.karaf.services/services/4.1.8-SNAPSHOT/services-4.1.8-SNAPSHOT.pom
[JENKINS] Archiving <https://builds.apache.org/job/karaf-4.1.x/ws/jaas/blueprint/config/pom.xml>
to org.apache.karaf.jaas.blueprint/org.apache.karaf.jaas.blueprint.config/4.1.8-SNAPSHOT/org.apache.karaf.jaas.blueprint.config-4.1.8-SNAPSHOT.pom
[JENKINS] Archiving <https://builds.apache.org/job/karaf-4.1.x/ws/demos/deployer/pom.xml>
to org.apache.karaf.demos/org.apache.karaf.demos.deployer/4.1.8-SNAPSHOT/org.apache.karaf.demos.deployer-4.1.8-SNAPSHOT.pom
[JENKINS] Archiving <https://builds.apache.org/job/karaf-4.1.x/ws/pom.xml> to org.apache.karaf/karaf/4.1.8-SNAPSHOT/karaf-4.1.8-SNAPSHOT.pom
[Fast Archiver] Compressed 99.32 KB of artifacts by 64.4% relative to #1047
[JENKINS] Archiving <https://builds.apache.org/job/karaf-4.1.x/ws/assemblies/features/base/pom.xml>
to org.apache.karaf.features/base/4.1.8-SNAPSHOT/base-4.1.8-SNAPSHOT.pom
[JENKINS] Archiving <https://builds.apache.org/job/karaf-4.1.x/ws/scr/examples/pom.xml>
to org.apache.karaf.scr/org.apache.karaf.scr.examples/4.1.8-SNAPSHOT/org.apache.karaf.scr.examples-4.1.8-SNAPSHOT.pom
[JENKINS] Archiving <https://builds.apache.org/job/karaf-4.1.x/ws/assemblies/features/standard/pom.xml>
to org.apache.karaf.features/standard/4.1.8-SNAPSHOT/standard-4.1.8-SNAPSHOT.pom
[JENKINS] Archiving <https://builds.apache.org/job/karaf-4.1.x/ws/web/pom.xml> to org.apache.karaf.web/org.apache.karaf.web.core/4.1.8-SNAPSHOT/org.apache.karaf.web.core-4.1.8-SNAPSHOT.pom
[JENKINS] Archiving <https://builds.apache.org/job/karaf-4.1.x/ws/log/pom.xml> to org.apache.karaf.log/org.apache.karaf.log.core/4.1.8-SNAPSHOT/org.apache.karaf.log.core-4.1.8-SNAPSHOT.pom
[JENKINS] Archiving <https://builds.apache.org/job/karaf-4.1.x/ws/exception/pom.xml>
to org.apache.karaf/org.apache.karaf.exception/4.1.8-SNAPSHOT/org.apache.karaf.exception-4.1.8-SNAPSHOT.pom
[JENKINS] Archiving <https://builds.apache.org/job/karaf-4.1.x/ws/instance/pom.xml>
to org.apache.karaf.instance/org.apache.karaf.instance.core/4.1.8-SNAPSHOT/org.apache.karaf.instance.core-4.1.8-SNAPSHOT.pom
[JENKINS] Archiving <https://builds.apache.org/job/karaf-4.1.x/ws/shell/pom.xml> to
org.apache.karaf.shell/shell/4.1.8-SNAPSHOT/shell-4.1.8-SNAPSHOT.pom
[JENKINS] Archiving <https://builds.apache.org/job/karaf-4.1.x/ws/features/pom.xml>
to org.apache.karaf.features/features/4.1.8-SNAPSHOT/features-4.1.8-SNAPSHOT.pom
[JENKINS] Archiving <https://builds.apache.org/job/karaf-4.1.x/ws/kar/pom.xml> to org.apache.karaf.kar/org.apache.karaf.kar.core/4.1.8-SNAPSHOT/org.apache.karaf.kar.core-4.1.8-SNAPSHOT.pom
[JENKINS] Archiving <https://builds.apache.org/job/karaf-4.1.x/ws/service/pom.xml> to
org.apache.karaf.service/service/4.1.8-SNAPSHOT/service-4.1.8-SNAPSHOT.pom
[JENKINS] Archiving <https://builds.apache.org/job/karaf-4.1.x/ws/diagnostic/pom.xml>
to org.apache.karaf.diagnostic/diagnostic/4.1.8-SNAPSHOT/diagnostic-4.1.8-SNAPSHOT.pom
[JENKINS] Archiving <https://builds.apache.org/job/karaf-4.1.x/ws/jaas/pom.xml> to org.apache.karaf.jaas/jaas/4.1.8-SNAPSHOT/jaas-4.1.8-SNAPSHOT.pom
[JENKINS] Archiving <https://builds.apache.org/job/karaf-4.1.x/ws/diagnostic/boot/pom.xml>
to org.apache.karaf.diagnostic/org.apache.karaf.diagnostic.boot/4.1.8-SNAPSHOT/org.apache.karaf.diagnostic.boot-4.1.8-SNAPSHOT.pom
[JENKINS] Archiving <https://builds.apache.org/job/karaf-4.1.x/ws/jndi/pom.xml> to org.apache.karaf.jndi/org.apache.karaf.jndi.core/4.1.8-SNAPSHOT/org.apache.karaf.jndi.core-4.1.8-SNAPSHOT.pom
[JENKINS] Archiving <https://builds.apache.org/job/karaf-4.1.x/ws/event/pom.xml> to
org.apache.karaf/org.apache.karaf.event/4.1.8-SNAPSHOT/org.apache.karaf.event-4.1.8-SNAPSHOT.pom
[JENKINS] Archiving <https://builds.apache.org/job/karaf-4.1.x/ws/jaas/blueprint/pom.xml>
to org.apache.karaf.jaas.blueprint/blueprint/4.1.8-SNAPSHOT/blueprint-4.1.8-SNAPSHOT.pom
[JENKINS] Archiving <https://builds.apache.org/job/karaf-4.1.x/ws/scr/state/pom.xml>
to org.apache.karaf.scr/org.apache.karaf.scr.state/4.1.8-SNAPSHOT/org.apache.karaf.scr.state-4.1.8-SNAPSHOT.pom
[JENKINS] Archiving <https://builds.apache.org/job/karaf-4.1.x/ws/jdbc/pom.xml> to org.apache.karaf.jdbc/org.apache.karaf.jdbc.core/4.1.8-SNAPSHOT/org.apache.karaf.jdbc.core-4.1.8-SNAPSHOT.pom
[JENKINS] Archiving <https://builds.apache.org/job/karaf-4.1.x/ws/demos/web/pom.xml>
to org.apache.karaf.demos/web/4.1.8-SNAPSHOT/web-4.1.8-SNAPSHOT.pom
[JENKINS] Archiving <https://builds.apache.org/job/karaf-4.1.x/ws/archetypes/feature/pom.xml>
to org.apache.karaf.archetypes/karaf-feature-archetype/4.1.8-SNAPSHOT/karaf-feature-archetype-4.1.8-SNAPSHOT.pom
[JENKINS] Archiving <https://builds.apache.org/job/karaf-4.1.x/ws/shell/core/pom.xml>
to org.apache.karaf.shell/org.apache.karaf.shell.core/4.1.8-SNAPSHOT/org.apache.karaf.shell.core-4.1.8-SNAPSHOT.pom
[JENKINS] Archiving <https://builds.apache.org/job/karaf-4.1.x/ws/config/pom.xml> to
org.apache.karaf.config/org.apache.karaf.config.core/4.1.8-SNAPSHOT/org.apache.karaf.config.core-4.1.8-SNAPSHOT.pom
[JENKINS] Archiving <https://builds.apache.org/job/karaf-4.1.x/ws/bundle/pom.xml> to
org.apache.karaf.bundle/bundle/4.1.8-SNAPSHOT/bundle-4.1.8-SNAPSHOT.pom
[JENKINS] Archiving <https://builds.apache.org/job/karaf-4.1.x/ws/deployer/blueprint/pom.xml>
to org.apache.karaf.deployer/org.apache.karaf.deployer.blueprint/4.1.8-SNAPSHOT/org.apache.karaf.deployer.blueprint-4.1.8-SNAPSHOT.pom
[JENKINS] Archiving <https://builds.apache.org/job/karaf-4.1.x/ws/shell/table/pom.xml>
to org.apache.karaf.shell/org.apache.karaf.shell.table/4.1.8-SNAPSHOT/org.apache.karaf.shell.table-4.1.8-SNAPSHOT.pom
[JENKINS] Archiving <https://builds.apache.org/job/karaf-4.1.x/ws/assemblies/features/framework/pom.xml>
to org.apache.karaf.features/framework/4.1.8-SNAPSHOT/framework-4.1.8-SNAPSHOT.pom
[JENKINS] Archiving <https://builds.apache.org/job/karaf-4.1.x/ws/deployer/kar/pom.xml>
to org.apache.karaf.deployer/org.apache.karaf.deployer.kar/4.1.8-SNAPSHOT/org.apache.karaf.deployer.kar-4.1.8-SNAPSHOT.pom
[JENKINS] Archiving <https://builds.apache.org/job/karaf-4.1.x/ws/wrapper/pom.xml> to
org.apache.karaf.wrapper/org.apache.karaf.wrapper.core/4.1.8-SNAPSHOT/org.apache.karaf.wrapper.core-4.1.8-SNAPSHOT.pom
[JENKINS] Archiving <https://builds.apache.org/job/karaf-4.1.x/ws/services/eventadmin/pom.xml>
to org.apache.karaf.services/org.apache.karaf.services.eventadmin/4.1.8-SNAPSHOT/org.apache.karaf.services.eventadmin-4.1.8-SNAPSHOT.pom
[JENKINS] Archiving <https://builds.apache.org/job/karaf-4.1.x/ws/demos/pom.xml> to
org.apache.karaf.demos/demos/4.1.8-SNAPSHOT/demos-4.1.8-SNAPSHOT.pom
[JENKINS] Archiving <https://builds.apache.org/job/karaf-4.1.x/ws/tooling/utils/pom.xml>
to org.apache.karaf.tooling/org.apache.karaf.tools.utils/4.1.8-SNAPSHOT/org.apache.karaf.tools.utils-4.1.8-SNAPSHOT.pom
[JENKINS] Archiving <https://builds.apache.org/job/karaf-4.1.x/ws/scr/examples/component-factory/pom.xml>
to org.apache.karaf.scr.examples/org.apache.karaf.scr.examples.component.factories/4.1.8-SNAPSHOT/org.apache.karaf.scr.examples.component.factories-4.1.8-SNAPSHOT.pom
[JENKINS] Archiving <https://builds.apache.org/job/karaf-4.1.x/ws/service/core/pom.xml>
to org.apache.karaf.service/org.apache.karaf.service.core/4.1.8-SNAPSHOT/org.apache.karaf.service.core-4.1.8-SNAPSHOT.pom
[JENKINS] Archiving <https://builds.apache.org/job/karaf-4.1.x/ws/assemblies/features/spring-legacy/pom.xml>
to org.apache.karaf.features/spring-legacy/4.1.8-SNAPSHOT/spring-legacy-4.1.8-SNAPSHOT.pom
[JENKINS] Archiving <https://builds.apache.org/job/karaf-4.1.x/ws/assemblies/features/enterprise/pom.xml>
to org.apache.karaf.features/enterprise/4.1.8-SNAPSHOT/enterprise-4.1.8-SNAPSHOT.pom
[JENKINS] Archiving <https://builds.apache.org/job/karaf-4.1.x/ws/demos/deployer/kar/pom.xml>
to org.apache.karaf.demos/my-kar/4.1.8-SNAPSHOT/my-kar-4.1.8-SNAPSHOT.pom
[JENKINS] Archiving <https://builds.apache.org/job/karaf-4.1.x/ws/archetypes/kar/pom.xml>
to org.apache.karaf.archetypes/karaf-kar-archetype/4.1.8-SNAPSHOT/karaf-kar-archetype-4.1.8-SNAPSHOT.pom
[JENKINS] Archiving <https://builds.apache.org/job/karaf-4.1.x/ws/scr/command/pom.xml>
to org.apache.karaf.scr/org.apache.karaf.scr.command/4.1.8-SNAPSHOT/org.apache.karaf.scr.command-4.1.8-SNAPSHOT.pom
[JENKINS] Archiving <https://builds.apache.org/job/karaf-4.1.x/ws/jaas/command/pom.xml>
to org.apache.karaf.jaas/org.apache.karaf.jaas.command/4.1.8-SNAPSHOT/org.apache.karaf.jaas.command-4.1.8-SNAPSHOT.pom
[JENKINS] Archiving <https://builds.apache.org/job/karaf-4.1.x/ws/assemblies/features/spring/pom.xml>
to org.apache.karaf.features/spring/4.1.8-SNAPSHOT/spring-4.1.8-SNAPSHOT.pom
[JENKINS] Archiving <https://builds.apache.org/job/karaf-4.1.x/ws/archetypes/command/pom.xml>
to org.apache.karaf.archetypes/karaf-command-archetype/4.1.8-SNAPSHOT/karaf-command-archetype-4.1.8-SNAPSHOT.pom
[JENKINS] Archiving <https://builds.apache.org/job/karaf-4.1.x/ws/scr/pom.xml> to org.apache.karaf.scr/scr/4.1.8-SNAPSHOT/scr-4.1.8-SNAPSHOT.pom
[JENKINS] Archiving <https://builds.apache.org/job/karaf-4.1.x/ws/tooling/karaf-maven-plugin/pom.xml>
to org.apache.karaf.tooling/karaf-maven-plugin/4.1.8-SNAPSHOT/karaf-maven-plugin-4.1.8-SNAPSHOT.pom
[JENKINS] Archiving <https://builds.apache.org/job/karaf-4.1.x/ws/deployer/wrap/pom.xml>
to org.apache.karaf.deployer/org.apache.karaf.deployer.wrap/4.1.8-SNAPSHOT/org.apache.karaf.deployer.wrap-4.1.8-SNAPSHOT.pom
[JENKINS] Archiving <https://builds.apache.org/job/karaf-4.1.x/ws/jms/pom.xml> to org.apache.karaf.jms/parent/4.1.8-SNAPSHOT/parent-4.1.8-SNAPSHOT.pom
[JENKINS] Archiving <https://builds.apache.org/job/karaf-4.1.x/ws/assemblies/features/static/pom.xml>
to org.apache.karaf.features/static/4.1.8-SNAPSHOT/static-4.1.8-SNAPSHOT.pom
[JENKINS] Archiving <https://builds.apache.org/job/karaf-4.1.x/ws/webconsole/console/pom.xml>
to org.apache.karaf.webconsole/org.apache.karaf.webconsole.console/4.1.8-SNAPSHOT/org.apache.karaf.webconsole.console-4.1.8-SNAPSHOT.pom
[JENKINS] Archiving <https://builds.apache.org/job/karaf-4.1.x/ws/scr/examples/service/pom.xml>
to org.apache.karaf.scr.examples/org.apache.karaf.scr.examples.service/4.1.8-SNAPSHOT/org.apache.karaf.scr.examples.service-4.1.8-SNAPSHOT.pom
[JENKINS] Archiving <https://builds.apache.org/job/karaf-4.1.x/ws/scr/examples/managed-service/pom.xml>
to org.apache.karaf.scr.examples/org.apache.karaf.scr.examples.managed.service/4.1.8-SNAPSHOT/org.apache.karaf.scr.examples.managed.service-4.1.8-SNAPSHOT.pom
[JENKINS] Archiving <https://builds.apache.org/job/karaf-4.1.x/ws/obr/pom.xml> to org.apache.karaf.obr/org.apache.karaf.obr.core/4.1.8-SNAPSHOT/org.apache.karaf.obr.core-4.1.8-SNAPSHOT.pom
[JENKINS] Archiving <https://builds.apache.org/job/karaf-4.1.x/ws/itests/pom.xml> to
org.apache.karaf.itests/itests/4.1.8-SNAPSHOT/itests-4.1.8-SNAPSHOT.pom
[JENKINS] Archiving <https://builds.apache.org/job/karaf-4.1.x/ws/jaas/boot/pom.xml>
to org.apache.karaf.jaas/org.apache.karaf.jaas.boot/4.1.8-SNAPSHOT/org.apache.karaf.jaas.boot-4.1.8-SNAPSHOT.pom
[JENKINS] Archiving <https://builds.apache.org/job/karaf-4.1.x/ws/jaas/boot/target/org.apache.karaf.jaas.boot-4.1.8-SNAPSHOT.jar>
to org.apache.karaf.jaas/org.apache.karaf.jaas.boot/4.1.8-20190506.170148-154/org.apache.karaf.jaas.boot-4.1.8-20190506.170148-154.jar
[JENKINS] Archiving <https://builds.apache.org/job/karaf-4.1.x/ws/jaas/boot/target/org.apache.karaf.jaas.boot-4.1.8-SNAPSHOT-sources.jar>
to org.apache.karaf.jaas/org.apache.karaf.jaas.boot/4.1.8-20190506.170148-154/org.apache.karaf.jaas.boot-4.1.8-20190506.170148-154-sources.jar
[JENKINS] Archiving <https://builds.apache.org/job/karaf-4.1.x/ws/jaas/boot/target/org.apache.karaf.jaas.boot-4.1.8-SNAPSHOT-javadoc.jar>
to org.apache.karaf.jaas/org.apache.karaf.jaas.boot/4.1.8-20190506.170148-154/org.apache.karaf.jaas.boot-4.1.8-20190506.170148-154-javadoc.jar
[JENKINS] Archiving <https://builds.apache.org/job/karaf-4.1.x/ws/profile/pom.xml> to
org.apache.karaf.profile/org.apache.karaf.profile.core/4.1.8-SNAPSHOT/org.apache.karaf.profile.core-4.1.8-SNAPSHOT.pom
[JENKINS] Archiving <https://builds.apache.org/job/karaf-4.1.x/ws/demos/command/pom.xml>
to org.apache.karaf.demos/org.apache.karaf.demos.command/4.1.8-SNAPSHOT/org.apache.karaf.demos.command-4.1.8-SNAPSHOT.pom
[JENKINS] Archiving <https://builds.apache.org/job/karaf-4.1.x/ws/webconsole/features/pom.xml>
to org.apache.karaf.webconsole/org.apache.karaf.webconsole.features/4.1.8-SNAPSHOT/org.apache.karaf.webconsole.features-4.1.8-SNAPSHOT.pom
[JENKINS] Archiving <https://builds.apache.org/job/karaf-4.1.x/ws/tooling/pom.xml> to
org.apache.karaf.tooling/tooling/4.1.8-SNAPSHOT/tooling-4.1.8-SNAPSHOT.pom
[JENKINS] Archiving <https://builds.apache.org/job/karaf-4.1.x/ws/assemblies/apache-karaf/pom.xml>
to org.apache.karaf/apache-karaf/4.1.8-SNAPSHOT/apache-karaf-4.1.8-SNAPSHOT.pom
[JENKINS] Archiving <https://builds.apache.org/job/karaf-4.1.x/ws/shell/commands/pom.xml>
to org.apache.karaf.shell/org.apache.karaf.shell.commands/4.1.8-SNAPSHOT/org.apache.karaf.shell.commands-4.1.8-SNAPSHOT.pom
[JENKINS] Archiving <https://builds.apache.org/job/karaf-4.1.x/ws/demos/profiles/registry/pom.xml>
to org.apache.karaf.demos.profiles/registry/4.1.8-SNAPSHOT/registry-4.1.8-SNAPSHOT.pom
[JENKINS] Archiving <https://builds.apache.org/job/karaf-4.1.x/ws/http/pom.xml> to org.apache.karaf.http/org.apache.karaf.http.core/4.1.8-SNAPSHOT/org.apache.karaf.http.core-4.1.8-SNAPSHOT.pom
[JENKINS] Archiving <https://builds.apache.org/job/karaf-4.1.x/ws/webconsole/http/pom.xml>
to org.apache.karaf.webconsole/org.apache.karaf.webconsole.http/4.1.8-SNAPSHOT/org.apache.karaf.webconsole.http-4.1.8-SNAPSHOT.pom
[JENKINS] Archiving <https://builds.apache.org/job/karaf-4.1.x/ws/jaas/config/pom.xml>
to org.apache.karaf.jaas/org.apache.karaf.jaas.config/4.1.8-SNAPSHOT/org.apache.karaf.jaas.config-4.1.8-SNAPSHOT.pom
[JENKINS] Archiving <https://builds.apache.org/job/karaf-4.1.x/ws/services/staticcm/pom.xml>
to org.apache.karaf.services/org.apache.karaf.services.staticcm/4.1.8-SNAPSHOT/org.apache.karaf.services.staticcm-4.1.8-SNAPSHOT.pom
[JENKINS] Archiving <https://builds.apache.org/job/karaf-4.1.x/ws/jaas/blueprint/jasypt/pom.xml>
to org.apache.karaf.jaas.blueprint/org.apache.karaf.jaas.blueprint.jasypt/4.1.8-SNAPSHOT/org.apache.karaf.jaas.blueprint.jasypt-4.1.8-SNAPSHOT.pom
[JENKINS] Archiving <https://builds.apache.org/job/karaf-4.1.x/ws/archetypes/bundle/pom.xml>
to org.apache.karaf.archetypes/karaf-bundle-archetype/4.1.8-SNAPSHOT/karaf-bundle-archetype-4.1.8-SNAPSHOT.pom
[JENKINS] Archiving <https://builds.apache.org/job/karaf-4.1.x/ws/subsystem/pom.xml>
to org.apache.karaf.subsystem/org.apache.karaf.subsystem.core/4.1.8-SNAPSHOT/org.apache.karaf.subsystem.core-4.1.8-SNAPSHOT.pom
[JENKINS] Archiving <https://builds.apache.org/job/karaf-4.1.x/ws/shell/console/pom.xml>
to org.apache.karaf.shell/org.apache.karaf.shell.console/4.1.8-SNAPSHOT/org.apache.karaf.shell.console-4.1.8-SNAPSHOT.pom
[JENKINS] Archiving <https://builds.apache.org/job/karaf-4.1.x/ws/webconsole/pom.xml>
to org.apache.karaf.webconsole/webconsole/4.1.8-SNAPSHOT/webconsole-4.1.8-SNAPSHOT.pom
[JENKINS] Archiving <https://builds.apache.org/job/karaf-4.1.x/ws/jaas/modules/pom.xml>
to org.apache.karaf.jaas/org.apache.karaf.jaas.modules/4.1.8-SNAPSHOT/org.apache.karaf.jaas.modules-4.1.8-SNAPSHOT.pom
[JENKINS] Archiving <https://builds.apache.org/job/karaf-4.1.x/ws/demos/branding/pom.xml>
to org.apache.karaf.demos/org.apache.karaf.demos.branding.shell/4.1.8-SNAPSHOT/org.apache.karaf.demos.branding.shell-4.1.8-SNAPSHOT.pom
[JENKINS] Archiving <https://builds.apache.org/job/karaf-4.1.x/ws/assemblies/features/enterprise-legacy/pom.xml>
to org.apache.karaf.features/enterprise-legacy/4.1.8-SNAPSHOT/enterprise-legacy-4.1.8-SNAPSHOT.pom
[JENKINS] Archiving <https://builds.apache.org/job/karaf-4.1.x/ws/archetypes/assembly/pom.xml>
to org.apache.karaf.archetypes/karaf-assembly-archetype/4.1.8-SNAPSHOT/karaf-assembly-archetype-4.1.8-SNAPSHOT.pom
[JENKINS] Archiving <https://builds.apache.org/job/karaf-4.1.x/ws/features/extension/pom.xml>
to org.apache.karaf.features/org.apache.karaf.features.extension/4.1.8-SNAPSHOT/org.apache.karaf.features.extension-4.1.8-SNAPSHOT.pom
[JENKINS] Archiving <https://builds.apache.org/job/karaf-4.1.x/ws/management/server/pom.xml>
to org.apache.karaf.management/org.apache.karaf.management.server/4.1.8-SNAPSHOT/org.apache.karaf.management.server-4.1.8-SNAPSHOT.pom
[JENKINS] Archiving <https://builds.apache.org/job/karaf-4.1.x/ws/service/guard/pom.xml>
to org.apache.karaf.service/org.apache.karaf.service.guard/4.1.8-SNAPSHOT/org.apache.karaf.service.guard-4.1.8-SNAPSHOT.pom
[JENKINS] Archiving <https://builds.apache.org/job/karaf-4.1.x/ws/demos/profiles/static/pom.xml>
to org.apache.karaf.demos.profiles/static/4.1.8-SNAPSHOT/static-4.1.8-SNAPSHOT.pom
[JENKINS] Archiving <https://builds.apache.org/job/karaf-4.1.x/ws/tooling/karaf-services-maven-plugin/pom.xml>
to org.apache.karaf.tooling/karaf-services-maven-plugin/4.1.8-SNAPSHOT/karaf-services-maven-plugin-4.1.8-SNAPSHOT.pom
[JENKINS] Archiving <https://builds.apache.org/job/karaf-4.1.x/ws/package/pom.xml> to
org.apache.karaf.package/org.apache.karaf.package.core/4.1.8-SNAPSHOT/org.apache.karaf.package.core-4.1.8-SNAPSHOT.pom
[JENKINS] Archiving <https://builds.apache.org/job/karaf-4.1.x/ws/features/command/pom.xml>
to org.apache.karaf.features/org.apache.karaf.features.command/4.1.8-SNAPSHOT/org.apache.karaf.features.command-4.1.8-SNAPSHOT.pom
[JENKINS] Archiving <https://builds.apache.org/job/karaf-4.1.x/ws/scheduler/pom.xml>
to org.apache.karaf.scheduler/org.apache.karaf.scheduler.core/4.1.8-SNAPSHOT/org.apache.karaf.scheduler.core-4.1.8-SNAPSHOT.pom
[JENKINS] Archiving <https://builds.apache.org/job/karaf-4.1.x/ws/util/pom.xml> to org.apache.karaf/org.apache.karaf.util/4.1.8-SNAPSHOT/org.apache.karaf.util-4.1.8-SNAPSHOT.pom
[JENKINS] Archiving <https://builds.apache.org/job/karaf-4.1.x/ws/util/target/org.apache.karaf.util-4.1.8-SNAPSHOT.jar>
to org.apache.karaf/org.apache.karaf.util/4.1.8-20190506.170310-154/org.apache.karaf.util-4.1.8-20190506.170310-154.jar
[JENKINS] Archiving <https://builds.apache.org/job/karaf-4.1.x/ws/util/target/org.apache.karaf.util-4.1.8-SNAPSHOT-sources.jar>
to org.apache.karaf/org.apache.karaf.util/4.1.8-20190506.170310-154/org.apache.karaf.util-4.1.8-20190506.170310-154-sources.jar
[JENKINS] Archiving <https://builds.apache.org/job/karaf-4.1.x/ws/util/target/org.apache.karaf.util-4.1.8-SNAPSHOT-javadoc.jar>
to org.apache.karaf/org.apache.karaf.util/4.1.8-20190506.170310-154/org.apache.karaf.util-4.1.8-20190506.170310-154-javadoc.jar
channel stopped

Mime
View raw message