karaf-commits mailing list archives

Site index · List index
Message view « Date » · « Thread »
Top « Date » · « Thread »
From Apache Jenkins Server <jenk...@builds.apache.org>
Subject Build failed in Jenkins: karaf-4.1.x #570
Date Sat, 28 Apr 2018 18:10:49 GMT
See <https://builds.apache.org/job/karaf-4.1.x/570/display/redirect>

------------------------------------------
[...truncated 3.28 MB...]
[INFO] Apache Karaf :: Package :: Core .................... SUCCESS [ 18.958 s]
[INFO] Apache Karaf :: HTTP :: Core ....................... SUCCESS [ 19.103 s]
[INFO] Apache Karaf :: Service :: Core .................... SUCCESS [ 19.054 s]
[INFO] Apache Karaf :: Log :: Core ........................ SUCCESS [ 20.000 s]
[INFO] Apache Karaf :: Deployer :: Features ............... SUCCESS [ 18.521 s]
[INFO] Apache Karaf :: Deployer :: Karaf Archive (.kar) ... SUCCESS [ 18.962 s]
[INFO] Apache Karaf :: Deployer :: Wrap Non OSGi Jar ...... SUCCESS [ 16.832 s]
[INFO] Apache Karaf :: Shell :: Various Commands .......... SUCCESS [ 19.200 s]
[INFO] Apache Karaf :: Shell :: Console ................... SUCCESS [ 20.941 s]
[INFO] Apache Karaf :: Shell :: Table ..................... SUCCESS [ 18.582 s]
[INFO] Apache Karaf :: Shell :: SSH ....................... SUCCESS [ 34.774 s]
[INFO] Apache Karaf :: JAAS :: Jasypt Encryption .......... SUCCESS [ 17.903 s]
[INFO] Apache Karaf :: JAAS :: Command .................... SUCCESS [ 19.514 s]
[INFO] Apache Karaf :: JAAS :: Blueprint .................. SUCCESS [  7.570 s]
[INFO] Apache Karaf :: JAAS :: Blueprint :: Config ........ SUCCESS [ 16.686 s]
[INFO] Apache Karaf :: JAAS :: Blueprint :: Jasypt ........ SUCCESS [ 19.845 s]
[INFO] Apache Karaf :: Client ............................. SUCCESS [ 20.579 s]
[INFO] Apache Karaf :: Management ......................... SUCCESS [  7.363 s]
[INFO] Apache Karaf :: Management ......................... SUCCESS [ 19.710 s]
[INFO] Apache Karaf :: System :: Core ..................... SUCCESS [ 19.389 s]
[INFO] Apache Karaf :: Web :: Core ........................ SUCCESS [ 18.162 s]
[INFO] Apache Karaf :: Wrapper :: Core .................... SUCCESS [ 19.709 s]
[INFO] Apache Karaf :: Web Console ........................ SUCCESS [  7.413 s]
[INFO] Apache Karaf :: Web Console :: Console ............. SUCCESS [ 17.537 s]
[INFO] Apache Karaf :: Web Console :: Features Plugin ..... SUCCESS [ 18.371 s]
[INFO] Apache Karaf :: Web Console :: Gogo Plugin ......... SUCCESS [ 18.562 s]
[INFO] Apache Karaf :: Web Console :: HTTP Plugin ......... SUCCESS [ 18.307 s]
[INFO] Apache Karaf :: Web Console :: Instance Plugin ..... SUCCESS [ 20.246 s]
[INFO] Apache Karaf :: Exception .......................... SUCCESS [ 16.456 s]
[INFO] Apache Karaf :: Scheduler :: Core .................. SUCCESS [ 19.394 s]
[INFO] Apache Karaf :: Declarative Services (DS) .......... SUCCESS [  7.343 s]
[INFO] Apache Karaf :: SCR :: Shell Commands .............. SUCCESS [ 18.889 s]
[INFO] Apache Karaf :: SCR :: Management MBeans ........... SUCCESS [ 17.524 s]
[INFO] Apache Karaf :: SCR :: Bundle State ................ SUCCESS [ 17.464 s]
[INFO] Apache Karaf :: SCR :: Examples .................... SUCCESS [  7.458 s]
[INFO] Apache Karaf :: SCR :: Examples :: Basic Service ... SUCCESS [ 16.936 s]
[INFO] Apache Karaf :: SCR :: Examples :: Managed Services  SUCCESS [ 16.887 s]
[INFO] Apache Karaf :: SCR :: Examples :: Component Factories SUCCESS [ 17.161 s]
[INFO] Apache Karaf :: Diagnostic ......................... SUCCESS [  7.367 s]
[INFO] Apache Karaf :: Diagnostic :: Boot ................. SUCCESS [ 17.458 s]
[INFO] Apache Karaf :: Diagnostic :: Core ................. SUCCESS [ 18.884 s]
[INFO] Apache Karaf :: OBR :: Core ........................ SUCCESS [ 18.280 s]
[INFO] Apache Karaf :: JNDI :: Core ....................... SUCCESS [ 17.999 s]
[INFO] Apache Karaf :: JDBC :: Core ....................... SUCCESS [ 19.290 s]
[INFO] Apache Karaf :: JMS :: Core ........................ SUCCESS [ 19.102 s]
[INFO] Apache Karaf :: Features ........................... SUCCESS [  7.423 s]
[INFO] Apache Karaf :: JPA :: Parent ...................... SUCCESS [  8.011 s]
[INFO] Apache Karaf :: JPA :: Hibernate ................... SUCCESS [ 17.649 s]
[INFO] Apache Karaf :: OSGi Services :: Coordinator ....... SUCCESS [ 16.699 s]
[INFO] Apache Karaf :: OSGi Services :: EventAdmin ........ SUCCESS [ 17.050 s]
[INFO] Apache Karaf :: OSGi Services :: Static ConfigAdmin  SUCCESS [ 17.277 s]
[INFO] Apache Karaf :: OSGi Services ...................... SUCCESS [  7.362 s]
[INFO] Apache Karaf :: Subsystem :: Core .................. SUCCESS [ 19.179 s]
[INFO] Apache Karaf :: OSGi Services :: Event ............. SUCCESS [ 19.200 s]
[INFO] Apache Karaf :: Tooling :: Maven Karaf Plugin ...... SUCCESS [05:39 min]
[INFO] Apache Karaf :: Assemblies ......................... SUCCESS [  7.579 s]
[INFO] Apache Karaf :: Assemblies :: Features ............. SUCCESS [  7.514 s]
[INFO] Apache Karaf :: Assemblies :: Features :: Base ..... SUCCESS [ 14.949 s]
[INFO] Apache Karaf :: Assemblies :: Features :: Framework  SUCCESS [ 16.475 s]
[INFO] Apache Karaf :: Assemblies :: Features :: Static ... SUCCESS [ 14.601 s]
[INFO] Apache Karaf :: Assemblies :: Features :: Standard . SUCCESS [ 44.857 s]
[INFO] Apache Karaf :: Assemblies :: Features :: Spring ... SUCCESS [ 23.178 s]
[INFO] Apache Karaf :: Assemblies :: Features :: Spring Legacy SUCCESS [ 52.568 s]
[INFO] Apache Karaf :: Assemblies :: Features :: Enterprise SUCCESS [ 20.393 s]
[INFO] Apache Karaf :: Assemblies :: Features :: Enterprise Legacy SUCCESS [ 18.597 s]
[INFO] Apache Karaf :: Assemblies :: Demos ................ SUCCESS [ 13.147 s]
[INFO] Apache Karaf :: Assemblies :: Minimal Distribution . SUCCESS [ 23.722 s]
[INFO] Apache Karaf :: Assemblies :: Default Distribution . SUCCESS [ 23.562 s]
[INFO] Apache Karaf :: Demos .............................. SUCCESS [  7.360 s]
[INFO] Apache Karaf :: Demos :: Web ....................... SUCCESS [ 23.356 s]
[INFO] Apache Karaf :: Demos :: Branding :: Shell ......... SUCCESS [ 12.290 s]
[INFO] Apache Karaf :: Demos :: Command :: Extend Console . SUCCESS [ 17.346 s]
[INFO] Apache Karaf :: Demos :: Demo Dump provider ........ SUCCESS [ 16.925 s]
[INFO] Apache Karaf :: Demos :: Deployer .................. SUCCESS [  7.500 s]
[INFO] Apache Karaf :: Demos :: Deployer :: Kar ........... SUCCESS [ 10.019 s]
[INFO] Apache Karaf :: Demos :: Deployer :: Bundle ........ SUCCESS [ 16.533 s]
[INFO] Apache Karaf :: Demos :: Profiles :: Dynamic Assembly SUCCESS [ 32.728 s]
[INFO] Apache Karaf :: Demos :: Profiles :: Static Assembly SUCCESS [02:54 min]
[INFO] Apache Karaf :: Demos :: Profiles .................. SUCCESS [  7.888 s]
[INFO] Apache Karaf :: Archetypes ......................... SUCCESS [  7.449 s]
[INFO] Apache Karaf :: Archetypes :: Assembly Archetype ... SUCCESS [ 33.686 s]
[INFO] Apache Karaf :: Archetypes :: Command Archetype .... SUCCESS [ 20.631 s]
[INFO] Apache Karaf :: Archetypes :: Feature Archetype .... SUCCESS [ 17.131 s]
[INFO] Apache Karaf :: Archetypes :: Kar Archetype ........ SUCCESS [ 18.064 s]
[INFO] Apache Karaf :: Archetypes :: Bundle Archetype ..... SUCCESS [ 18.736 s]
[INFO] Apache Karaf :: Archetypes :: Blueprint Archetype .. SUCCESS [ 18.465 s]
[INFO] Apache Karaf :: Integration Tests .................. SUCCESS [09:21 min]
[INFO] Apache Karaf :: Manual ............................. SUCCESS [ 38.821 s]
[INFO] ------------------------------------------------------------------------
[INFO] BUILD SUCCESS
[INFO] ------------------------------------------------------------------------
[INFO] Total time: 01:06 h
[INFO] Finished at: 2018-04-28T18:09:52Z
[INFO] Final Memory: 201M/1199M
[INFO] ------------------------------------------------------------------------
[JENKINS] Archiving <https://builds.apache.org/job/karaf-4.1.x/ws/archetypes/blueprint/pom.xml>
to org.apache.karaf.archetypes/karaf-blueprint-archetype/4.1.6-SNAPSHOT/karaf-blueprint-archetype-4.1.6-SNAPSHOT.pom
[JENKINS] Archiving <https://builds.apache.org/job/karaf-4.1.x/ws/archetypes/blueprint/target/karaf-blueprint-archetype-4.1.6-SNAPSHOT.jar>
to org.apache.karaf.archetypes/karaf-blueprint-archetype/4.1.6-20180428.175648-77/karaf-blueprint-archetype-4.1.6-20180428.175648-77.jar
[JENKINS] Archiving <https://builds.apache.org/job/karaf-4.1.x/ws/archetypes/blueprint/target/karaf-blueprint-archetype-4.1.6-SNAPSHOT-sources.jar>
to org.apache.karaf.archetypes/karaf-blueprint-archetype/4.1.6-20180428.175648-77/karaf-blueprint-archetype-4.1.6-20180428.175648-77-sources.jar
[Fast Archiver] No artifacts from karaf-4.1.x » Apache Karaf :: Archetypes :: Blueprint Archetype
#569 to compare, so performing full copy of artifacts
[JENKINS] Archiving <https://builds.apache.org/job/karaf-4.1.x/ws/webconsole/gogo/pom.xml>
to org.apache.karaf.webconsole/org.apache.karaf.webconsole.gogo/4.1.6-SNAPSHOT/org.apache.karaf.webconsole.gogo-4.1.6-SNAPSHOT.pom
[JENKINS] Archiving <https://builds.apache.org/job/karaf-4.1.x/ws/webconsole/gogo/target/org.apache.karaf.webconsole.gogo-4.1.6-SNAPSHOT.jar>
to org.apache.karaf.webconsole/org.apache.karaf.webconsole.gogo/4.1.6-20180428.172751-81/org.apache.karaf.webconsole.gogo-4.1.6-20180428.172751-81.jar
[JENKINS] Archiving <https://builds.apache.org/job/karaf-4.1.x/ws/webconsole/gogo/target/org.apache.karaf.webconsole.gogo-4.1.6-SNAPSHOT-sources.jar>
to org.apache.karaf.webconsole/org.apache.karaf.webconsole.gogo/4.1.6-20180428.172751-81/org.apache.karaf.webconsole.gogo-4.1.6-20180428.172751-81-sources.jar
[JENKINS] Archiving <https://builds.apache.org/job/karaf-4.1.x/ws/webconsole/gogo/target/org.apache.karaf.webconsole.gogo-4.1.6-SNAPSHOT-javadoc.jar>
to org.apache.karaf.webconsole/org.apache.karaf.webconsole.gogo/4.1.6-20180428.172751-81/org.apache.karaf.webconsole.gogo-4.1.6-20180428.172751-81-javadoc.jar
[Fast Archiver] No artifacts from karaf-4.1.x » Apache Karaf :: Web Console :: Gogo Plugin
#569 to compare, so performing full copy of artifacts
[JENKINS] Archiving <https://builds.apache.org/job/karaf-4.1.x/ws/management/pom.xml>
to org.apache.karaf.management/management/4.1.6-SNAPSHOT/management-4.1.6-SNAPSHOT.pom
[JENKINS] Archiving <https://builds.apache.org/job/karaf-4.1.x/ws/management/pom.xml>
to org.apache.karaf.management/management/4.1.6-20180428.172510-81/management-4.1.6-20180428.172510-81.pom
[Fast Archiver] No artifacts from karaf-4.1.x » Apache Karaf :: Management #569 to compare,
so performing full copy of artifacts
[JENKINS] Archiving <https://builds.apache.org/job/karaf-4.1.x/ws/jpa/hibernate/pom.xml>
to org.apache.karaf.jpa/hibernate/4.1.6-SNAPSHOT/hibernate-4.1.6-SNAPSHOT.pom
[JENKINS] Archiving <https://builds.apache.org/job/karaf-4.1.x/ws/jpa/hibernate/target/hibernate-4.1.6-SNAPSHOT.jar>
to org.apache.karaf.jpa/hibernate/4.1.6-20180428.173456-81/hibernate-4.1.6-20180428.173456-81.jar
[JENKINS] Archiving <https://builds.apache.org/job/karaf-4.1.x/ws/jpa/hibernate/target/hibernate-4.1.6-SNAPSHOT-sources.jar>
to org.apache.karaf.jpa/hibernate/4.1.6-20180428.173456-81/hibernate-4.1.6-20180428.173456-81-sources.jar
[JENKINS] Archiving <https://builds.apache.org/job/karaf-4.1.x/ws/jpa/hibernate/target/hibernate-4.1.6-SNAPSHOT-javadoc.jar>
to org.apache.karaf.jpa/hibernate/4.1.6-20180428.173456-81/hibernate-4.1.6-20180428.173456-81-javadoc.jar
[Fast Archiver] No artifacts from karaf-4.1.x » Apache Karaf :: JPA :: Hibernate #569 to
compare, so performing full copy of artifacts
[JENKINS] Archiving <https://builds.apache.org/job/karaf-4.1.x/ws/archetypes/pom.xml>
to org.apache.karaf/archetypes/4.1.6-SNAPSHOT/archetypes-4.1.6-SNAPSHOT.pom
[Fast Archiver] No artifacts from karaf-4.1.x » Apache Karaf :: Archetypes #569 to compare,
so performing full copy of artifacts
[JENKINS] Archiving <https://builds.apache.org/job/karaf-4.1.x/ws/demos/profiles/pom.xml>
to org.apache.karaf.demos.profiles/profiles/4.1.6-SNAPSHOT/profiles-4.1.6-SNAPSHOT.pom
[Fast Archiver] No artifacts from karaf-4.1.x » Apache Karaf :: Demos :: Profiles #569 to
compare, so performing full copy of artifacts
[JENKINS] Archiving <https://builds.apache.org/job/karaf-4.1.x/ws/assemblies/features/pom.xml>
to org.apache.karaf.assemblies.features/features/4.1.6-SNAPSHOT/features-4.1.6-SNAPSHOT.pom
[Fast Archiver] No artifacts from karaf-4.1.x » Apache Karaf :: Assemblies :: Features #569
to compare, so performing full copy of artifacts
[JENKINS] Archiving <https://builds.apache.org/job/karaf-4.1.x/ws/features/core/pom.xml>
to org.apache.karaf.features/org.apache.karaf.features.core/4.1.6-SNAPSHOT/org.apache.karaf.features.core-4.1.6-SNAPSHOT.pom
[JENKINS] Archiving <https://builds.apache.org/job/karaf-4.1.x/ws/features/core/target/org.apache.karaf.features.core-4.1.6-SNAPSHOT.jar>
to org.apache.karaf.features/org.apache.karaf.features.core/4.1.6-20180428.170915-82/org.apache.karaf.features.core-4.1.6-20180428.170915-82.jar
[JENKINS] Archiving <https://builds.apache.org/job/karaf-4.1.x/ws/features/core/target/org.apache.karaf.features.core-4.1.6-SNAPSHOT-sources.jar>
to org.apache.karaf.features/org.apache.karaf.features.core/4.1.6-20180428.170915-82/org.apache.karaf.features.core-4.1.6-20180428.170915-82-sources.jar
[JENKINS] Archiving <https://builds.apache.org/job/karaf-4.1.x/ws/features/core/target/org.apache.karaf.features.core-4.1.6-SNAPSHOT-javadoc.jar>
to org.apache.karaf.features/org.apache.karaf.features.core/4.1.6-20180428.170915-82/org.apache.karaf.features.core-4.1.6-20180428.170915-82-javadoc.jar
[Fast Archiver] No artifacts from karaf-4.1.x » Apache Karaf :: Features :: Core #569 to
compare, so performing full copy of artifacts
[JENKINS] Archiving <https://builds.apache.org/job/karaf-4.1.x/ws/demos/profiles/dynamic/pom.xml>
to org.apache.karaf.demos.profiles/dynamic/4.1.6-SNAPSHOT/dynamic-4.1.6-SNAPSHOT.pom
[JENKINS] Archiving <https://builds.apache.org/job/karaf-4.1.x/ws/demos/profiles/dynamic/target/dynamic-4.1.6-SNAPSHOT.tar.gz>
to org.apache.karaf.demos.profiles/dynamic/4.1.6-20180428.175052-79/dynamic-4.1.6-20180428.175052-79.tar.gz
[JENKINS] Archiving <https://builds.apache.org/job/karaf-4.1.x/ws/demos/profiles/dynamic/target/dynamic-4.1.6-SNAPSHOT.zip>
to org.apache.karaf.demos.profiles/dynamic/4.1.6-20180428.175052-79/dynamic-4.1.6-20180428.175052-79.zip
[Fast Archiver] No artifacts from karaf-4.1.x » Apache Karaf :: Demos :: Profiles :: Dynamic
Assembly #569 to compare, so performing full copy of artifacts
[JENKINS] Archiving <https://builds.apache.org/job/karaf-4.1.x/ws/demos/dump/pom.xml>
to org.apache.karaf.demos/dump/4.1.6-SNAPSHOT/dump-4.1.6-SNAPSHOT.pom
[JENKINS] Archiving <https://builds.apache.org/job/karaf-4.1.x/ws/demos/dump/target/dump-4.1.6-SNAPSHOT.jar>
to org.apache.karaf.demos/dump/4.1.6-20180428.174937-79/dump-4.1.6-20180428.174937-79.jar
[JENKINS] Archiving <https://builds.apache.org/job/karaf-4.1.x/ws/demos/dump/target/dump-4.1.6-SNAPSHOT-sources.jar>
to org.apache.karaf.demos/dump/4.1.6-20180428.174937-79/dump-4.1.6-20180428.174937-79-sources.jar
[JENKINS] Archiving <https://builds.apache.org/job/karaf-4.1.x/ws/demos/dump/target/dump-4.1.6-SNAPSHOT-javadoc.jar>
to org.apache.karaf.demos/dump/4.1.6-20180428.174937-79/dump-4.1.6-20180428.174937-79-javadoc.jar
[Fast Archiver] No artifacts from karaf-4.1.x » Apache Karaf :: Demos :: Demo Dump provider
#569 to compare, so performing full copy of artifacts
[JENKINS] Archiving <https://builds.apache.org/job/karaf-4.1.x/ws/services/coordinator/pom.xml>
to org.apache.karaf.services/org.apache.karaf.services.coordinator/4.1.6-SNAPSHOT/org.apache.karaf.services.coordinator-4.1.6-SNAPSHOT.pom
[JENKINS] Archiving <https://builds.apache.org/job/karaf-4.1.x/ws/services/coordinator/target/org.apache.karaf.services.coordinator-4.1.6-SNAPSHOT.jar>
to org.apache.karaf.services/org.apache.karaf.services.coordinator/4.1.6-20180428.173516-81/org.apache.karaf.services.coordinator-4.1.6-20180428.173516-81.jar
[JENKINS] Archiving <https://builds.apache.org/job/karaf-4.1.x/ws/services/coordinator/target/org.apache.karaf.services.coordinator-4.1.6-SNAPSHOT-sources.jar>
to org.apache.karaf.services/org.apache.karaf.services.coordinator/4.1.6-20180428.173516-81/org.apache.karaf.services.coordinator-4.1.6-20180428.173516-81-sources.jar
[JENKINS] Archiving <https://builds.apache.org/job/karaf-4.1.x/ws/services/coordinator/target/org.apache.karaf.services.coordinator-4.1.6-SNAPSHOT-javadoc.jar>
to org.apache.karaf.services/org.apache.karaf.services.coordinator/4.1.6-20180428.173516-81/org.apache.karaf.services.coordinator-4.1.6-20180428.173516-81-javadoc.jar
[Fast Archiver] No artifacts from karaf-4.1.x » Apache Karaf :: OSGi Services :: Coordinator
#569 to compare, so performing full copy of artifacts
[JENKINS] Archiving <https://builds.apache.org/job/karaf-4.1.x/ws/system/pom.xml> to
org.apache.karaf.system/org.apache.karaf.system.core/4.1.6-SNAPSHOT/org.apache.karaf.system.core-4.1.6-SNAPSHOT.pom
[JENKINS] Archiving <https://builds.apache.org/job/karaf-4.1.x/ws/system/target/org.apache.karaf.system.core-4.1.6-SNAPSHOT.jar>
to org.apache.karaf.system/org.apache.karaf.system.core/4.1.6-20180428.172549-81/org.apache.karaf.system.core-4.1.6-20180428.172549-81.jar
[JENKINS] Archiving <https://builds.apache.org/job/karaf-4.1.x/ws/system/target/org.apache.karaf.system.core-4.1.6-SNAPSHOT-sources.jar>
to org.apache.karaf.system/org.apache.karaf.system.core/4.1.6-20180428.172549-81/org.apache.karaf.system.core-4.1.6-20180428.172549-81-sources.jar
[JENKINS] Archiving <https://builds.apache.org/job/karaf-4.1.x/ws/system/target/org.apache.karaf.system.core-4.1.6-SNAPSHOT-javadoc.jar>
to org.apache.karaf.system/org.apache.karaf.system.core/4.1.6-20180428.172549-81/org.apache.karaf.system.core-4.1.6-20180428.172549-81-javadoc.jar
[Fast Archiver] No artifacts from karaf-4.1.x » Apache Karaf :: System :: Core #569 to compare,
so performing full copy of artifacts
[JENKINS] Archiving <https://builds.apache.org/job/karaf-4.1.x/ws/manual/pom.xml> to
org.apache.karaf/manual/4.1.5-SNAPSHOT/manual-4.1.5-SNAPSHOT.pom
[JENKINS] Archiving <https://builds.apache.org/job/karaf-4.1.x/ws/client/pom.xml> to
org.apache.karaf/org.apache.karaf.client/4.1.6-SNAPSHOT/org.apache.karaf.client-4.1.6-SNAPSHOT.pom
[JENKINS] Archiving <https://builds.apache.org/job/karaf-4.1.x/ws/client/target/org.apache.karaf.client-4.1.6-SNAPSHOT.jar>
to org.apache.karaf/org.apache.karaf.client/4.1.6-20180428.172450-81/org.apache.karaf.client-4.1.6-20180428.172450-81.jar
[JENKINS] Archiving <https://builds.apache.org/job/karaf-4.1.x/ws/client/target/org.apache.karaf.client-4.1.6-SNAPSHOT-sources.jar>
to org.apache.karaf/org.apache.karaf.client/4.1.6-20180428.172450-81/org.apache.karaf.client-4.1.6-20180428.172450-81-sources.jar
[JENKINS] Archiving <https://builds.apache.org/job/karaf-4.1.x/ws/client/target/org.apache.karaf.client-4.1.6-SNAPSHOT-javadoc.jar>
to org.apache.karaf/org.apache.karaf.client/4.1.6-20180428.172450-81/org.apache.karaf.client-4.1.6-20180428.172450-81-javadoc.jar
[JENKINS] Archiving <https://builds.apache.org/job/karaf-4.1.x/ws/client/target/classes/karaf.key>
to org.apache.karaf/org.apache.karaf.client/4.1.6-20180428.172450-81/org.apache.karaf.client-4.1.6-20180428.172450-81.key
[Fast Archiver] No artifacts from karaf-4.1.x » Apache Karaf :: Client #569 to compare, so
performing full copy of artifacts
[JENKINS] Archiving <https://builds.apache.org/job/karaf-4.1.x/ws/jpa/pom.xml> to org.apache.karaf.jpa/jpa-parent/4.1.6-SNAPSHOT/jpa-parent-4.1.6-SNAPSHOT.pom
[JENKINS] Archiving <https://builds.apache.org/job/karaf-4.1.x/ws/jpa/pom.xml> to org.apache.karaf.jpa/jpa-parent/4.1.6-20180428.173441-81/jpa-parent-4.1.6-20180428.173441-81.pom
[Fast Archiver] No artifacts from karaf-4.1.x » Apache Karaf :: JPA :: Parent #569 to compare,
so performing full copy of artifacts
[JENKINS] Archiving <https://builds.apache.org/job/karaf-4.1.x/ws/assemblies/demos/pom.xml>
to org.apache.karaf/demos/4.1.6-SNAPSHOT/demos-4.1.6-SNAPSHOT.pom
[JENKINS] Archiving <https://builds.apache.org/job/karaf-4.1.x/ws/assemblies/demos/target/demos-4.1.6-SNAPSHOT.jar>
to org.apache.karaf/demos/4.1.6-20180428.174710-81/demos-4.1.6-20180428.174710-81.jar
[JENKINS] Archiving <https://builds.apache.org/job/karaf-4.1.x/ws/assemblies/demos/target/demos-4.1.6-SNAPSHOT-sources.jar>
to org.apache.karaf/demos/4.1.6-20180428.174710-81/demos-4.1.6-20180428.174710-81-sources.jar
[Fast Archiver] No artifacts from karaf-4.1.x » Apache Karaf :: Assemblies :: Demos #569
to compare, so performing full copy of artifacts
[JENKINS] Archiving <https://builds.apache.org/job/karaf-4.1.x/ws/bundle/blueprintstate/pom.xml>
to org.apache.karaf.bundle/org.apache.karaf.bundle.blueprintstate/4.1.6-SNAPSHOT/org.apache.karaf.bundle.blueprintstate-4.1.6-SNAPSHOT.pom
[JENKINS] Archiving <https://builds.apache.org/job/karaf-4.1.x/ws/bundle/blueprintstate/target/org.apache.karaf.bundle.blueprintstate-4.1.6-SNAPSHOT.jar>
to org.apache.karaf.bundle/org.apache.karaf.bundle.blueprintstate/4.1.6-20180428.171456-81/org.apache.karaf.bundle.blueprintstate-4.1.6-20180428.171456-81.jar
[JENKINS] Archiving <https://builds.apache.org/job/karaf-4.1.x/ws/bundle/blueprintstate/target/org.apache.karaf.bundle.blueprintstate-4.1.6-SNAPSHOT-sources.jar>
to org.apache.karaf.bundle/org.apache.karaf.bundle.blueprintstate/4.1.6-20180428.171456-81/org.apache.karaf.bundle.blueprintstate-4.1.6-20180428.171456-81-sources.jar
[JENKINS] Archiving <https://builds.apache.org/job/karaf-4.1.x/ws/bundle/blueprintstate/target/org.apache.karaf.bundle.blueprintstate-4.1.6-SNAPSHOT-javadoc.jar>
to org.apache.karaf.bundle/org.apache.karaf.bundle.blueprintstate/4.1.6-20180428.171456-81/org.apache.karaf.bundle.blueprintstate-4.1.6-20180428.171456-81-javadoc.jar
[Fast Archiver] No artifacts from karaf-4.1.x » Apache Karaf :: Bundle :: BlueprintStateService
#569 to compare, so performing full copy of artifacts
[JENKINS] Archiving <https://builds.apache.org/job/karaf-4.1.x/ws/main/pom.xml> to org.apache.karaf/org.apache.karaf.main/4.1.6-SNAPSHOT/org.apache.karaf.main-4.1.6-SNAPSHOT.pom
[JENKINS] Archiving <https://builds.apache.org/job/karaf-4.1.x/ws/main/target/org.apache.karaf.main-4.1.6-SNAPSHOT.jar>
to org.apache.karaf/org.apache.karaf.main/4.1.6-20180428.170617-82/org.apache.karaf.main-4.1.6-20180428.170617-82.jar
[JENKINS] Archiving <https://builds.apache.org/job/karaf-4.1.x/ws/main/target/org.apache.karaf.main-4.1.6-SNAPSHOT-sources.jar>
to org.apache.karaf/org.apache.karaf.main/4.1.6-20180428.170617-82/org.apache.karaf.main-4.1.6-20180428.170617-82-sources.jar
[Fast Archiver] No artifacts from karaf-4.1.x » Apache Karaf :: Main #569 to compare, so
performing full copy of artifacts
[JENKINS] Archiving <https://builds.apache.org/job/karaf-4.1.x/ws/scr/management/pom.xml>
to org.apache.karaf.scr/org.apache.karaf.scr.management/4.1.6-SNAPSHOT/org.apache.karaf.scr.management-4.1.6-SNAPSHOT.pom
[JENKINS] Archiving <https://builds.apache.org/job/karaf-4.1.x/ws/scr/management/target/org.apache.karaf.scr.management-4.1.6-SNAPSHOT.jar>
to org.apache.karaf.scr/org.apache.karaf.scr.management/4.1.6-20180428.173015-81/org.apache.karaf.scr.management-4.1.6-20180428.173015-81.jar
[JENKINS] Archiving <https://builds.apache.org/job/karaf-4.1.x/ws/scr/management/target/org.apache.karaf.scr.management-4.1.6-SNAPSHOT-sources.jar>
to org.apache.karaf.scr/org.apache.karaf.scr.management/4.1.6-20180428.173015-81/org.apache.karaf.scr.management-4.1.6-20180428.173015-81-sources.jar
[JENKINS] Archiving <https://builds.apache.org/job/karaf-4.1.x/ws/scr/management/target/org.apache.karaf.scr.management-4.1.6-SNAPSHOT-javadoc.jar>
to org.apache.karaf.scr/org.apache.karaf.scr.management/4.1.6-20180428.173015-81/org.apache.karaf.scr.management-4.1.6-20180428.173015-81-javadoc.jar
[Fast Archiver] No artifacts from karaf-4.1.x » Apache Karaf :: SCR :: Management MBeans
#569 to compare, so performing full copy of artifacts
[JENKINS] Archiving <https://builds.apache.org/job/karaf-4.1.x/ws/assemblies/pom.xml>
to org.apache.karaf.assemblies/assemblies/4.1.6-SNAPSHOT/assemblies-4.1.6-SNAPSHOT.pom
[Fast Archiver] No artifacts from karaf-4.1.x » Apache Karaf :: Assemblies #569 to compare,
so performing full copy of artifacts
[JENKINS] Archiving <https://builds.apache.org/job/karaf-4.1.x/ws/assemblies/apache-karaf-minimal/pom.xml>
to org.apache.karaf/apache-karaf-minimal/4.1.6-SNAPSHOT/apache-karaf-minimal-4.1.6-SNAPSHOT.pom
[JENKINS] Archiving <https://builds.apache.org/job/karaf-4.1.x/ws/assemblies/apache-karaf-minimal/target/apache-karaf-minimal-4.1.6-SNAPSHOT.tar.gz>
to org.apache.karaf/apache-karaf-minimal/4.1.6-20180428.174734-81/apache-karaf-minimal-4.1.6-20180428.174734-81.tar.gz
[JENKINS] Archiving <https://builds.apache.org/job/karaf-4.1.x/ws/assemblies/apache-karaf-minimal/target/apache-karaf-minimal-4.1.6-SNAPSHOT.zip>
to org.apache.karaf/apache-karaf-minimal/4.1.6-20180428.174734-81/apache-karaf-minimal-4.1.6-20180428.174734-81.zip
[Fast Archiver] No artifacts from karaf-4.1.x » Apache Karaf :: Assemblies :: Minimal Distribution
#569 to compare, so performing full copy of artifacts
Build timed out (after 70 minutes). Marking the build as aborted.
ERROR: Failed to parse POMs
java.io.IOException: Failed to extract <https://builds.apache.org/job/karaf-4.1.x/ws/assemblies/apache-karaf-minimal/transfer>
of 3 files
	at hudson.FilePath.readFromTar(FilePath.java:2317)
	at hudson.FilePath.copyRecursiveTo(FilePath.java:2221)
	at jenkins.model.StandardArtifactManager.archive(StandardArtifactManager.java:61)
	at com.cloudbees.jenkins.plugins.jsync.archiver.JSyncArtifactManager.remoteSync(JSyncArtifactManager.java:128)
	at com.cloudbees.jenkins.plugins.jsync.archiver.JSyncArtifactManager.archive(JSyncArtifactManager.java:76)
	at hudson.maven.MavenBuild$ProxyImpl.performArchiving(MavenBuild.java:512)
	at hudson.maven.MavenModuleSetBuild$MavenModuleSetBuildExecution.doRun(MavenModuleSetBuild.java:881)
	at hudson.model.AbstractBuild$AbstractBuildExecution.run(AbstractBuild.java:504)
	at hudson.model.Run.execute(Run.java:1724)
	at hudson.maven.MavenModuleSetBuild.run(MavenModuleSetBuild.java:543)
	at hudson.model.ResourceController.execute(ResourceController.java:97)
	at hudson.model.Executor.run(Executor.java:429)
	Suppressed: java.util.concurrent.ExecutionException: java.io.IOException: This archives contains
unclosed entries.
		at hudson.remoting.Channel$2.adapt(Channel.java:946)
		at hudson.remoting.Channel$2.adapt(Channel.java:941)
		at hudson.remoting.FutureAdapter.get(FutureAdapter.java:59)
		at hudson.FilePath.copyRecursiveTo(FilePath.java:2224)
		... 10 more
	Caused by: java.io.IOException: This archives contains unclosed entries.
		at org.apache.commons.compress.archivers.tar.TarArchiveOutputStream.finish(TarArchiveOutputStream.java:225)
		at org.apache.commons.compress.archivers.tar.TarArchiveOutputStream.close(TarArchiveOutputStream.java:241)
		at hudson.util.io.TarArchiver.close(TarArchiver.java:127)
		at hudson.FilePath.writeToTar(FilePath.java:2281)
		at hudson.FilePath.access$2100(FilePath.java:196)
		at hudson.FilePath$45.invoke(FilePath.java:2216)
		at hudson.FilePath$45.invoke(FilePath.java:2212)
		at hudson.FilePath$FileCallableWrapper.call(FilePath.java:2760)
		at hudson.remoting.UserRequest.perform(UserRequest.java:207)
		at hudson.remoting.UserRequest.perform(UserRequest.java:53)
		at hudson.remoting.Request$2.run(Request.java:358)
		at hudson.remoting.InterceptingExecutorService$1.call(InterceptingExecutorService.java:72)
		at java.util.concurrent.FutureTask.run(FutureTask.java:266)
		at java.util.concurrent.ThreadPoolExecutor.runWorker(ThreadPoolExecutor.java:1142)
		at java.util.concurrent.ThreadPoolExecutor$Worker.run(ThreadPoolExecutor.java:617)
		at java.lang.Thread.run(Thread.java:748)
		Suppressed: hudson.remoting.Channel$CallSiteStackTrace: Remote call to H34
			at hudson.remoting.Channel.attachCallSiteStackTrace(Channel.java:1693)
			at hudson.remoting.UserResponse.retrieve(UserRequest.java:310)
			at hudson.remoting.Channel$2.adapt(Channel.java:944)
			at hudson.remoting.Channel$2.adapt(Channel.java:941)
			at hudson.remoting.FutureAdapter.get(FutureAdapter.java:59)
			at hudson.FilePath.copyRecursiveTo(FilePath.java:2224)
			at jenkins.model.StandardArtifactManager.archive(StandardArtifactManager.java:61)
			at com.cloudbees.jenkins.plugins.jsync.archiver.JSyncArtifactManager.remoteSync(JSyncArtifactManager.java:128)
			at com.cloudbees.jenkins.plugins.jsync.archiver.JSyncArtifactManager.archive(JSyncArtifactManager.java:76)
			at hudson.maven.MavenBuild$ProxyImpl.performArchiving(MavenBuild.java:512)
			at hudson.maven.MavenModuleSetBuild$MavenModuleSetBuildExecution.doRun(MavenModuleSetBuild.java:881)
			at hudson.model.AbstractBuild$AbstractBuildExecution.run(AbstractBuild.java:504)
			at hudson.model.Run.execute(Run.java:1724)
			at hudson.maven.MavenModuleSetBuild.run(MavenModuleSetBuild.java:543)
			at hudson.model.ResourceController.execute(ResourceController.java:97)
			at hudson.model.Executor.run(Executor.java:429)
Caused by: java.io.IOException: java.lang.InterruptedException
	at hudson.remoting.FastPipedInputStream.read(FastPipedInputStream.java:177)
	at hudson.util.HeadBufferingStream.read(HeadBufferingStream.java:61)
	at com.jcraft.jzlib.InflaterInputStream.fill(InflaterInputStream.java:175)
	at com.jcraft.jzlib.InflaterInputStream.read(InflaterInputStream.java:106)
	at org.apache.commons.compress.archivers.tar.TarArchiveInputStream.read(TarArchiveInputStream.java:614)
	at java.io.InputStream.read(InputStream.java:101)
	at org.apache.commons.io.IOUtils.copyLarge(IOUtils.java:1792)
	at org.apache.commons.io.IOUtils.copyLarge(IOUtils.java:1769)
	at org.apache.commons.io.IOUtils.copy(IOUtils.java:1744)
	at hudson.util.IOUtils.copy(IOUtils.java:40)
	at hudson.FilePath.readFromTar(FilePath.java:2307)
	... 11 more
Caused by: java.lang.InterruptedException
	at java.lang.Object.wait(Native Method)
	at hudson.remoting.FastPipedInputStream.read(FastPipedInputStream.java:175)
	... 21 more
channel stopped

Mime
View raw message