karaf-commits mailing list archives

Site index · List index
Message view « Date » · « Thread »
Top « Date » · « Thread »
From Apache Jenkins Server <jenk...@builds.apache.org>
Subject Build failed in Jenkins: karaf-cave-master #107
Date Wed, 14 Feb 2018 23:30:28 GMT
See <https://builds.apache.org/job/karaf-cave-master/107/display/redirect>

------------------------------------------
[...truncated 3.27 KB...]
[INFO] ------------------------------------------------------------------------
[INFO] 
[INFO] --- maven-clean-plugin:3.0.0:clean (default-clean) @ cave ---
[INFO] Deleting <https://builds.apache.org/job/karaf-cave-master/ws/target>
[INFO] 
[INFO] --- maven-enforcer-plugin:1.3.1:enforce (enforce-maven) @ cave ---
[INFO] 
[INFO] --- maven-remote-resources-plugin:1.5:process (process-resource-bundles) @ cave ---
[INFO] 
[INFO] --- maven-remote-resources-plugin:1.5:process (default) @ cave ---
[INFO] 
[INFO] --- maven-antrun-plugin:1.7:run (copy-notice) @ cave ---
[WARNING] Parameter tasks is deprecated, use target instead
[INFO] Executing tasks

main:
     [copy] Copying 1 file to <https://builds.apache.org/job/karaf-cave-master/ws/target/maven-shared-archive-resources/META-INF>
[INFO] Executed tasks
[INFO] 
[INFO] --- maven-site-plugin:3.5.1:attach-descriptor (attach-descriptor) @ cave ---
[INFO] 
[INFO] --- maven-install-plugin:2.5.2:install (default-install) @ cave ---
[INFO] Installing <https://builds.apache.org/job/karaf-cave-master/ws/pom.xml> to /home/jenkins/jenkins-slave/maven-repositories/0/org/apache/karaf/cave/4.1.1-SNAPSHOT/cave-4.1.1-SNAPSHOT.pom
[INFO] 
[INFO] --- maven-deploy-plugin:2.8.2:deploy (default-deploy) @ cave ---
[INFO] Downloading: https://repository.apache.org/content/repositories/snapshots/org/apache/karaf/cave/4.1.1-SNAPSHOT/maven-metadata.xml
[INFO] Downloaded: https://repository.apache.org/content/repositories/snapshots/org/apache/karaf/cave/4.1.1-SNAPSHOT/maven-metadata.xml
(599 B at 0.6 KB/sec)
[INFO] Uploading: https://repository.apache.org/content/repositories/snapshots/org/apache/karaf/cave/4.1.1-SNAPSHOT/cave-4.1.1-20180214.232953-51.pom
[INFO] Uploaded: https://repository.apache.org/content/repositories/snapshots/org/apache/karaf/cave/4.1.1-SNAPSHOT/cave-4.1.1-20180214.232953-51.pom
(19 KB at 22.7 KB/sec)
[INFO] Downloading: https://repository.apache.org/content/repositories/snapshots/org/apache/karaf/cave/maven-metadata.xml
[INFO] Downloaded: https://repository.apache.org/content/repositories/snapshots/org/apache/karaf/cave/maven-metadata.xml
(380 B at 0.8 KB/sec)
[INFO] Uploading: https://repository.apache.org/content/repositories/snapshots/org/apache/karaf/cave/4.1.1-SNAPSHOT/maven-metadata.xml
[INFO] Uploaded: https://repository.apache.org/content/repositories/snapshots/org/apache/karaf/cave/4.1.1-SNAPSHOT/maven-metadata.xml
(599 B at 0.8 KB/sec)
[INFO] Uploading: https://repository.apache.org/content/repositories/snapshots/org/apache/karaf/cave/maven-metadata.xml
[INFO] Uploaded: https://repository.apache.org/content/repositories/snapshots/org/apache/karaf/cave/maven-metadata.xml
(380 B at 0.5 KB/sec)
[INFO]                                                                         
[INFO] ------------------------------------------------------------------------
[INFO] Building Apache Karaf :: Cave :: Server 4.1.1-SNAPSHOT
[INFO] ------------------------------------------------------------------------
[INFO] 
[INFO] --- maven-clean-plugin:3.0.0:clean (default-clean) @ org.apache.karaf.cave.server ---
[INFO] Deleting <https://builds.apache.org/job/karaf-cave-master/ws/server/target>
[INFO] 
[INFO] --- maven-enforcer-plugin:1.3.1:enforce (enforce-maven) @ org.apache.karaf.cave.server
---
[INFO] 
[INFO] --- maven-remote-resources-plugin:1.5:process (process-resource-bundles) @ org.apache.karaf.cave.server
---
[INFO] 
[INFO] --- maven-remote-resources-plugin:1.5:process (default) @ org.apache.karaf.cave.server
---
[INFO] 
[INFO] --- maven-antrun-plugin:1.7:run (copy-notice) @ org.apache.karaf.cave.server ---
[WARNING] Parameter tasks is deprecated, use target instead
[INFO] Executing tasks

main:
     [copy] Warning: Could not find file <https://builds.apache.org/job/karaf-cave-master/ws/server/NOTICE>
to copy.
[INFO] Executed tasks
[INFO] 
[INFO] --- maven-site-plugin:3.5.1:attach-descriptor (attach-descriptor) @ org.apache.karaf.cave.server
---
[INFO] 
[INFO] --- maven-install-plugin:2.5.2:install (default-install) @ org.apache.karaf.cave.server
---
[INFO] Installing <https://builds.apache.org/job/karaf-cave-master/ws/server/pom.xml>
to /home/jenkins/jenkins-slave/maven-repositories/0/org/apache/karaf/cave/org.apache.karaf.cave.server/4.1.1-SNAPSHOT/org.apache.karaf.cave.server-4.1.1-SNAPSHOT.pom
[INFO] 
[INFO] --- maven-deploy-plugin:2.8.2:deploy (default-deploy) @ org.apache.karaf.cave.server
---
[INFO] Downloading: https://repository.apache.org/content/repositories/snapshots/org/apache/karaf/cave/org.apache.karaf.cave.server/4.1.1-SNAPSHOT/maven-metadata.xml
[INFO] Downloaded: https://repository.apache.org/content/repositories/snapshots/org/apache/karaf/cave/org.apache.karaf.cave.server/4.1.1-SNAPSHOT/maven-metadata.xml
(628 B at 1.3 KB/sec)
[WARNING] Failed to write tracking file /home/jenkins/jenkins-slave/maven-repositories/0/org/apache/karaf/cave/org.apache.karaf.cave.server/4.1.1-SNAPSHOT/resolver-status.properties
java.io.IOException: No space left on device
	at java.io.RandomAccessFile.writeBytes(Native Method)
	at java.io.RandomAccessFile.write(RandomAccessFile.java:512)
	at org.eclipse.aether.internal.impl.TrackingFileManager.update(TrackingFileManager.java:129)
	at org.eclipse.aether.internal.impl.DefaultUpdateCheckManager.write(DefaultUpdateCheckManager.java:617)
	at org.eclipse.aether.internal.impl.DefaultUpdateCheckManager.touchMetadata(DefaultUpdateCheckManager.java:584)
	at org.eclipse.aether.internal.impl.DefaultDeployer.upload(DefaultDeployer.java:482)
	at org.eclipse.aether.internal.impl.DefaultDeployer.deploy(DefaultDeployer.java:290)
	at org.eclipse.aether.internal.impl.DefaultDeployer.deploy(DefaultDeployer.java:245)
	at org.eclipse.aether.internal.impl.DefaultRepositorySystem.deploy(DefaultRepositorySystem.java:413)
	at org.apache.maven.artifact.deployer.DefaultArtifactDeployer.deploy(DefaultArtifactDeployer.java:139)
	at org.apache.maven.plugin.deploy.AbstractDeployMojo.deploy(AbstractDeployMojo.java:171)
	at org.apache.maven.plugin.deploy.DeployMojo.deployProject(DeployMojo.java:242)
	at org.apache.maven.plugin.deploy.DeployMojo.execute(DeployMojo.java:169)
	at org.apache.maven.plugin.DefaultBuildPluginManager.executeMojo(DefaultBuildPluginManager.java:134)
	at org.apache.maven.lifecycle.internal.MojoExecutor.execute(MojoExecutor.java:208)
	at org.apache.maven.lifecycle.internal.MojoExecutor.execute(MojoExecutor.java:153)
	at org.apache.maven.lifecycle.internal.MojoExecutor.execute(MojoExecutor.java:145)
	at org.apache.maven.lifecycle.internal.LifecycleModuleBuilder.buildProject(LifecycleModuleBuilder.java:116)
	at org.apache.maven.lifecycle.internal.LifecycleModuleBuilder.buildProject(LifecycleModuleBuilder.java:80)
	at org.apache.maven.lifecycle.internal.builder.singlethreaded.SingleThreadedBuilder.build(SingleThreadedBuilder.java:51)
	at org.apache.maven.lifecycle.internal.LifecycleStarter.execute(LifecycleStarter.java:128)
	at org.apache.maven.DefaultMaven.doExecute(DefaultMaven.java:307)
	at org.apache.maven.DefaultMaven.doExecute(DefaultMaven.java:193)
	at org.apache.maven.DefaultMaven.execute(DefaultMaven.java:106)
	at org.jvnet.hudson.maven3.launcher.Maven33Launcher.main(Maven33Launcher.java:129)
	at sun.reflect.NativeMethodAccessorImpl.invoke0(Native Method)
	at sun.reflect.NativeMethodAccessorImpl.invoke(NativeMethodAccessorImpl.java:62)
	at sun.reflect.DelegatingMethodAccessorImpl.invoke(DelegatingMethodAccessorImpl.java:43)
	at java.lang.reflect.Method.invoke(Method.java:498)
	at org.codehaus.plexus.classworlds.launcher.Launcher.launchStandard(Launcher.java:330)
	at org.codehaus.plexus.classworlds.launcher.Launcher.launch(Launcher.java:238)
	at jenkins.maven3.agent.Maven33Main.launch(Maven33Main.java:176)
	at sun.reflect.NativeMethodAccessorImpl.invoke0(Native Method)
	at sun.reflect.NativeMethodAccessorImpl.invoke(NativeMethodAccessorImpl.java:62)
	at sun.reflect.DelegatingMethodAccessorImpl.invoke(DelegatingMethodAccessorImpl.java:43)
	at java.lang.reflect.Method.invoke(Method.java:498)
	at hudson.maven.Maven3Builder.call(Maven3Builder.java:139)
	at hudson.maven.Maven3Builder.call(Maven3Builder.java:70)
	at hudson.remoting.UserRequest.perform(UserRequest.java:207)
	at hudson.remoting.UserRequest.perform(UserRequest.java:53)
	at hudson.remoting.Request$2.run(Request.java:358)
	at hudson.remoting.InterceptingExecutorService$1.call(InterceptingExecutorService.java:72)
	at java.util.concurrent.FutureTask.run(FutureTask.java:266)
	at java.util.concurrent.ThreadPoolExecutor.runWorker(ThreadPoolExecutor.java:1149)
	at java.util.concurrent.ThreadPoolExecutor$Worker.run(ThreadPoolExecutor.java:624)
	at java.lang.Thread.run(Thread.java:748)
[INFO] Uploading: https://repository.apache.org/content/repositories/snapshots/org/apache/karaf/cave/org.apache.karaf.cave.server/4.1.1-SNAPSHOT/org.apache.karaf.cave.server-4.1.1-20180214.233002-51.pom
[INFO] Uploaded: https://repository.apache.org/content/repositories/snapshots/org/apache/karaf/cave/org.apache.karaf.cave.server/4.1.1-SNAPSHOT/org.apache.karaf.cave.server-4.1.1-20180214.233002-51.pom
(2 KB at 2.6 KB/sec)
[INFO] Downloading: https://repository.apache.org/content/repositories/snapshots/org/apache/karaf/cave/org.apache.karaf.cave.server/maven-metadata.xml
[WARNING] Could not transfer metadata org.apache.karaf.cave:org.apache.karaf.cave.server/maven-metadata.xml
from/to apache.snapshots.https (https://repository.apache.org/content/repositories/snapshots):
GET request of: org/apache/karaf/cave/org.apache.karaf.cave.server/maven-metadata.xml from
apache.snapshots.https failed
[INFO] ------------------------------------------------------------------------
[INFO] Reactor Summary:
[INFO] 
[INFO] Apache Karaf :: Cave ............................... SUCCESS [  9.919 s]
[INFO] Apache Karaf :: Cave :: Server ..................... FAILURE [  3.210 s]
[INFO] Apache Karaf :: Cave :: Server :: API .............. SKIPPED
[INFO] Apache Karaf :: Cave :: Server :: Storage .......... SKIPPED
[INFO] Apache Karaf :: Cave :: Server :: Management ....... SKIPPED
[INFO] Apache Karaf :: Cave :: Server :: Command .......... SKIPPED
[INFO] Apache Karaf :: Cave :: Server :: HTTP ............. SKIPPED
[INFO] Apache Karaf :: Cave :: Server :: Rest ............. SKIPPED
[INFO] Apache Karaf :: Cave :: Server :: Maven Proxy ...... SKIPPED
[INFO] Apache Karaf :: Cave :: Deployer ................... SKIPPED
[INFO] Apache Karaf :: Cave :: Deployer :: API ............ SKIPPED
[INFO] Apache Karaf :: Cave :: Deployer :: Service ........ SKIPPED
[INFO] Apache Karaf :: Cave :: Deployer :: Command ........ SKIPPED
[INFO] Apache Karaf :: Cave :: Deployer :: Management ..... SKIPPED
[INFO] Apache Karaf :: Cave :: Deployer :: REST ........... SKIPPED
[INFO] Apache Karaf :: Cave :: Assembly ................... SKIPPED
[INFO] ------------------------------------------------------------------------
[INFO] BUILD FAILURE
[INFO] ------------------------------------------------------------------------
[INFO] Total time: 29.371 s
[INFO] Finished at: 2018-02-14T23:30:14+00:00
[INFO] Final Memory: 28M/379M
[INFO] ------------------------------------------------------------------------
Waiting for Jenkins to finish collecting data
[ERROR] Failed to execute goal org.apache.maven.plugins:maven-deploy-plugin:2.8.2:deploy (default-deploy)
on project org.apache.karaf.cave.server: Failed to retrieve remote metadata org.apache.karaf.cave:org.apache.karaf.cave.server/maven-metadata.xml:
Could not transfer metadata org.apache.karaf.cave:org.apache.karaf.cave.server/maven-metadata.xml
from/to apache.snapshots.https (https://repository.apache.org/content/repositories/snapshots):
GET request of: org/apache/karaf/cave/org.apache.karaf.cave.server/maven-metadata.xml from
apache.snapshots.https failed: No space left on device -> [Help 1]
org.apache.maven.lifecycle.LifecycleExecutionException: Failed to execute goal org.apache.maven.plugins:maven-deploy-plugin:2.8.2:deploy
(default-deploy) on project org.apache.karaf.cave.server: Failed to retrieve remote metadata
org.apache.karaf.cave:org.apache.karaf.cave.server/maven-metadata.xml: Could not transfer
metadata org.apache.karaf.cave:org.apache.karaf.cave.server/maven-metadata.xml from/to apache.snapshots.https
(https://repository.apache.org/content/repositories/snapshots): GET request of: org/apache/karaf/cave/org.apache.karaf.cave.server/maven-metadata.xml
from apache.snapshots.https failed
	at org.apache.maven.lifecycle.internal.MojoExecutor.execute(MojoExecutor.java:216)
	at org.apache.maven.lifecycle.internal.MojoExecutor.execute(MojoExecutor.java:153)
	at org.apache.maven.lifecycle.internal.MojoExecutor.execute(MojoExecutor.java:145)
	at org.apache.maven.lifecycle.internal.LifecycleModuleBuilder.buildProject(LifecycleModuleBuilder.java:116)
	at org.apache.maven.lifecycle.internal.LifecycleModuleBuilder.buildProject(LifecycleModuleBuilder.java:80)
	at org.apache.maven.lifecycle.internal.builder.singlethreaded.SingleThreadedBuilder.build(SingleThreadedBuilder.java:51)
	at org.apache.maven.lifecycle.internal.LifecycleStarter.execute(LifecycleStarter.java:128)
	at org.apache.maven.DefaultMaven.doExecute(DefaultMaven.java:307)
	at org.apache.maven.DefaultMaven.doExecute(DefaultMaven.java:193)
	at org.apache.maven.DefaultMaven.execute(DefaultMaven.java:106)
	at org.jvnet.hudson.maven3.launcher.Maven33Launcher.main(Maven33Launcher.java:129)
	at sun.reflect.NativeMethodAccessorImpl.invoke0(Native Method)
	at sun.reflect.NativeMethodAccessorImpl.invoke(NativeMethodAccessorImpl.java:62)
	at sun.reflect.DelegatingMethodAccessorImpl.invoke(DelegatingMethodAccessorImpl.java:43)
	at java.lang.reflect.Method.invoke(Method.java:498)
	at org.codehaus.plexus.classworlds.launcher.Launcher.launchStandard(Launcher.java:330)
	at org.codehaus.plexus.classworlds.launcher.Launcher.launch(Launcher.java:238)
	at jenkins.maven3.agent.Maven33Main.launch(Maven33Main.java:176)
	at sun.reflect.NativeMethodAccessorImpl.invoke0(Native Method)
	at sun.reflect.NativeMethodAccessorImpl.invoke(NativeMethodAccessorImpl.java:62)
	at sun.reflect.DelegatingMethodAccessorImpl.invoke(DelegatingMethodAccessorImpl.java:43)
	at java.lang.reflect.Method.invoke(Method.java:498)
	at hudson.maven.Maven3Builder.call(Maven3Builder.java:139)
	at hudson.maven.Maven3Builder.call(Maven3Builder.java:70)
	at hudson.remoting.UserRequest.perform(UserRequest.java:207)
	at hudson.remoting.UserRequest.perform(UserRequest.java:53)
	at hudson.remoting.Request$2.run(Request.java:358)
	at hudson.remoting.InterceptingExecutorService$1.call(InterceptingExecutorService.java:72)
	at java.util.concurrent.FutureTask.run(FutureTask.java:266)
	at java.util.concurrent.ThreadPoolExecutor.runWorker(ThreadPoolExecutor.java:1149)
	at java.util.concurrent.ThreadPoolExecutor$Worker.run(ThreadPoolExecutor.java:624)
	at java.lang.Thread.run(Thread.java:748)
Caused by: org.apache.maven.plugin.MojoExecutionException: Failed to retrieve remote metadata
org.apache.karaf.cave:org.apache.karaf.cave.server/maven-metadata.xml: Could not transfer
metadata org.apache.karaf.cave:org.apache.karaf.cave.server/maven-metadata.xml from/to apache.snapshots.https
(https://repository.apache.org/content/repositories/snapshots): GET request of: org/apache/karaf/cave/org.apache.karaf.cave.server/maven-metadata.xml
from apache.snapshots.https failed
	at org.apache.maven.plugin.deploy.DeployMojo.deployProject(DeployMojo.java:284)
	at org.apache.maven.plugin.deploy.DeployMojo.execute(DeployMojo.java:169)
	at org.apache.maven.plugin.DefaultBuildPluginManager.executeMojo(DefaultBuildPluginManager.java:134)
	at org.apache.maven.lifecycle.internal.MojoExecutor.execute(MojoExecutor.java:208)
	... 31 more
Caused by: org.apache.maven.artifact.deployer.ArtifactDeploymentException: Failed to retrieve
remote metadata org.apache.karaf.cave:org.apache.karaf.cave.server/maven-metadata.xml: Could
not transfer metadata org.apache.karaf.cave:org.apache.karaf.cave.server/maven-metadata.xml
from/to apache.snapshots.https (https://repository.apache.org/content/repositories/snapshots):
GET request of: org/apache/karaf/cave/org.apache.karaf.cave.server/maven-metadata.xml from
apache.snapshots.https failed
	at org.apache.maven.artifact.deployer.DefaultArtifactDeployer.deploy(DefaultArtifactDeployer.java:143)
	at org.apache.maven.plugin.deploy.AbstractDeployMojo.deploy(AbstractDeployMojo.java:171)
	at org.apache.maven.plugin.deploy.DeployMojo.deployProject(DeployMojo.java:242)
	... 34 more
Caused by: org.eclipse.aether.deployment.DeploymentException: Failed to retrieve remote metadata
org.apache.karaf.cave:org.apache.karaf.cave.server/maven-metadata.xml: Could not transfer
metadata org.apache.karaf.cave:org.apache.karaf.cave.server/maven-metadata.xml from/to apache.snapshots.https
(https://repository.apache.org/content/repositories/snapshots): GET request of: org/apache/karaf/cave/org.apache.karaf.cave.server/maven-metadata.xml
from apache.snapshots.https failed
	at org.eclipse.aether.internal.impl.DefaultDeployer.upload(DefaultDeployer.java:447)
	at org.eclipse.aether.internal.impl.DefaultDeployer.deploy(DefaultDeployer.java:329)
	at org.eclipse.aether.internal.impl.DefaultDeployer.deploy(DefaultDeployer.java:245)
	at org.eclipse.aether.internal.impl.DefaultRepositorySystem.deploy(DefaultRepositorySystem.java:413)
	at org.apache.maven.artifact.deployer.DefaultArtifactDeployer.deploy(DefaultArtifactDeployer.java:139)
	... 36 more
Caused by: org.eclipse.aether.transfer.MetadataTransferException: Could not transfer metadata
org.apache.karaf.cave:org.apache.karaf.cave.server/maven-metadata.xml from/to apache.snapshots.https
(https://repository.apache.org/content/repositories/snapshots): GET request of: org/apache/karaf/cave/org.apache.karaf.cave.server/maven-metadata.xml
from apache.snapshots.https failed
	at org.eclipse.aether.connector.basic.MetadataTransportListener.transferFailed(MetadataTransportListener.java:43)
	at org.eclipse.aether.connector.basic.BasicRepositoryConnector$TaskRunner.run(BasicRepositoryConnector.java:355)
	at org.eclipse.aether.util.concurrency.RunnableErrorForwarder$1.run(RunnableErrorForwarder.java:67)
	at org.eclipse.aether.connector.basic.BasicRepositoryConnector$DirectExecutor.execute(BasicRepositoryConnector.java:581)
	at org.eclipse.aether.connector.basic.BasicRepositoryConnector.get(BasicRepositoryConnector.java:222)
	at org.eclipse.aether.internal.impl.DefaultDeployer.upload(DefaultDeployer.java:417)
	... 40 more
Caused by: org.apache.maven.wagon.TransferFailedException: GET request of: org/apache/karaf/cave/org.apache.karaf.cave.server/maven-metadata.xml
from apache.snapshots.https failed
	at org.apache.maven.wagon.AbstractWagon.getTransfer(AbstractWagon.java:363)
	at org.apache.maven.wagon.AbstractWagon.getTransfer(AbstractWagon.java:316)
	at org.apache.maven.wagon.AbstractWagon.getTransfer(AbstractWagon.java:285)
	at org.apache.maven.wagon.StreamWagon.getIfNewer(StreamWagon.java:97)
	at org.apache.maven.wagon.StreamWagon.get(StreamWagon.java:61)
	at org.eclipse.aether.transport.wagon.WagonTransporter$GetTaskRunner.run(WagonTransporter.java:560)
	at org.eclipse.aether.transport.wagon.WagonTransporter.execute(WagonTransporter.java:427)
	at org.eclipse.aether.transport.wagon.WagonTransporter.get(WagonTransporter.java:404)
	at org.eclipse.aether.connector.basic.BasicRepositoryConnector$GetTaskRunner.runTask(BasicRepositoryConnector.java:447)
	at org.eclipse.aether.connector.basic.BasicRepositoryConnector$TaskRunner.run(BasicRepositoryConnector.java:350)
	... 44 more
Caused by: java.io.IOException: No space left on device
	at java.io.FileOutputStream.writeBytes(Native Method)
	at java.io.FileOutputStream.write(FileOutputStream.java:326)
	at org.apache.maven.wagon.LazyFileOutputStream.write(LazyFileOutputStream.java:129)
	at org.apache.maven.wagon.AbstractWagon.transfer(AbstractWagon.java:540)
	at org.apache.maven.wagon.AbstractWagon.getTransfer(AbstractWagon.java:353)
	... 53 more
[ERROR] 
[ERROR] Re-run Maven using the -X switch to enable full debug logging.
[ERROR] 
[ERROR] For more information about the errors and possible solutions, please read the following
articles:
[ERROR] [Help 1] http://cwiki.apache.org/confluence/display/MAVEN/MojoExecutionException
[ERROR] 
[ERROR] After correcting the problems, you can resume the build with the command
[ERROR]   mvn <goals> -rf :org.apache.karaf.cave.server
[JENKINS] Archiving <https://builds.apache.org/job/karaf-cave-master/ws/assembly/pom.xml>
to org.apache.karaf.cave/apache-karaf-cave/4.1.1-SNAPSHOT/apache-karaf-cave-4.1.1-SNAPSHOT.pom
[JENKINS] Archiving <https://builds.apache.org/job/karaf-cave-master/ws/deployer/command/pom.xml>
to org.apache.karaf.cave.deployer/org.apache.karaf.cave.deployer.command/4.1.1-SNAPSHOT/org.apache.karaf.cave.deployer.command-4.1.1-SNAPSHOT.pom
[JENKINS] Archiving <https://builds.apache.org/job/karaf-cave-master/ws/server/http/pom.xml>
to org.apache.karaf.cave.server/org.apache.karaf.cave.server.http/4.1.1-SNAPSHOT/org.apache.karaf.cave.server.http-4.1.1-SNAPSHOT.pom
[JENKINS] Archiving <https://builds.apache.org/job/karaf-cave-master/ws/deployer/management/pom.xml>
to org.apache.karaf.cave.deployer/org.apache.karaf.cave.deployer.management/4.1.1-SNAPSHOT/org.apache.karaf.cave.deployer.management-4.1.1-SNAPSHOT.pom
[JENKINS] Archiving <https://builds.apache.org/job/karaf-cave-master/ws/server/management/pom.xml>
to org.apache.karaf.cave.server/org.apache.karaf.cave.server.management/4.1.1-SNAPSHOT/org.apache.karaf.cave.server.management-4.1.1-SNAPSHOT.pom
[JENKINS] Archiving <https://builds.apache.org/job/karaf-cave-master/ws/deployer/service/pom.xml>
to org.apache.karaf.cave.deployer/org.apache.karaf.cave.deployer.service/4.1.1-SNAPSHOT/org.apache.karaf.cave.deployer.service-4.1.1-SNAPSHOT.pom
[JENKINS] Archiving <https://builds.apache.org/job/karaf-cave-master/ws/server/maven/pom.xml>
to org.apache.karaf.cave.server/org.apache.karaf.cave.server.maven/4.1.1-SNAPSHOT/org.apache.karaf.cave.server.maven-4.1.1-SNAPSHOT.pom
[JENKINS] Archiving <https://builds.apache.org/job/karaf-cave-master/ws/server/pom.xml>
to org.apache.karaf.cave/org.apache.karaf.cave.server/4.1.1-SNAPSHOT/org.apache.karaf.cave.server-4.1.1-SNAPSHOT.pom
[JENKINS] Archiving <https://builds.apache.org/job/karaf-cave-master/ws/server/rest/pom.xml>
to org.apache.karaf.cave.server/org.apache.karaf.cave.server.rest/4.1.1-SNAPSHOT/org.apache.karaf.cave.server.rest-4.1.1-SNAPSHOT.pom
[JENKINS] Archiving <https://builds.apache.org/job/karaf-cave-master/ws/server/command/pom.xml>
to org.apache.karaf.cave.server/org.apache.karaf.cave.server.command/4.1.1-SNAPSHOT/org.apache.karaf.cave.server.command-4.1.1-SNAPSHOT.pom
[JENKINS] Archiving <https://builds.apache.org/job/karaf-cave-master/ws/deployer/api/pom.xml>
to org.apache.karaf.cave.deployer/org.apache.karaf.cave.deployer.api/4.1.1-SNAPSHOT/org.apache.karaf.cave.deployer.api-4.1.1-SNAPSHOT.pom
[JENKINS] Archiving <https://builds.apache.org/job/karaf-cave-master/ws/server/api/pom.xml>
to org.apache.karaf.cave.server/org.apache.karaf.cave.server.api/4.1.1-SNAPSHOT/org.apache.karaf.cave.server.api-4.1.1-SNAPSHOT.pom
[JENKINS] Archiving <https://builds.apache.org/job/karaf-cave-master/ws/deployer/pom.xml>
to org.apache.karaf.cave/org.apache.karaf.cave.deployer/4.1.1-SNAPSHOT/org.apache.karaf.cave.deployer-4.1.1-SNAPSHOT.pom
[JENKINS] Archiving <https://builds.apache.org/job/karaf-cave-master/ws/server/storage/pom.xml>
to org.apache.karaf.cave.server/org.apache.karaf.cave.server.storage/4.1.1-SNAPSHOT/org.apache.karaf.cave.server.storage-4.1.1-SNAPSHOT.pom
[JENKINS] Archiving <https://builds.apache.org/job/karaf-cave-master/ws/deployer/rest/pom.xml>
to org.apache.karaf.cave.deployer/org.apache.karaf.cave.deployer.rest/4.1.1-SNAPSHOT/org.apache.karaf.cave.deployer.rest-4.1.1-SNAPSHOT.pom
[JENKINS] Archiving <https://builds.apache.org/job/karaf-cave-master/ws/pom.xml> to
org.apache.karaf/cave/4.1.1-SNAPSHOT/cave-4.1.1-SNAPSHOT.pom
Sending e-mails to: commits@karaf.apache.org
channel stopped

Mime
View raw message