karaf-commits mailing list archives

Site index · List index
Message view « Date » · « Thread »
Top « Date » · « Thread »
From Apache Jenkins Server <jenk...@builds.apache.org>
Subject Build failed in Jenkins: karaf-4.1.x #365
Date Fri, 08 Dec 2017 17:07:55 GMT
See <https://builds.apache.org/job/karaf-4.1.x/365/display/redirect>

------------------------------------------
[...truncated 180.68 KB...]
[INFO] Apache Karaf :: OSGi Services :: Static ConfigAdmin  SKIPPED
[INFO] Apache Karaf :: OSGi Services ...................... SKIPPED
[INFO] Apache Karaf :: Subsystem :: Core .................. SKIPPED
[INFO] Apache Karaf :: OSGi Services :: Event ............. SKIPPED
[INFO] Apache Karaf :: Tooling :: Maven Karaf Plugin ...... SKIPPED
[INFO] Apache Karaf :: Assemblies ......................... SKIPPED
[INFO] Apache Karaf :: Assemblies :: Features ............. SKIPPED
[INFO] Apache Karaf :: Assemblies :: Features :: Base ..... SKIPPED
[INFO] Apache Karaf :: Assemblies :: Features :: Framework  SKIPPED
[INFO] Apache Karaf :: Assemblies :: Features :: Static ... SKIPPED
[INFO] Apache Karaf :: Assemblies :: Features :: Standard . SKIPPED
[INFO] Apache Karaf :: Assemblies :: Features :: Spring ... SKIPPED
[INFO] Apache Karaf :: Assemblies :: Features :: Spring Legacy SKIPPED
[INFO] Apache Karaf :: Assemblies :: Features :: Enterprise SKIPPED
[INFO] Apache Karaf :: Assemblies :: Features :: Enterprise Legacy SKIPPED
[INFO] Apache Karaf :: Assemblies :: Demos ................ SKIPPED
[INFO] Apache Karaf :: Assemblies :: Minimal Distribution . SKIPPED
[INFO] Apache Karaf :: Assemblies :: Default Distribution . SKIPPED
[INFO] Apache Karaf :: Demos .............................. SKIPPED
[INFO] Apache Karaf :: Demos :: Web ....................... SKIPPED
[INFO] Apache Karaf :: Demos :: Branding :: Shell ......... SKIPPED
[INFO] Apache Karaf :: Demos :: Command :: Extend Console . SKIPPED
[INFO] Apache Karaf :: Demos :: Demo Dump provider ........ SKIPPED
[INFO] Apache Karaf :: Demos :: Deployer .................. SKIPPED
[INFO] Apache Karaf :: Demos :: Deployer :: Kar ........... SKIPPED
[INFO] Apache Karaf :: Demos :: Deployer :: Bundle ........ SKIPPED
[INFO] Apache Karaf :: Demos :: Profiles :: Dynamic Assembly SKIPPED
[INFO] Apache Karaf :: Demos :: Profiles :: Static Assembly SKIPPED
[INFO] Apache Karaf :: Demos :: Profiles .................. SKIPPED
[INFO] Apache Karaf :: Archetypes ......................... SKIPPED
[INFO] Apache Karaf :: Archetypes :: Assembly Archetype ... SKIPPED
[INFO] Apache Karaf :: Archetypes :: Command Archetype .... SKIPPED
[INFO] Apache Karaf :: Archetypes :: Feature Archetype .... SKIPPED
[INFO] Apache Karaf :: Archetypes :: Kar Archetype ........ SKIPPED
[INFO] Apache Karaf :: Archetypes :: Bundle Archetype ..... SKIPPED
[INFO] Apache Karaf :: Archetypes :: Blueprint Archetype .. SKIPPED
[INFO] Apache Karaf :: Integration Tests .................. SKIPPED
[INFO] ------------------------------------------------------------------------
[INFO] BUILD FAILURE
[INFO] ------------------------------------------------------------------------
[INFO] Total time: 05:39 min
[INFO] Finished at: 2017-12-08T17:06:21+00:00
[INFO] Final Memory: 136M/897M
[INFO] ------------------------------------------------------------------------
[ERROR] Failed to execute goal org.apache.maven.plugins:maven-compiler-plugin:3.6.1:testCompile
(default-testCompile) on project org.apache.karaf.jaas.modules: Compilation failure: Compilation
failure:
[ERROR] <https://builds.apache.org/job/karaf-4.1.x/ws/jaas/modules/src/test/java/org/apache/karaf/jaas/modules/ldap/LDAPPubkeyLoginModuleTest.java>:[26,44]
cannot find symbol
[ERROR] symbol:   class PrincipalHelper
[ERROR] location: package org.apache.karaf.jaas.modules
[ERROR] <https://builds.apache.org/job/karaf-4.1.x/ws/jaas/modules/src/test/java/org/apache/karaf/jaas/modules/ldap/LDAPPubkeyLoginModuleTest.java>:[26,1]
static import only from classes and interfaces
[ERROR] <https://builds.apache.org/job/karaf-4.1.x/ws/jaas/modules/src/test/java/org/apache/karaf/jaas/modules/ldap/LDAPPubkeyLoginModuleTest.java>:[27,49]
cannot find symbol
[ERROR] symbol:   class LdapPropsUpdater
[ERROR] location: package org.apache.karaf.jaas.modules.ldap
[ERROR] <https://builds.apache.org/job/karaf-4.1.x/ws/jaas/modules/src/test/java/org/apache/karaf/jaas/modules/ldap/LDAPPubkeyLoginModuleTest.java>:[27,1]
static import only from classes and interfaces
[ERROR] <https://builds.apache.org/job/karaf-4.1.x/ws/jaas/modules/src/test/java/org/apache/karaf/jaas/modules/ldap/LDAPPubkeyLoginModuleTest.java>:[56,9]
cannot find symbol
[ERROR] symbol:   method ldapProps(java.lang.String,LdapLoginM[...]ePort)
[ERROR] location: class org.apache.karaf.jaas.modules.ldap.LDAPPubkeyLoginModuleTest
[ERROR] <https://builds.apache.org/job/karaf-4.1.x/ws/jaas/modules/src/test/java/org/apache/karaf/jaas/modules/ldap/LDAPPubkeyLoginModuleTest.java>:[81,20]
cannot find symbol
[ERROR] symbol:   method names(java.util.Set<org.apache.karaf.jaas.boot.principal.UserPrincipal>)
[ERROR] location: class org.apache.karaf.jaas.modules.ldap.LDAPPubkeyLoginModuleTest
[ERROR] <https://builds.apache.org/job/karaf-4.1.x/ws/jaas/modules/src/test/java/org/apache/karaf/jaas/modules/ldap/LDAPPubkeyLoginModuleTest.java>:[82,20]
cannot find symbol
[ERROR] symbol:   method names(java.util.Set<org.apache.karaf.jaas.boot.principal.RolePrincipal>)
[ERROR] location: class org.apache.karaf.jaas.modules.ldap.LDAPPubkeyLoginModuleTest
[ERROR] <https://builds.apache.org/job/karaf-4.1.x/ws/jaas/modules/src/test/java/org/apache/karaf/jaas/modules/ldap/LDAPPubkeyLoginModuleTest.java>:[101,20]
cannot find symbol
[ERROR] symbol:   method names(java.util.Set<org.apache.karaf.jaas.boot.principal.UserPrincipal>)
[ERROR] location: class org.apache.karaf.jaas.modules.ldap.LDAPPubkeyLoginModuleTest
[ERROR] <https://builds.apache.org/job/karaf-4.1.x/ws/jaas/modules/src/test/java/org/apache/karaf/jaas/modules/ldap/LDAPPubkeyLoginModuleTest.java>:[102,20]
cannot find symbol
[ERROR] symbol:   method names(java.util.Set<org.apache.karaf.jaas.boot.principal.RolePrincipal>)
[ERROR] location: class org.apache.karaf.jaas.modules.ldap.LDAPPubkeyLoginModuleTest
[ERROR] -> [Help 1]
org.apache.maven.lifecycle.LifecycleExecutionException: Failed to execute goal org.apache.maven.plugins:maven-compiler-plugin:3.6.1:testCompile
(default-testCompile) on project org.apache.karaf.jaas.modules: Compilation failure
	at org.apache.maven.lifecycle.internal.MojoExecutor.execute(MojoExecutor.java:212)
	at org.apache.maven.lifecycle.internal.MojoExecutor.execute(MojoExecutor.java:153)
	at org.apache.maven.lifecycle.internal.MojoExecutor.execute(MojoExecutor.java:145)
	at org.apache.maven.lifecycle.internal.LifecycleModuleBuilder.buildProject(LifecycleModuleBuilder.java:116)
	at org.apache.maven.lifecycle.internal.LifecycleModuleBuilder.buildProject(LifecycleModuleBuilder.java:80)
	at org.apache.maven.lifecycle.internal.builder.singlethreaded.SingleThreadedBuilder.build(SingleThreadedBuilder.java:51)
	at org.apache.maven.lifecycle.internal.LifecycleStarter.execute(LifecycleStarter.java:128)
	at org.apache.maven.DefaultMaven.doExecute(DefaultMaven.java:307)
	at org.apache.maven.DefaultMaven.doExecute(DefaultMaven.java:193)
	at org.apache.maven.DefaultMaven.execute(DefaultMaven.java:106)
	at org.jvnet.hudson.maven3.launcher.Maven33Launcher.main(Maven33Launcher.java:129)
	at sun.reflect.NativeMethodAccessorImpl.invoke0(Native Method)
	at sun.reflect.NativeMethodAccessorImpl.invoke(NativeMethodAccessorImpl.java:62)
	at sun.reflect.DelegatingMethodAccessorImpl.invoke(DelegatingMethodAccessorImpl.java:43)
	at java.lang.reflect.Method.invoke(Method.java:498)
	at org.codehaus.plexus.classworlds.launcher.Launcher.launchStandard(Launcher.java:330)
	at org.codehaus.plexus.classworlds.launcher.Launcher.launch(Launcher.java:238)
	at jenkins.maven3.agent.Maven33Main.launch(Maven33Main.java:176)
	at sun.reflect.NativeMethodAccessorImpl.invoke0(Native Method)
	at sun.reflect.NativeMethodAccessorImpl.invoke(NativeMethodAccessorImpl.java:62)
	at sun.reflect.DelegatingMethodAccessorImpl.invoke(DelegatingMethodAccessorImpl.java:43)
	at java.lang.reflect.Method.invoke(Method.java:498)
	at hudson.maven.Maven3Builder.call(Maven3Builder.java:139)
	at hudson.maven.Maven3Builder.call(Maven3Builder.java:70)
	at hudson.remoting.UserRequest.perform(UserRequest.java:181)
	at hudson.remoting.UserRequest.perform(UserRequest.java:52)
	at hudson.remoting.Request$2.run(Request.java:336)
	at hudson.remoting.InterceptingExecutorService$1.call(InterceptingExecutorService.java:68)
	at java.util.concurrent.FutureTask.run(FutureTask.java:266)
	at java.util.concurrent.ThreadPoolExecutor.runWorker(ThreadPoolExecutor.java:1149)
	at java.util.concurrent.ThreadPoolExecutor$Worker.run(ThreadPoolExecutor.java:624)
	at java.lang.Thread.run(Thread.java:748)
Caused by: org.apache.maven.plugin.compiler.CompilationFailureException: Compilation failure
	at org.apache.maven.plugin.compiler.AbstractCompilerMojo.execute(AbstractCompilerMojo.java:1029)
	at org.apache.maven.plugin.compiler.TestCompilerMojo.execute(TestCompilerMojo.java:170)
	at org.apache.maven.plugin.DefaultBuildPluginManager.executeMojo(DefaultBuildPluginManager.java:134)
	at org.apache.maven.lifecycle.internal.MojoExecutor.execute(MojoExecutor.java:207)
	... 31 more
[ERROR] 
[ERROR] Re-run Maven using the -X switch to enable full debug logging.
[ERROR] 
[ERROR] For more information about the errors and possible solutions, please read the following
articles:
[ERROR] [Help 1] http://cwiki.apache.org/confluence/display/MAVEN/MojoFailureException
[ERROR] 
[ERROR] After correcting the problems, you can resume the build with the command
[ERROR]   mvn <goals> -rf :org.apache.karaf.jaas.modules
[JENKINS] Archiving <https://builds.apache.org/job/karaf-4.1.x/ws/archetypes/blueprint/pom.xml>
to org.apache.karaf.archetypes/karaf-blueprint-archetype/4.1.4-SNAPSHOT/karaf-blueprint-archetype-4.1.4-SNAPSHOT.pom
[JENKINS] Archiving <https://builds.apache.org/job/karaf-4.1.x/ws/webconsole/gogo/pom.xml>
to org.apache.karaf.webconsole/org.apache.karaf.webconsole.gogo/4.1.4-SNAPSHOT/org.apache.karaf.webconsole.gogo-4.1.4-SNAPSHOT.pom
[JENKINS] Archiving <https://builds.apache.org/job/karaf-4.1.x/ws/management/pom.xml>
to org.apache.karaf.management/management/4.1.4-SNAPSHOT/management-4.1.4-SNAPSHOT.pom
[JENKINS] Archiving <https://builds.apache.org/job/karaf-4.1.x/ws/jpa/hibernate/pom.xml>
to org.apache.karaf.jpa/hibernate/4.1.4-SNAPSHOT/hibernate-4.1.4-SNAPSHOT.pom
[JENKINS] Archiving <https://builds.apache.org/job/karaf-4.1.x/ws/archetypes/pom.xml>
to org.apache.karaf/archetypes/4.1.4-SNAPSHOT/archetypes-4.1.4-SNAPSHOT.pom
[JENKINS] Archiving <https://builds.apache.org/job/karaf-4.1.x/ws/demos/profiles/pom.xml>
to org.apache.karaf.demos.profiles/profiles/4.1.4-SNAPSHOT/profiles-4.1.4-SNAPSHOT.pom
[JENKINS] Archiving <https://builds.apache.org/job/karaf-4.1.x/ws/assemblies/features/pom.xml>
to org.apache.karaf.assemblies.features/features/4.1.4-SNAPSHOT/features-4.1.4-SNAPSHOT.pom
[JENKINS] Archiving <https://builds.apache.org/job/karaf-4.1.x/ws/features/core/pom.xml>
to org.apache.karaf.features/org.apache.karaf.features.core/4.1.4-SNAPSHOT/org.apache.karaf.features.core-4.1.4-SNAPSHOT.pom
[JENKINS] Archiving <https://builds.apache.org/job/karaf-4.1.x/ws/features/core/target/org.apache.karaf.features.core-4.1.4-SNAPSHOT.jar>
to org.apache.karaf.features/org.apache.karaf.features.core/4.1.4-20171208.170416-63/org.apache.karaf.features.core-4.1.4-20171208.170416-63.jar
[JENKINS] Archiving <https://builds.apache.org/job/karaf-4.1.x/ws/demos/profiles/dynamic/pom.xml>
to org.apache.karaf.demos.profiles/dynamic/4.1.4-SNAPSHOT/dynamic-4.1.4-SNAPSHOT.pom
[JENKINS] Archiving <https://builds.apache.org/job/karaf-4.1.x/ws/demos/dump/pom.xml>
to org.apache.karaf.demos/dump/4.1.4-SNAPSHOT/dump-4.1.4-SNAPSHOT.pom
[JENKINS] Archiving <https://builds.apache.org/job/karaf-4.1.x/ws/services/coordinator/pom.xml>
to org.apache.karaf.services/org.apache.karaf.services.coordinator/4.1.4-SNAPSHOT/org.apache.karaf.services.coordinator-4.1.4-SNAPSHOT.pom
[JENKINS] Archiving <https://builds.apache.org/job/karaf-4.1.x/ws/system/pom.xml> to
org.apache.karaf.system/org.apache.karaf.system.core/4.1.4-SNAPSHOT/org.apache.karaf.system.core-4.1.4-SNAPSHOT.pom
[JENKINS] Archiving <https://builds.apache.org/job/karaf-4.1.x/ws/client/pom.xml> to
org.apache.karaf/org.apache.karaf.client/4.1.4-SNAPSHOT/org.apache.karaf.client-4.1.4-SNAPSHOT.pom
[JENKINS] Archiving <https://builds.apache.org/job/karaf-4.1.x/ws/jpa/pom.xml> to org.apache.karaf.jpa/jpa-parent/4.1.4-SNAPSHOT/jpa-parent-4.1.4-SNAPSHOT.pom
[JENKINS] Archiving <https://builds.apache.org/job/karaf-4.1.x/ws/assemblies/demos/pom.xml>
to org.apache.karaf/demos/4.1.4-SNAPSHOT/demos-4.1.4-SNAPSHOT.pom
[JENKINS] Archiving <https://builds.apache.org/job/karaf-4.1.x/ws/bundle/blueprintstate/pom.xml>
to org.apache.karaf.bundle/org.apache.karaf.bundle.blueprintstate/4.1.4-SNAPSHOT/org.apache.karaf.bundle.blueprintstate-4.1.4-SNAPSHOT.pom
[JENKINS] Archiving <https://builds.apache.org/job/karaf-4.1.x/ws/main/pom.xml> to org.apache.karaf/org.apache.karaf.main/4.1.4-SNAPSHOT/org.apache.karaf.main-4.1.4-SNAPSHOT.pom
[JENKINS] Archiving <https://builds.apache.org/job/karaf-4.1.x/ws/main/target/org.apache.karaf.main-4.1.4-SNAPSHOT.jar>
to org.apache.karaf/org.apache.karaf.main/4.1.4-20171208.170238-63/org.apache.karaf.main-4.1.4-20171208.170238-63.jar
[JENKINS] Archiving <https://builds.apache.org/job/karaf-4.1.x/ws/scr/management/pom.xml>
to org.apache.karaf.scr/org.apache.karaf.scr.management/4.1.4-SNAPSHOT/org.apache.karaf.scr.management-4.1.4-SNAPSHOT.pom
[JENKINS] Archiving <https://builds.apache.org/job/karaf-4.1.x/ws/assemblies/pom.xml>
to org.apache.karaf.assemblies/assemblies/4.1.4-SNAPSHOT/assemblies-4.1.4-SNAPSHOT.pom
[JENKINS] Archiving <https://builds.apache.org/job/karaf-4.1.x/ws/assemblies/apache-karaf-minimal/pom.xml>
to org.apache.karaf/apache-karaf-minimal/4.1.4-SNAPSHOT/apache-karaf-minimal-4.1.4-SNAPSHOT.pom
[JENKINS] Archiving <https://builds.apache.org/job/karaf-4.1.x/ws/bundle/springstate/pom.xml>
to org.apache.karaf.bundle/org.apache.karaf.bundle.springstate/4.1.4-SNAPSHOT/org.apache.karaf.bundle.springstate-4.1.4-SNAPSHOT.pom
[JENKINS] Archiving <https://builds.apache.org/job/karaf-4.1.x/ws/diagnostic/core/pom.xml>
to org.apache.karaf.diagnostic/org.apache.karaf.diagnostic.core/4.1.4-SNAPSHOT/org.apache.karaf.diagnostic.core-4.1.4-SNAPSHOT.pom
[JENKINS] Archiving <https://builds.apache.org/job/karaf-4.1.x/ws/deployer/spring/pom.xml>
to org.apache.karaf.deployer/org.apache.karaf.deployer.spring/4.1.4-SNAPSHOT/org.apache.karaf.deployer.spring-4.1.4-SNAPSHOT.pom
[JENKINS] Archiving <https://builds.apache.org/job/karaf-4.1.x/ws/deployer/pom.xml>
to org.apache.karaf.deployer/deployer/4.1.4-SNAPSHOT/deployer-4.1.4-SNAPSHOT.pom
[JENKINS] Archiving <https://builds.apache.org/job/karaf-4.1.x/ws/jms/core/pom.xml>
to org.apache.karaf.jms/org.apache.karaf.jms.core/4.1.4-SNAPSHOT/org.apache.karaf.jms.core-4.1.4-SNAPSHOT.pom
[JENKINS] Archiving <https://builds.apache.org/job/karaf-4.1.x/ws/bundle/core/pom.xml>
to org.apache.karaf.bundle/org.apache.karaf.bundle.core/4.1.4-SNAPSHOT/org.apache.karaf.bundle.core-4.1.4-SNAPSHOT.pom
[JENKINS] Archiving <https://builds.apache.org/job/karaf-4.1.x/ws/shell/ssh/pom.xml>
to org.apache.karaf.shell/org.apache.karaf.shell.ssh/4.1.4-SNAPSHOT/org.apache.karaf.shell.ssh-4.1.4-SNAPSHOT.pom
[JENKINS] Archiving <https://builds.apache.org/job/karaf-4.1.x/ws/webconsole/instance/pom.xml>
to org.apache.karaf.webconsole/org.apache.karaf.webconsole.instance/4.1.4-SNAPSHOT/org.apache.karaf.webconsole.instance-4.1.4-SNAPSHOT.pom
[JENKINS] Archiving <https://builds.apache.org/job/karaf-4.1.x/ws/demos/deployer/bundle/pom.xml>
to org.apache.karaf.demos.deployer.bundle/my-bundle/4.1.4-SNAPSHOT/my-bundle-4.1.4-SNAPSHOT.pom
[JENKINS] Archiving <https://builds.apache.org/job/karaf-4.1.x/ws/deployer/features/pom.xml>
to org.apache.karaf.deployer/org.apache.karaf.deployer.features/4.1.4-SNAPSHOT/org.apache.karaf.deployer.features-4.1.4-SNAPSHOT.pom
[JENKINS] Archiving <https://builds.apache.org/job/karaf-4.1.x/ws/jaas/jasypt/pom.xml>
to org.apache.karaf.jaas/org.apache.karaf.jaas.jasypt/4.1.4-SNAPSHOT/org.apache.karaf.jaas.jasypt-4.1.4-SNAPSHOT.pom
[JENKINS] Archiving <https://builds.apache.org/job/karaf-4.1.x/ws/services/pom.xml>
to org.apache.karaf.services/services/4.1.4-SNAPSHOT/services-4.1.4-SNAPSHOT.pom
[JENKINS] Archiving <https://builds.apache.org/job/karaf-4.1.x/ws/jaas/blueprint/config/pom.xml>
to org.apache.karaf.jaas.blueprint/org.apache.karaf.jaas.blueprint.config/4.1.4-SNAPSHOT/org.apache.karaf.jaas.blueprint.config-4.1.4-SNAPSHOT.pom
[JENKINS] Archiving <https://builds.apache.org/job/karaf-4.1.x/ws/demos/deployer/pom.xml>
to org.apache.karaf.demos/org.apache.karaf.demos.deployer/4.1.4-SNAPSHOT/org.apache.karaf.demos.deployer-4.1.4-SNAPSHOT.pom
[JENKINS] Archiving <https://builds.apache.org/job/karaf-4.1.x/ws/pom.xml> to org.apache.karaf/karaf/4.1.4-SNAPSHOT/karaf-4.1.4-SNAPSHOT.pom
[Fast Archiver] Compressed 98.92 KB of artifacts by 97.0% relative to #364
[JENKINS] Archiving <https://builds.apache.org/job/karaf-4.1.x/ws/assemblies/features/base/pom.xml>
to org.apache.karaf.features/base/4.1.4-SNAPSHOT/base-4.1.4-SNAPSHOT.pom
[JENKINS] Archiving <https://builds.apache.org/job/karaf-4.1.x/ws/scr/examples/pom.xml>
to org.apache.karaf.scr/org.apache.karaf.scr.examples/4.1.4-SNAPSHOT/org.apache.karaf.scr.examples-4.1.4-SNAPSHOT.pom
[JENKINS] Archiving <https://builds.apache.org/job/karaf-4.1.x/ws/assemblies/features/standard/pom.xml>
to org.apache.karaf.features/standard/4.1.4-SNAPSHOT/standard-4.1.4-SNAPSHOT.pom
[JENKINS] Archiving <https://builds.apache.org/job/karaf-4.1.x/ws/web/pom.xml> to org.apache.karaf.web/org.apache.karaf.web.core/4.1.4-SNAPSHOT/org.apache.karaf.web.core-4.1.4-SNAPSHOT.pom
[JENKINS] Archiving <https://builds.apache.org/job/karaf-4.1.x/ws/log/pom.xml> to org.apache.karaf.log/org.apache.karaf.log.core/4.1.4-SNAPSHOT/org.apache.karaf.log.core-4.1.4-SNAPSHOT.pom
[JENKINS] Archiving <https://builds.apache.org/job/karaf-4.1.x/ws/exception/pom.xml>
to org.apache.karaf/org.apache.karaf.exception/4.1.4-SNAPSHOT/org.apache.karaf.exception-4.1.4-SNAPSHOT.pom
[JENKINS] Archiving <https://builds.apache.org/job/karaf-4.1.x/ws/instance/pom.xml>
to org.apache.karaf.instance/org.apache.karaf.instance.core/4.1.4-SNAPSHOT/org.apache.karaf.instance.core-4.1.4-SNAPSHOT.pom
[JENKINS] Archiving <https://builds.apache.org/job/karaf-4.1.x/ws/shell/pom.xml> to
org.apache.karaf.shell/shell/4.1.4-SNAPSHOT/shell-4.1.4-SNAPSHOT.pom
[JENKINS] Archiving <https://builds.apache.org/job/karaf-4.1.x/ws/features/pom.xml>
to org.apache.karaf.features/features/4.1.4-SNAPSHOT/features-4.1.4-SNAPSHOT.pom
[JENKINS] Archiving <https://builds.apache.org/job/karaf-4.1.x/ws/kar/pom.xml> to org.apache.karaf.kar/org.apache.karaf.kar.core/4.1.4-SNAPSHOT/org.apache.karaf.kar.core-4.1.4-SNAPSHOT.pom
[JENKINS] Archiving <https://builds.apache.org/job/karaf-4.1.x/ws/kar/target/org.apache.karaf.kar.core-4.1.4-SNAPSHOT.jar>
to org.apache.karaf.kar/org.apache.karaf.kar.core/4.1.4-20171208.170440-63/org.apache.karaf.kar.core-4.1.4-20171208.170440-63.jar
[JENKINS] Archiving <https://builds.apache.org/job/karaf-4.1.x/ws/service/pom.xml> to
org.apache.karaf.service/service/4.1.4-SNAPSHOT/service-4.1.4-SNAPSHOT.pom
[JENKINS] Archiving <https://builds.apache.org/job/karaf-4.1.x/ws/diagnostic/pom.xml>
to org.apache.karaf.diagnostic/diagnostic/4.1.4-SNAPSHOT/diagnostic-4.1.4-SNAPSHOT.pom
[JENKINS] Archiving <https://builds.apache.org/job/karaf-4.1.x/ws/jaas/pom.xml> to org.apache.karaf.jaas/jaas/4.1.4-SNAPSHOT/jaas-4.1.4-SNAPSHOT.pom
[JENKINS] Archiving <https://builds.apache.org/job/karaf-4.1.x/ws/diagnostic/boot/pom.xml>
to org.apache.karaf.diagnostic/org.apache.karaf.diagnostic.boot/4.1.4-SNAPSHOT/org.apache.karaf.diagnostic.boot-4.1.4-SNAPSHOT.pom
[JENKINS] Archiving <https://builds.apache.org/job/karaf-4.1.x/ws/jndi/pom.xml> to org.apache.karaf.jndi/org.apache.karaf.jndi.core/4.1.4-SNAPSHOT/org.apache.karaf.jndi.core-4.1.4-SNAPSHOT.pom
[JENKINS] Archiving <https://builds.apache.org/job/karaf-4.1.x/ws/event/pom.xml> to
org.apache.karaf/org.apache.karaf.event/4.1.4-SNAPSHOT/org.apache.karaf.event-4.1.4-SNAPSHOT.pom
[JENKINS] Archiving <https://builds.apache.org/job/karaf-4.1.x/ws/jaas/blueprint/pom.xml>
to org.apache.karaf.jaas.blueprint/blueprint/4.1.4-SNAPSHOT/blueprint-4.1.4-SNAPSHOT.pom
[JENKINS] Archiving <https://builds.apache.org/job/karaf-4.1.x/ws/scr/state/pom.xml>
to org.apache.karaf.scr/org.apache.karaf.scr.state/4.1.4-SNAPSHOT/org.apache.karaf.scr.state-4.1.4-SNAPSHOT.pom
[JENKINS] Archiving <https://builds.apache.org/job/karaf-4.1.x/ws/jdbc/pom.xml> to org.apache.karaf.jdbc/org.apache.karaf.jdbc.core/4.1.4-SNAPSHOT/org.apache.karaf.jdbc.core-4.1.4-SNAPSHOT.pom
[JENKINS] Archiving <https://builds.apache.org/job/karaf-4.1.x/ws/demos/web/pom.xml>
to org.apache.karaf.demos/web/4.1.4-SNAPSHOT/web-4.1.4-SNAPSHOT.pom
[JENKINS] Archiving <https://builds.apache.org/job/karaf-4.1.x/ws/archetypes/feature/pom.xml>
to org.apache.karaf.archetypes/karaf-feature-archetype/4.1.4-SNAPSHOT/karaf-feature-archetype-4.1.4-SNAPSHOT.pom
[JENKINS] Archiving <https://builds.apache.org/job/karaf-4.1.x/ws/shell/core/pom.xml>
to org.apache.karaf.shell/org.apache.karaf.shell.core/4.1.4-SNAPSHOT/org.apache.karaf.shell.core-4.1.4-SNAPSHOT.pom
[JENKINS] Archiving <https://builds.apache.org/job/karaf-4.1.x/ws/shell/core/target/org.apache.karaf.shell.core-4.1.4-SNAPSHOT.jar>
to org.apache.karaf.shell/org.apache.karaf.shell.core/4.1.4-20171208.170335-63/org.apache.karaf.shell.core-4.1.4-20171208.170335-63.jar
[Fast Archiver] Compressed 631.80 KB of artifacts by 35.5% relative to #364
[JENKINS] Archiving <https://builds.apache.org/job/karaf-4.1.x/ws/config/pom.xml> to
org.apache.karaf.config/org.apache.karaf.config.core/4.1.4-SNAPSHOT/org.apache.karaf.config.core-4.1.4-SNAPSHOT.pom
[JENKINS] Archiving <https://builds.apache.org/job/karaf-4.1.x/ws/bundle/pom.xml> to
org.apache.karaf.bundle/bundle/4.1.4-SNAPSHOT/bundle-4.1.4-SNAPSHOT.pom
[JENKINS] Archiving <https://builds.apache.org/job/karaf-4.1.x/ws/deployer/blueprint/pom.xml>
to org.apache.karaf.deployer/org.apache.karaf.deployer.blueprint/4.1.4-SNAPSHOT/org.apache.karaf.deployer.blueprint-4.1.4-SNAPSHOT.pom
[JENKINS] Archiving <https://builds.apache.org/job/karaf-4.1.x/ws/shell/table/pom.xml>
to org.apache.karaf.shell/org.apache.karaf.shell.table/4.1.4-SNAPSHOT/org.apache.karaf.shell.table-4.1.4-SNAPSHOT.pom
[JENKINS] Archiving <https://builds.apache.org/job/karaf-4.1.x/ws/assemblies/features/framework/pom.xml>
to org.apache.karaf.features/framework/4.1.4-SNAPSHOT/framework-4.1.4-SNAPSHOT.pom
[JENKINS] Archiving <https://builds.apache.org/job/karaf-4.1.x/ws/deployer/kar/pom.xml>
to org.apache.karaf.deployer/org.apache.karaf.deployer.kar/4.1.4-SNAPSHOT/org.apache.karaf.deployer.kar-4.1.4-SNAPSHOT.pom
[JENKINS] Archiving <https://builds.apache.org/job/karaf-4.1.x/ws/wrapper/pom.xml> to
org.apache.karaf.wrapper/org.apache.karaf.wrapper.core/4.1.4-SNAPSHOT/org.apache.karaf.wrapper.core-4.1.4-SNAPSHOT.pom
[JENKINS] Archiving <https://builds.apache.org/job/karaf-4.1.x/ws/services/eventadmin/pom.xml>
to org.apache.karaf.services/org.apache.karaf.services.eventadmin/4.1.4-SNAPSHOT/org.apache.karaf.services.eventadmin-4.1.4-SNAPSHOT.pom
[JENKINS] Archiving <https://builds.apache.org/job/karaf-4.1.x/ws/demos/pom.xml> to
org.apache.karaf.demos/demos/4.1.4-SNAPSHOT/demos-4.1.4-SNAPSHOT.pom
[JENKINS] Archiving <https://builds.apache.org/job/karaf-4.1.x/ws/tooling/utils/pom.xml>
to org.apache.karaf.tooling/org.apache.karaf.tools.utils/4.1.4-SNAPSHOT/org.apache.karaf.tools.utils-4.1.4-SNAPSHOT.pom
[JENKINS] Archiving <https://builds.apache.org/job/karaf-4.1.x/ws/scr/examples/component-factory/pom.xml>
to org.apache.karaf.scr.examples/org.apache.karaf.scr.examples.component.factories/4.1.4-SNAPSHOT/org.apache.karaf.scr.examples.component.factories-4.1.4-SNAPSHOT.pom
[JENKINS] Archiving <https://builds.apache.org/job/karaf-4.1.x/ws/service/core/pom.xml>
to org.apache.karaf.service/org.apache.karaf.service.core/4.1.4-SNAPSHOT/org.apache.karaf.service.core-4.1.4-SNAPSHOT.pom
[JENKINS] Archiving <https://builds.apache.org/job/karaf-4.1.x/ws/assemblies/features/spring-legacy/pom.xml>
to org.apache.karaf.features/spring-legacy/4.1.4-SNAPSHOT/spring-legacy-4.1.4-SNAPSHOT.pom
[JENKINS] Archiving <https://builds.apache.org/job/karaf-4.1.x/ws/assemblies/features/enterprise/pom.xml>
to org.apache.karaf.features/enterprise/4.1.4-SNAPSHOT/enterprise-4.1.4-SNAPSHOT.pom
[JENKINS] Archiving <https://builds.apache.org/job/karaf-4.1.x/ws/demos/deployer/kar/pom.xml>
to org.apache.karaf.demos/my-kar/4.1.4-SNAPSHOT/my-kar-4.1.4-SNAPSHOT.pom
[JENKINS] Archiving <https://builds.apache.org/job/karaf-4.1.x/ws/archetypes/kar/pom.xml>
to org.apache.karaf.archetypes/karaf-kar-archetype/4.1.4-SNAPSHOT/karaf-kar-archetype-4.1.4-SNAPSHOT.pom
[JENKINS] Archiving <https://builds.apache.org/job/karaf-4.1.x/ws/scr/command/pom.xml>
to org.apache.karaf.scr/org.apache.karaf.scr.command/4.1.4-SNAPSHOT/org.apache.karaf.scr.command-4.1.4-SNAPSHOT.pom
[JENKINS] Archiving <https://builds.apache.org/job/karaf-4.1.x/ws/jaas/command/pom.xml>
to org.apache.karaf.jaas/org.apache.karaf.jaas.command/4.1.4-SNAPSHOT/org.apache.karaf.jaas.command-4.1.4-SNAPSHOT.pom
[JENKINS] Archiving <https://builds.apache.org/job/karaf-4.1.x/ws/assemblies/features/spring/pom.xml>
to org.apache.karaf.features/spring/4.1.4-SNAPSHOT/spring-4.1.4-SNAPSHOT.pom
[JENKINS] Archiving <https://builds.apache.org/job/karaf-4.1.x/ws/archetypes/command/pom.xml>
to org.apache.karaf.archetypes/karaf-command-archetype/4.1.4-SNAPSHOT/karaf-command-archetype-4.1.4-SNAPSHOT.pom
[JENKINS] Archiving <https://builds.apache.org/job/karaf-4.1.x/ws/scr/pom.xml> to org.apache.karaf.scr/scr/4.1.4-SNAPSHOT/scr-4.1.4-SNAPSHOT.pom
[JENKINS] Archiving <https://builds.apache.org/job/karaf-4.1.x/ws/tooling/karaf-maven-plugin/pom.xml>
to org.apache.karaf.tooling/karaf-maven-plugin/4.1.4-SNAPSHOT/karaf-maven-plugin-4.1.4-SNAPSHOT.pom
[JENKINS] Archiving <https://builds.apache.org/job/karaf-4.1.x/ws/deployer/wrap/pom.xml>
to org.apache.karaf.deployer/org.apache.karaf.deployer.wrap/4.1.4-SNAPSHOT/org.apache.karaf.deployer.wrap-4.1.4-SNAPSHOT.pom
[JENKINS] Archiving <https://builds.apache.org/job/karaf-4.1.x/ws/jms/pom.xml> to org.apache.karaf.jms/parent/4.1.4-SNAPSHOT/parent-4.1.4-SNAPSHOT.pom
[JENKINS] Archiving <https://builds.apache.org/job/karaf-4.1.x/ws/assemblies/features/static/pom.xml>
to org.apache.karaf.features/static/4.1.4-SNAPSHOT/static-4.1.4-SNAPSHOT.pom
[JENKINS] Archiving <https://builds.apache.org/job/karaf-4.1.x/ws/webconsole/console/pom.xml>
to org.apache.karaf.webconsole/org.apache.karaf.webconsole.console/4.1.4-SNAPSHOT/org.apache.karaf.webconsole.console-4.1.4-SNAPSHOT.pom
[JENKINS] Archiving <https://builds.apache.org/job/karaf-4.1.x/ws/scr/examples/service/pom.xml>
to org.apache.karaf.scr.examples/org.apache.karaf.scr.examples.service/4.1.4-SNAPSHOT/org.apache.karaf.scr.examples.service-4.1.4-SNAPSHOT.pom
[JENKINS] Archiving <https://builds.apache.org/job/karaf-4.1.x/ws/scr/examples/managed-service/pom.xml>
to org.apache.karaf.scr.examples/org.apache.karaf.scr.examples.managed.service/4.1.4-SNAPSHOT/org.apache.karaf.scr.examples.managed.service-4.1.4-SNAPSHOT.pom
[JENKINS] Archiving <https://builds.apache.org/job/karaf-4.1.x/ws/obr/pom.xml> to org.apache.karaf.obr/org.apache.karaf.obr.core/4.1.4-SNAPSHOT/org.apache.karaf.obr.core-4.1.4-SNAPSHOT.pom
[JENKINS] Archiving <https://builds.apache.org/job/karaf-4.1.x/ws/itests/pom.xml> to
org.apache.karaf.itests/itests/4.1.4-SNAPSHOT/itests-4.1.4-SNAPSHOT.pom
[JENKINS] Archiving <https://builds.apache.org/job/karaf-4.1.x/ws/jaas/boot/pom.xml>
to org.apache.karaf.jaas/org.apache.karaf.jaas.boot/4.1.4-SNAPSHOT/org.apache.karaf.jaas.boot-4.1.4-SNAPSHOT.pom
[JENKINS] Archiving <https://builds.apache.org/job/karaf-4.1.x/ws/jaas/boot/target/org.apache.karaf.jaas.boot-4.1.4-SNAPSHOT.jar>
to org.apache.karaf.jaas/org.apache.karaf.jaas.boot/4.1.4-20171208.170114-63/org.apache.karaf.jaas.boot-4.1.4-20171208.170114-63.jar
[JENKINS] Archiving <https://builds.apache.org/job/karaf-4.1.x/ws/profile/pom.xml> to
org.apache.karaf.profile/org.apache.karaf.profile.core/4.1.4-SNAPSHOT/org.apache.karaf.profile.core-4.1.4-SNAPSHOT.pom
[JENKINS] Archiving <https://builds.apache.org/job/karaf-4.1.x/ws/demos/command/pom.xml>
to org.apache.karaf.demos/org.apache.karaf.demos.command/4.1.4-SNAPSHOT/org.apache.karaf.demos.command-4.1.4-SNAPSHOT.pom
[JENKINS] Archiving <https://builds.apache.org/job/karaf-4.1.x/ws/webconsole/features/pom.xml>
to org.apache.karaf.webconsole/org.apache.karaf.webconsole.features/4.1.4-SNAPSHOT/org.apache.karaf.webconsole.features-4.1.4-SNAPSHOT.pom
[JENKINS] Archiving <https://builds.apache.org/job/karaf-4.1.x/ws/tooling/pom.xml> to
org.apache.karaf.tooling/tooling/4.1.4-SNAPSHOT/tooling-4.1.4-SNAPSHOT.pom
[JENKINS] Archiving <https://builds.apache.org/job/karaf-4.1.x/ws/assemblies/apache-karaf/pom.xml>
to org.apache.karaf/apache-karaf/4.1.4-SNAPSHOT/apache-karaf-4.1.4-SNAPSHOT.pom
[JENKINS] Archiving <https://builds.apache.org/job/karaf-4.1.x/ws/shell/commands/pom.xml>
to org.apache.karaf.shell/org.apache.karaf.shell.commands/4.1.4-SNAPSHOT/org.apache.karaf.shell.commands-4.1.4-SNAPSHOT.pom
[JENKINS] Archiving <https://builds.apache.org/job/karaf-4.1.x/ws/demos/profiles/registry/pom.xml>
to org.apache.karaf.demos.profiles/registry/4.1.4-SNAPSHOT/registry-4.1.4-SNAPSHOT.pom
[JENKINS] Archiving <https://builds.apache.org/job/karaf-4.1.x/ws/http/pom.xml> to org.apache.karaf.http/org.apache.karaf.http.core/4.1.4-SNAPSHOT/org.apache.karaf.http.core-4.1.4-SNAPSHOT.pom
[JENKINS] Archiving <https://builds.apache.org/job/karaf-4.1.x/ws/webconsole/http/pom.xml>
to org.apache.karaf.webconsole/org.apache.karaf.webconsole.http/4.1.4-SNAPSHOT/org.apache.karaf.webconsole.http-4.1.4-SNAPSHOT.pom
[JENKINS] Archiving <https://builds.apache.org/job/karaf-4.1.x/ws/jaas/config/pom.xml>
to org.apache.karaf.jaas/org.apache.karaf.jaas.config/4.1.4-SNAPSHOT/org.apache.karaf.jaas.config-4.1.4-SNAPSHOT.pom
[JENKINS] Archiving <https://builds.apache.org/job/karaf-4.1.x/ws/jaas/config/target/org.apache.karaf.jaas.config-4.1.4-SNAPSHOT.jar>
to org.apache.karaf.jaas/org.apache.karaf.jaas.config/4.1.4-20171208.170450-63/org.apache.karaf.jaas.config-4.1.4-20171208.170450-63.jar
[JENKINS] Archiving <https://builds.apache.org/job/karaf-4.1.x/ws/services/staticcm/pom.xml>
to org.apache.karaf.services/org.apache.karaf.services.staticcm/4.1.4-SNAPSHOT/org.apache.karaf.services.staticcm-4.1.4-SNAPSHOT.pom
[JENKINS] Archiving <https://builds.apache.org/job/karaf-4.1.x/ws/jaas/blueprint/jasypt/pom.xml>
to org.apache.karaf.jaas.blueprint/org.apache.karaf.jaas.blueprint.jasypt/4.1.4-SNAPSHOT/org.apache.karaf.jaas.blueprint.jasypt-4.1.4-SNAPSHOT.pom
[JENKINS] Archiving <https://builds.apache.org/job/karaf-4.1.x/ws/archetypes/bundle/pom.xml>
to org.apache.karaf.archetypes/karaf-bundle-archetype/4.1.4-SNAPSHOT/karaf-bundle-archetype-4.1.4-SNAPSHOT.pom
[JENKINS] Archiving <https://builds.apache.org/job/karaf-4.1.x/ws/subsystem/pom.xml>
to org.apache.karaf.subsystem/org.apache.karaf.subsystem.core/4.1.4-SNAPSHOT/org.apache.karaf.subsystem.core-4.1.4-SNAPSHOT.pom
[JENKINS] Archiving <https://builds.apache.org/job/karaf-4.1.x/ws/shell/console/pom.xml>
to org.apache.karaf.shell/org.apache.karaf.shell.console/4.1.4-SNAPSHOT/org.apache.karaf.shell.console-4.1.4-SNAPSHOT.pom
[JENKINS] Archiving <https://builds.apache.org/job/karaf-4.1.x/ws/webconsole/pom.xml>
to org.apache.karaf.webconsole/webconsole/4.1.4-SNAPSHOT/webconsole-4.1.4-SNAPSHOT.pom
[JENKINS] Archiving <https://builds.apache.org/job/karaf-4.1.x/ws/jaas/modules/pom.xml>
to org.apache.karaf.jaas/org.apache.karaf.jaas.modules/4.1.4-SNAPSHOT/org.apache.karaf.jaas.modules-4.1.4-SNAPSHOT.pom
[JENKINS] Archiving <https://builds.apache.org/job/karaf-4.1.x/ws/demos/branding/pom.xml>
to org.apache.karaf.demos/org.apache.karaf.demos.branding.shell/4.1.4-SNAPSHOT/org.apache.karaf.demos.branding.shell-4.1.4-SNAPSHOT.pom
[JENKINS] Archiving <https://builds.apache.org/job/karaf-4.1.x/ws/assemblies/features/enterprise-legacy/pom.xml>
to org.apache.karaf.features/enterprise-legacy/4.1.4-SNAPSHOT/enterprise-legacy-4.1.4-SNAPSHOT.pom
[JENKINS] Archiving <https://builds.apache.org/job/karaf-4.1.x/ws/archetypes/assembly/pom.xml>
to org.apache.karaf.archetypes/karaf-assembly-archetype/4.1.4-SNAPSHOT/karaf-assembly-archetype-4.1.4-SNAPSHOT.pom
[JENKINS] Archiving <https://builds.apache.org/job/karaf-4.1.x/ws/features/extension/pom.xml>
to org.apache.karaf.features/org.apache.karaf.features.extension/4.1.4-SNAPSHOT/org.apache.karaf.features.extension-4.1.4-SNAPSHOT.pom
[JENKINS] Archiving <https://builds.apache.org/job/karaf-4.1.x/ws/features/extension/target/org.apache.karaf.features.extension-4.1.4-SNAPSHOT.jar>
to org.apache.karaf.features/org.apache.karaf.features.extension/4.1.4-20171208.170256-63/org.apache.karaf.features.extension-4.1.4-20171208.170256-63.jar
[JENKINS] Archiving <https://builds.apache.org/job/karaf-4.1.x/ws/management/server/pom.xml>
to org.apache.karaf.management/org.apache.karaf.management.server/4.1.4-SNAPSHOT/org.apache.karaf.management.server-4.1.4-SNAPSHOT.pom
[JENKINS] Archiving <https://builds.apache.org/job/karaf-4.1.x/ws/service/guard/pom.xml>
to org.apache.karaf.service/org.apache.karaf.service.guard/4.1.4-SNAPSHOT/org.apache.karaf.service.guard-4.1.4-SNAPSHOT.pom
[JENKINS] Archiving <https://builds.apache.org/job/karaf-4.1.x/ws/service/guard/target/org.apache.karaf.service.guard-4.1.4-SNAPSHOT.jar>
to org.apache.karaf.service/org.apache.karaf.service.guard/4.1.4-20171208.170315-63/org.apache.karaf.service.guard-4.1.4-20171208.170315-63.jar
[JENKINS] Archiving <https://builds.apache.org/job/karaf-4.1.x/ws/demos/profiles/static/pom.xml>
to org.apache.karaf.demos.profiles/static/4.1.4-SNAPSHOT/static-4.1.4-SNAPSHOT.pom
[JENKINS] Archiving <https://builds.apache.org/job/karaf-4.1.x/ws/tooling/karaf-services-maven-plugin/pom.xml>
to org.apache.karaf.tooling/karaf-services-maven-plugin/4.1.4-SNAPSHOT/karaf-services-maven-plugin-4.1.4-SNAPSHOT.pom
[JENKINS] Archiving <https://builds.apache.org/job/karaf-4.1.x/ws/tooling/karaf-services-maven-plugin/target/karaf-services-maven-plugin-4.1.4-SNAPSHOT.jar>
to org.apache.karaf.tooling/karaf-services-maven-plugin/4.1.4-20171208.170357-63/karaf-services-maven-plugin-4.1.4-20171208.170357-63.jar
[JENKINS] Archiving <https://builds.apache.org/job/karaf-4.1.x/ws/package/pom.xml> to
org.apache.karaf.package/org.apache.karaf.package.core/4.1.4-SNAPSHOT/org.apache.karaf.package.core-4.1.4-SNAPSHOT.pom
[JENKINS] Archiving <https://builds.apache.org/job/karaf-4.1.x/ws/features/command/pom.xml>
to org.apache.karaf.features/org.apache.karaf.features.command/4.1.4-SNAPSHOT/org.apache.karaf.features.command-4.1.4-SNAPSHOT.pom
[JENKINS] Archiving <https://builds.apache.org/job/karaf-4.1.x/ws/features/command/target/org.apache.karaf.features.command-4.1.4-SNAPSHOT.jar>
to org.apache.karaf.features/org.apache.karaf.features.command/4.1.4-20171208.170429-63/org.apache.karaf.features.command-4.1.4-20171208.170429-63.jar
[JENKINS] Archiving <https://builds.apache.org/job/karaf-4.1.x/ws/scheduler/pom.xml>
to org.apache.karaf.scheduler/org.apache.karaf.scheduler.core/4.1.4-SNAPSHOT/org.apache.karaf.scheduler.core-4.1.4-SNAPSHOT.pom
[JENKINS] Archiving <https://builds.apache.org/job/karaf-4.1.x/ws/util/pom.xml> to org.apache.karaf/org.apache.karaf.util/4.1.4-SNAPSHOT/org.apache.karaf.util-4.1.4-SNAPSHOT.pom
[JENKINS] Archiving <https://builds.apache.org/job/karaf-4.1.x/ws/util/target/org.apache.karaf.util-4.1.4-SNAPSHOT.jar>
to org.apache.karaf/org.apache.karaf.util/4.1.4-20171208.170217-63/org.apache.karaf.util-4.1.4-20171208.170217-63.jar
channel stopped
Not sending mail to unregistered user freeman.fang@gmail.com
Not sending mail to unregistered user luke@code-house.org

Mime
View raw message