karaf-commits mailing list archives

Site index · List index
Message view « Date » · « Thread »
Top « Date » · « Thread »
From Apache Jenkins Server <jenk...@builds.apache.org>
Subject Build failed in Jenkins: karaf-master #4757
Date Wed, 08 Nov 2017 09:38:37 GMT
See <https://builds.apache.org/job/karaf-master/4757/display/redirect?page=changes>

Changes:

[freeman.fang] [KARAF-5467]more fix

------------------------------------------
[...truncated 1.88 MB...]
ConfigManagedServiceFactoryTest: createNewFactoryConfig
config:edit --factory myconfig2
config:property-set test1 data1
config:update

ConfigManagedServiceFactoryTest: updateProperties
config:edit '(service.factorypid=myconfig)'
config:property-set test1 data1new
config:update
config:edit '(test2=data2)'
config:property-set test1 data1new2
config:update
2017-11-08 09:35:03,208 | INFO  | exam.spi.reactors.ReactorManager  444 | suite finished
[INFO] Tests run: 2, Failures: 0, Errors: 0, Skipped: 0, Time elapsed: 9.583 s - in org.apache.karaf.itests.ConfigManagedServiceFactoryTest
[INFO] Running org.apache.karaf.itests.MavenTest
2017-11-08 09:35:33,981 | INFO  | j.pax.exam.spi.DefaultExamSystem  127 | Pax Exam System
(Version: 4.11.0) created.
2017-11-08 09:35:34,049 | INFO  | .pax.exam.junit.impl.ProbeRunner   74 | creating PaxExam
runner for class org.apache.karaf.itests.MavenTest
2017-11-08 09:35:34,099 | INFO  | .pax.exam.junit.impl.ProbeRunner   94 | running test class
org.apache.karaf.itests.MavenTest
2017-11-08 09:35:34,101 | INFO  | iner.internal.KarafTestContainer  135 | Creating RMI registry
server on 127.0.0.1:21000
2017-11-08 09:35:35,207 | INFO  | iner.internal.KarafTestContainer  198 | Found 0 options
when requesting OverrideJUnitBundlesOption.class
2017-11-08 09:35:35,252 | INFO  | iner.internal.KarafTestContainer  249 | Wait for test container
to finish its initialization [ RelativeTimeout value = 180000 ]
2017-11-08 09:35:35,253 | INFO  | rn.RemoteBundleContextClientImpl  240 | Waiting for remote
bundle context.. on 21000 name: bff1d63b-4aa2-4015-980c-365e769ca9a3 timout: [ RelativeTimeout
value = 180000 ]
        __ __                  ____      
       / //_/____ __________ _/ __/      
      / ,<  / __ `/ ___/ __ `/ /_        
     / /| |/ /_/ / /  / /_/ / __/        
    /_/ |_|\__,_/_/   \__,_/_/         

  Apache Karaf (4.2.0-SNAPSHOT)

Hit '<tab>' for a list of available commands
and '[cmd] --help' for help on a specific command.
Hit '<ctrl-d>' or type 'system:shutdown' or 'logout' to shutdown
Karaf.

karaf@root()> 2017-11-08 09:35:48,413 | INFO  | exam.spi.reactors.ReactorManager  444 |
suite finished
[INFO] Tests run: 1, Failures: 0, Errors: 0, Skipped: 0, Time elapsed: 14.569 s - in org.apache.karaf.itests.MavenTest
[INFO] 
[INFO] Results:
[INFO] 
[ERROR] Failures: 
[ERROR]   JMXSecurityTest.testJMXSecurityAsAdmin:198->testKarafConfigAdminMBean:337->testKarafConfigAdminMBean:373
expected:<abc> but was:<null>
[INFO] 
[ERROR] Tests run: 208, Failures: 1, Errors: 0, Skipped: 3
[INFO] 
[ERROR] There are test failures.

Please refer to <https://builds.apache.org/job/karaf-master/ws/itests/target/surefire-reports>
for the individual test results.
Please refer to dump files (if any exist) [date]-jvmRun[N].dump, [date].dumpstream and [date]-jvmRun[N].dumpstream.
[JENKINS] Recording test results
[INFO] 
[INFO] --- maven-jar-plugin:3.0.2:jar (default-jar) @ itests ---
[INFO] Building jar: <https://builds.apache.org/job/karaf-master/ws/itests/target/itests-4.2.0-SNAPSHOT.jar>
[INFO] 
[INFO] --- maven-site-plugin:3.6:attach-descriptor (attach-descriptor) @ itests ---
[INFO] Skipping because packaging 'jar' is not pom.
[INFO] 
[INFO] --- maven-jar-plugin:3.0.2:test-jar (jar-test-classes) @ itests ---
[INFO] Building jar: <https://builds.apache.org/job/karaf-master/ws/itests/target/itests-4.2.0-SNAPSHOT-tests.jar>
[INFO] 
[INFO] --- maven-install-plugin:2.5.2:install (default-install) @ itests ---
[INFO] Installing <https://builds.apache.org/job/karaf-master/ws/itests/target/itests-4.2.0-SNAPSHOT.jar>
to <https://builds.apache.org/job/karaf-master/ws/.repository/org/apache/karaf/itests/itests/4.2.0-SNAPSHOT/itests-4.2.0-SNAPSHOT.jar>
[INFO] Installing <https://builds.apache.org/job/karaf-master/ws/itests/pom.xml> to
<https://builds.apache.org/job/karaf-master/ws/.repository/org/apache/karaf/itests/itests/4.2.0-SNAPSHOT/itests-4.2.0-SNAPSHOT.pom>
[INFO] Installing <https://builds.apache.org/job/karaf-master/ws/itests/target/itests-4.2.0-SNAPSHOT-tests.jar>
to <https://builds.apache.org/job/karaf-master/ws/.repository/org/apache/karaf/itests/itests/4.2.0-SNAPSHOT/itests-4.2.0-SNAPSHOT-tests.jar>
[INFO] 
[INFO] --- maven-deploy-plugin:2.8.2:deploy (default-deploy) @ itests ---
[INFO] Downloading: https://repository.apache.org/content/repositories/snapshots/org/apache/karaf/itests/itests/4.2.0-SNAPSHOT/maven-metadata.xml
[INFO] Downloaded: https://repository.apache.org/content/repositories/snapshots/org/apache/karaf/itests/itests/4.2.0-SNAPSHOT/maven-metadata.xml
(999 B at 1.3 KB/sec)
[INFO] Uploading: https://repository.apache.org/content/repositories/snapshots/org/apache/karaf/itests/itests/4.2.0-SNAPSHOT/itests-4.2.0-20171108.093621-389.jar
[INFO] Uploaded: https://repository.apache.org/content/repositories/snapshots/org/apache/karaf/itests/itests/4.2.0-SNAPSHOT/itests-4.2.0-20171108.093621-389.jar
(13 KB at 13.2 KB/sec)
[INFO] Uploading: https://repository.apache.org/content/repositories/snapshots/org/apache/karaf/itests/itests/4.2.0-SNAPSHOT/itests-4.2.0-20171108.093621-389.pom
[INFO] Uploaded: https://repository.apache.org/content/repositories/snapshots/org/apache/karaf/itests/itests/4.2.0-SNAPSHOT/itests-4.2.0-20171108.093621-389.pom
(13 KB at 13.1 KB/sec)
[INFO] Downloading: https://repository.apache.org/content/repositories/snapshots/org/apache/karaf/itests/itests/maven-metadata.xml
[INFO] Downloaded: https://repository.apache.org/content/repositories/snapshots/org/apache/karaf/itests/itests/maven-metadata.xml
(674 B at 1.2 KB/sec)
[INFO] Uploading: https://repository.apache.org/content/repositories/snapshots/org/apache/karaf/itests/itests/4.2.0-SNAPSHOT/maven-metadata.xml
[INFO] Uploaded: https://repository.apache.org/content/repositories/snapshots/org/apache/karaf/itests/itests/4.2.0-SNAPSHOT/maven-metadata.xml
(999 B at 1.1 KB/sec)
[INFO] Uploading: https://repository.apache.org/content/repositories/snapshots/org/apache/karaf/itests/itests/maven-metadata.xml
[INFO] Uploaded: https://repository.apache.org/content/repositories/snapshots/org/apache/karaf/itests/itests/maven-metadata.xml
(674 B at 0.8 KB/sec)
[INFO] Uploading: https://repository.apache.org/content/repositories/snapshots/org/apache/karaf/itests/itests/4.2.0-SNAPSHOT/itests-4.2.0-20171108.093621-389-tests.jar
[INFO] Uploaded: https://repository.apache.org/content/repositories/snapshots/org/apache/karaf/itests/itests/4.2.0-SNAPSHOT/itests-4.2.0-20171108.093621-389-tests.jar
(154 KB at 140.4 KB/sec)
[INFO] Uploading: https://repository.apache.org/content/repositories/snapshots/org/apache/karaf/itests/itests/4.2.0-SNAPSHOT/maven-metadata.xml
[INFO] Uploaded: https://repository.apache.org/content/repositories/snapshots/org/apache/karaf/itests/itests/4.2.0-SNAPSHOT/maven-metadata.xml
(999 B at 1.2 KB/sec)
[INFO] ------------------------------------------------------------------------
[INFO] Reactor Summary:
[INFO] 
[INFO] Apache Karaf ....................................... SUCCESS [ 12.327 s]
[INFO] Apache Karaf :: JAAS ............................... SUCCESS [  5.409 s]
[INFO] Apache Karaf :: JAAS :: Boot ....................... SUCCESS [ 10.370 s]
[INFO] Apache Karaf :: Util ............................... SUCCESS [ 22.465 s]
[INFO] Apache Karaf :: Main ............................... SUCCESS [ 18.985 s]
[INFO] Apache Karaf :: Features ........................... SUCCESS [  5.637 s]
[INFO] Apache Karaf :: Features :: Extension .............. SUCCESS [  9.425 s]
[INFO] Apache Karaf :: Service ............................ SUCCESS [  5.402 s]
[INFO] Apache Karaf :: Service :: Guard ................... SUCCESS [ 11.360 s]
[INFO] Apache Karaf :: Shell .............................. SUCCESS [  5.773 s]
[INFO] Apache Karaf :: Shell :: Core ...................... SUCCESS [ 24.134 s]
[INFO] Apache Karaf :: Tooling ............................ SUCCESS [  5.431 s]
[INFO] Apache Karaf :: Tooling :: Maven Karaf Plugin for Services Metadata SUCCESS [ 13.463
s]
[INFO] Apache Karaf :: Features :: Core ................... SUCCESS [ 16.403 s]
[INFO] Apache Karaf :: Features :: Command ................ SUCCESS [ 11.068 s]
[INFO] Apache Karaf :: KAR :: Core ........................ SUCCESS [  9.816 s]
[INFO] Apache Karaf :: JAAS :: Config ..................... SUCCESS [  8.076 s]
[INFO] Apache Karaf :: JAAS :: Modules .................... SUCCESS [02:53 min]
[INFO] Apache Karaf :: Bundle ............................. SUCCESS [  5.553 s]
[INFO] Apache Karaf :: Bundle :: Core ..................... SUCCESS [ 21.539 s]
[INFO] Apache Karaf :: Bundle :: BlueprintStateService .... SUCCESS [  7.935 s]
[INFO] Apache Karaf :: Bundle :: SpringStateService ....... SUCCESS [  7.777 s]
[INFO] Apache Karaf :: ConfigAdmin :: Core ................ SUCCESS [  9.991 s]
[INFO] Apache Karaf :: Tooling :: Utils ................... SUCCESS [ 10.031 s]
[INFO] Apache Karaf :: Deployer ........................... SUCCESS [  5.352 s]
[INFO] Apache Karaf :: Deployer :: Blueprint .............. SUCCESS [  9.557 s]
[INFO] Apache Karaf :: Deployer :: Spring ................. SUCCESS [  9.508 s]
[INFO] Apache Karaf :: Demos :: Profiles :: Registry ...... SUCCESS [  7.485 s]
[INFO] Apache Karaf :: Profile :: Core .................... SUCCESS [ 13.428 s]
[INFO] Apache Karaf :: Instance :: Core ................... SUCCESS [ 14.867 s]
[INFO] Apache Karaf :: Package :: Core .................... SUCCESS [  9.929 s]
[INFO] Apache Karaf :: HTTP :: Core ....................... SUCCESS [  9.695 s]
[INFO] Apache Karaf :: Service :: Core .................... SUCCESS [  9.548 s]
[INFO] Apache Karaf :: Log :: Core ........................ SUCCESS [ 10.230 s]
[INFO] Apache Karaf :: Deployer :: Features ............... SUCCESS [  9.289 s]
[INFO] Apache Karaf :: Deployer :: Karaf Archive (.kar) ... SUCCESS [  9.737 s]
[INFO] Apache Karaf :: Deployer :: Wrap Non OSGi Jar ...... SUCCESS [  8.013 s]
[INFO] Apache Karaf :: Shell :: Various Commands .......... SUCCESS [  9.756 s]
[INFO] Apache Karaf :: Shell :: Console ................... SUCCESS [  9.229 s]
[INFO] Apache Karaf :: Shell :: Table ..................... SUCCESS [  9.175 s]
[INFO] Apache Karaf :: Shell :: SSH ....................... SUCCESS [ 27.078 s]
[INFO] Apache Karaf :: JAAS :: Jasypt Encryption .......... SUCCESS [  9.545 s]
[INFO] Apache Karaf :: JAAS :: Command .................... SUCCESS [ 10.550 s]
[INFO] Apache Karaf :: JAAS :: Blueprint .................. SUCCESS [  5.505 s]
[INFO] Apache Karaf :: JAAS :: Blueprint :: Config ........ SUCCESS [  7.804 s]
[INFO] Apache Karaf :: JAAS :: Blueprint :: Jasypt ........ SUCCESS [ 10.224 s]
[INFO] Apache Karaf :: Client ............................. SUCCESS [ 11.562 s]
[INFO] Apache Karaf :: Management ......................... SUCCESS [  5.468 s]
[INFO] Apache Karaf :: Management ......................... SUCCESS [  9.821 s]
[INFO] Apache Karaf :: System :: Core ..................... SUCCESS [  9.613 s]
[INFO] Apache Karaf :: Web :: Core ........................ SUCCESS [  8.414 s]
[INFO] Apache Karaf :: Wrapper :: Core .................... SUCCESS [  9.827 s]
[INFO] Apache Karaf :: Web Console ........................ SUCCESS [  5.315 s]
[INFO] Apache Karaf :: Web Console :: Console ............. SUCCESS [  8.698 s]
[INFO] Apache Karaf :: Web Console :: Features Plugin ..... SUCCESS [  9.039 s]
[INFO] Apache Karaf :: Web Console :: Gogo Plugin ......... SUCCESS [  8.985 s]
[INFO] Apache Karaf :: Web Console :: HTTP Plugin ......... SUCCESS [  8.959 s]
[INFO] Apache Karaf :: Web Console :: Instance Plugin ..... SUCCESS [ 10.240 s]
[INFO] Apache Karaf :: Scheduler :: Core .................. SUCCESS [  9.847 s]
[INFO] Apache Karaf :: Declarative Services (DS) .......... SUCCESS [  5.391 s]
[INFO] Apache Karaf :: SCR :: Management MBeans ........... SUCCESS [  7.911 s]
[INFO] Apache Karaf :: SCR :: Bundle State ................ SUCCESS [  7.991 s]
[INFO] Apache Karaf :: SCR :: Examples .................... SUCCESS [  5.323 s]
[INFO] Apache Karaf :: SCR :: Examples :: Basic Service ... SUCCESS [  7.603 s]
[INFO] Apache Karaf :: SCR :: Examples :: Managed Services  SUCCESS [  7.831 s]
[INFO] Apache Karaf :: SCR :: Examples :: Component Factories SUCCESS [  7.794 s]
[INFO] Apache Karaf :: Diagnostic ......................... SUCCESS [  5.335 s]
[INFO] Apache Karaf :: Diagnostic :: Boot ................. SUCCESS [  7.617 s]
[INFO] Apache Karaf :: Diagnostic :: Core ................. SUCCESS [  9.496 s]
[INFO] Apache Karaf :: OBR :: Core ........................ SUCCESS [  8.800 s]
[INFO] Apache Karaf :: JNDI :: Core ....................... SUCCESS [  8.550 s]
[INFO] Apache Karaf :: JDBC :: Core ....................... SUCCESS [  8.820 s]
[INFO] Apache Karaf :: JMS :: Core ........................ SUCCESS [  9.193 s]
[INFO] Apache Karaf :: JPA :: Parent ...................... SUCCESS [  5.323 s]
[INFO] Apache Karaf :: JPA :: Hibernate ................... SUCCESS [  7.923 s]
[INFO] Apache Karaf :: Maven :: Core ...................... SUCCESS [ 14.933 s]
[INFO] Apache Karaf :: Maven .............................. SUCCESS [  5.455 s]
[INFO] Apache Karaf :: OSGi Services :: Coordinator ....... SUCCESS [  7.825 s]
[INFO] Apache Karaf :: OSGi Services :: EventAdmin ........ SUCCESS [  7.850 s]
[INFO] Apache Karaf :: OSGi Services :: Static ConfigAdmin  SUCCESS [  8.123 s]
[INFO] Apache Karaf :: OSGi Services ...................... SUCCESS [  5.250 s]
[INFO] Apache Karaf :: Subsystem :: Core .................. SUCCESS [  9.534 s]
[INFO] Apache Karaf :: OSGi Services :: Event ............. SUCCESS [  9.919 s]
[INFO] Apache Karaf :: Tooling :: Maven Karaf Plugin ...... SUCCESS [04:27 min]
[INFO] Apache Karaf :: Assemblies ......................... SUCCESS [  5.313 s]
[INFO] Apache Karaf :: Assemblies :: Features ............. SUCCESS [  5.384 s]
[INFO] Apache Karaf :: Assemblies :: Features :: Base ..... SUCCESS [  9.368 s]
[INFO] Apache Karaf :: Assemblies :: Features :: Framework  SUCCESS [ 12.608 s]
[INFO] Apache Karaf :: Assemblies :: Features :: Static ... SUCCESS [ 11.154 s]
[INFO] Apache Karaf :: Assemblies :: Features :: Standard . SUCCESS [ 34.364 s]
[INFO] Apache Karaf :: Assemblies :: Features :: Spring ... SUCCESS [ 16.457 s]
[INFO] Apache Karaf :: Assemblies :: Features :: Spring Legacy SUCCESS [ 41.237 s]
[INFO] Apache Karaf :: Assemblies :: Features :: Enterprise SUCCESS [ 15.188 s]
[INFO] Apache Karaf :: Assemblies :: Features :: Enterprise Legacy SUCCESS [ 14.325 s]
[INFO] Apache Karaf :: Assemblies :: Demos ................ SUCCESS [  7.919 s]
[INFO] Apache Karaf :: Assemblies :: Minimal Distribution . SUCCESS [ 16.033 s]
[INFO] Apache Karaf :: Assemblies :: Default Distribution . SUCCESS [ 16.854 s]
[INFO] Apache Karaf :: Demos .............................. SUCCESS [  5.336 s]
[INFO] Apache Karaf :: Demos :: Web ....................... SUCCESS [ 11.741 s]
[INFO] Apache Karaf :: Demos :: Branding :: Shell ......... SUCCESS [  7.481 s]
[INFO] Apache Karaf :: Demos :: Command :: Extend Console . SUCCESS [  8.299 s]
[INFO] Apache Karaf :: Demos :: Demo Dump provider ........ SUCCESS [  7.905 s]
[INFO] Apache Karaf :: Demos :: Deployer .................. SUCCESS [  5.249 s]
[INFO] Apache Karaf :: Demos :: Deployer :: Kar ........... SUCCESS [  7.657 s]
[INFO] Apache Karaf :: Demos :: Deployer :: Bundle ........ SUCCESS [  8.243 s]
[INFO] Apache Karaf :: Demos :: Profiles :: Dynamic Assembly SUCCESS [ 31.750 s]
[INFO] Apache Karaf :: Demos :: Profiles :: Static Assembly SUCCESS [01:52 min]
[INFO] Apache Karaf :: Demos :: Profiles .................. SUCCESS [  5.471 s]
[INFO] Apache Karaf :: Archetypes ......................... SUCCESS [  5.459 s]
[INFO] Apache Karaf :: Archetypes :: Assembly Archetype ... SUCCESS [ 28.060 s]
[INFO] Apache Karaf :: Archetypes :: Command Archetype .... SUCCESS [ 13.354 s]
[INFO] Apache Karaf :: Archetypes :: Feature Archetype .... SUCCESS [ 11.423 s]
[INFO] Apache Karaf :: Archetypes :: Kar Archetype ........ SUCCESS [ 12.184 s]
[INFO] Apache Karaf :: Archetypes :: Bundle Archetype ..... SUCCESS [ 12.001 s]
[INFO] Apache Karaf :: Archetypes :: Blueprint Archetype .. SUCCESS [ 12.266 s]
[INFO] Apache Karaf :: Integration Tests .................. SUCCESS [34:46 min]
[INFO] ------------------------------------------------------------------------
[INFO] BUILD SUCCESS
[INFO] ------------------------------------------------------------------------
[INFO] Total time: 01:08 h
[INFO] Finished at: 2017-11-08T09:38:26+00:00
[INFO] Final Memory: 240M/5319M
[INFO] ------------------------------------------------------------------------
[JENKINS] Archiving <https://builds.apache.org/job/karaf-master/ws/archetypes/blueprint/pom.xml>
to org.apache.karaf.archetypes/karaf-blueprint-archetype/4.2.0-SNAPSHOT/karaf-blueprint-archetype-4.2.0-SNAPSHOT.pom
[JENKINS] Archiving <https://builds.apache.org/job/karaf-master/ws/archetypes/blueprint/target/karaf-blueprint-archetype-4.2.0-SNAPSHOT.jar>
to org.apache.karaf.archetypes/karaf-blueprint-archetype/4.2.0-20171108.090145-430/karaf-blueprint-archetype-4.2.0-20171108.090145-430.jar
[JENKINS] Archiving <https://builds.apache.org/job/karaf-master/ws/webconsole/gogo/pom.xml>
to org.apache.karaf.webconsole/org.apache.karaf.webconsole.gogo/4.2.0-SNAPSHOT/org.apache.karaf.webconsole.gogo-4.2.0-SNAPSHOT.pom
[JENKINS] Archiving <https://builds.apache.org/job/karaf-master/ws/webconsole/gogo/target/org.apache.karaf.webconsole.gogo-4.2.0-SNAPSHOT.jar>
to org.apache.karaf.webconsole/org.apache.karaf.webconsole.gogo/4.2.0-20171108.084319-457/org.apache.karaf.webconsole.gogo-4.2.0-20171108.084319-457.jar
[JENKINS] Archiving <https://builds.apache.org/job/karaf-master/ws/management/pom.xml>
to org.apache.karaf.management/management/4.2.0-SNAPSHOT/management-4.2.0-SNAPSHOT.pom
[JENKINS] Archiving <https://builds.apache.org/job/karaf-master/ws/jpa/hibernate/pom.xml>
to org.apache.karaf.jpa/hibernate/4.2.0-SNAPSHOT/hibernate-4.2.0-SNAPSHOT.pom
[JENKINS] Archiving <https://builds.apache.org/job/karaf-master/ws/jpa/hibernate/target/hibernate-4.2.0-SNAPSHOT.jar>
to org.apache.karaf.jpa/hibernate/4.2.0-20171108.084634-455/hibernate-4.2.0-20171108.084634-455.jar
[JENKINS] Archiving <https://builds.apache.org/job/karaf-master/ws/archetypes/pom.xml>
to org.apache.karaf/archetypes/4.2.0-SNAPSHOT/archetypes-4.2.0-SNAPSHOT.pom
[JENKINS] Archiving <https://builds.apache.org/job/karaf-master/ws/demos/profiles/pom.xml>
to org.apache.karaf.demos.profiles/profiles/4.2.0-SNAPSHOT/profiles-4.2.0-SNAPSHOT.pom
[JENKINS] Archiving <https://builds.apache.org/job/karaf-master/ws/maven/pom.xml> to
org.apache.karaf.maven/maven-parent/4.2.0-SNAPSHOT/maven-parent-4.2.0-SNAPSHOT.pom
[JENKINS] Archiving <https://builds.apache.org/job/karaf-master/ws/assemblies/features/pom.xml>
to org.apache.karaf.assemblies.features/features/4.2.0-SNAPSHOT/features-4.2.0-SNAPSHOT.pom
[JENKINS] Archiving <https://builds.apache.org/job/karaf-master/ws/features/core/pom.xml>
to org.apache.karaf.features/org.apache.karaf.features.core/4.2.0-SNAPSHOT/org.apache.karaf.features.core-4.2.0-SNAPSHOT.pom
[JENKINS] Archiving <https://builds.apache.org/job/karaf-master/ws/features/core/target/org.apache.karaf.features.core-4.2.0-SNAPSHOT.jar>
to org.apache.karaf.features/org.apache.karaf.features.core/4.2.0-20171108.083239-472/org.apache.karaf.features.core-4.2.0-20171108.083239-472.jar
Build timed out (after 70 minutes). Marking the build as aborted.
ERROR: Failed to parse POMs
java.io.IOException: java.lang.InterruptedException
	at hudson.remoting.FastPipedInputStream.read(FastPipedInputStream.java:177)
	at hudson.util.HeadBufferingStream.read(HeadBufferingStream.java:61)
	at java.util.zip.InflaterInputStream.fill(InflaterInputStream.java:238)
	at java.util.zip.InflaterInputStream.read(InflaterInputStream.java:158)
	at java.util.zip.GZIPInputStream.read(GZIPInputStream.java:117)
	at com.google.common.io.LimitInputStream.read(LimitInputStream.java:79)
	at jsync.protocol.ChangeInputStream.read(ChangeInputStream.java:69)
	at com.cloudbees.jenkins.plugins.jsync.archiver.MD5DigestingInputStream.read(MD5DigestingInputStream.java:39)
	at com.google.common.io.LimitInputStream.read(LimitInputStream.java:79)
	at java.io.FilterInputStream.read(FilterInputStream.java:107)
	at com.google.common.io.ByteStreams.copy(ByteStreams.java:193)
	at jsync.protocol.FileSequenceReader.read(FileSequenceReader.java:35)
	at com.cloudbees.jenkins.plugins.jsync.archiver.JSyncArtifactManager.remoteSync(JSyncArtifactManager.java:158)
	at com.cloudbees.jenkins.plugins.jsync.archiver.JSyncArtifactManager.archive(JSyncArtifactManager.java:76)
	at hudson.maven.MavenBuild$ProxyImpl.performArchiving(MavenBuild.java:512)
	at hudson.maven.MavenModuleSetBuild$MavenModuleSetBuildExecution.doRun(MavenModuleSetBuild.java:881)
	at hudson.model.AbstractBuild$AbstractBuildExecution.run(AbstractBuild.java:496)
	at hudson.model.Run.execute(Run.java:1737)
	at hudson.maven.MavenModuleSetBuild.run(MavenModuleSetBuild.java:543)
	at hudson.model.ResourceController.execute(ResourceController.java:97)
	at hudson.model.Executor.run(Executor.java:419)
Caused by: java.lang.InterruptedException
	at java.lang.Object.wait(Native Method)
	at hudson.remoting.FastPipedInputStream.read(FastPipedInputStream.java:175)
	... 20 more
channel stopped

Mime
View raw message