karaf-commits mailing list archives

Site index · List index
Message view « Date » · « Thread »
Top « Date » · « Thread »
From Apache Jenkins Server <jenk...@builds.apache.org>
Subject Build failed in Jenkins: karaf-master #4739
Date Fri, 27 Oct 2017 04:50:06 GMT
See <https://builds.apache.org/job/karaf-master/4739/display/redirect?page=changes>

Changes:

[jbonofre] [maven-release-plugin] prepare release karaf-4.2.0.M1

------------------------------------------
[...truncated 17.21 KB...]
[INFO] Apache Karaf :: Diagnostic ......................... SKIPPED
[INFO] Apache Karaf :: Diagnostic :: Boot ................. SKIPPED
[INFO] Apache Karaf :: Diagnostic :: Core ................. SKIPPED
[INFO] Apache Karaf :: OBR :: Core ........................ SKIPPED
[INFO] Apache Karaf :: JNDI :: Core ....................... SKIPPED
[INFO] Apache Karaf :: JDBC :: Core ....................... SKIPPED
[INFO] Apache Karaf :: JMS :: Core ........................ SKIPPED
[INFO] Apache Karaf :: JPA :: Parent ...................... SKIPPED
[INFO] Apache Karaf :: JPA :: Hibernate ................... SKIPPED
[INFO] Apache Karaf :: Maven :: Core ...................... SKIPPED
[INFO] Apache Karaf :: Maven .............................. SKIPPED
[INFO] Apache Karaf :: OSGi Services :: Coordinator ....... SKIPPED
[INFO] Apache Karaf :: OSGi Services :: EventAdmin ........ SKIPPED
[INFO] Apache Karaf :: OSGi Services :: Static ConfigAdmin  SKIPPED
[INFO] Apache Karaf :: OSGi Services ...................... SKIPPED
[INFO] Apache Karaf :: Subsystem :: Core .................. SKIPPED
[INFO] Apache Karaf :: OSGi Services :: Event ............. SKIPPED
[INFO] Apache Karaf :: Tooling :: Maven Karaf Plugin ...... SKIPPED
[INFO] Apache Karaf :: Assemblies ......................... SKIPPED
[INFO] Apache Karaf :: Assemblies :: Features ............. SKIPPED
[INFO] Apache Karaf :: Assemblies :: Features :: Base ..... SKIPPED
[INFO] Apache Karaf :: Assemblies :: Features :: Framework  SKIPPED
[INFO] Apache Karaf :: Assemblies :: Features :: Static ... SKIPPED
[INFO] Apache Karaf :: Assemblies :: Features :: Standard . SKIPPED
[INFO] Apache Karaf :: Assemblies :: Features :: Spring ... SKIPPED
[INFO] Apache Karaf :: Assemblies :: Features :: Spring Legacy SKIPPED
[INFO] Apache Karaf :: Assemblies :: Features :: Enterprise SKIPPED
[INFO] Apache Karaf :: Assemblies :: Features :: Enterprise Legacy SKIPPED
[INFO] Apache Karaf :: Assemblies :: Demos ................ SKIPPED
[INFO] Apache Karaf :: Assemblies :: Minimal Distribution . SKIPPED
[INFO] Apache Karaf :: Assemblies :: Default Distribution . SKIPPED
[INFO] Apache Karaf :: Demos .............................. SKIPPED
[INFO] Apache Karaf :: Demos :: Web ....................... SKIPPED
[INFO] Apache Karaf :: Demos :: Branding :: Shell ......... SKIPPED
[INFO] Apache Karaf :: Demos :: Command :: Extend Console . SKIPPED
[INFO] Apache Karaf :: Demos :: Demo Dump provider ........ SKIPPED
[INFO] Apache Karaf :: Demos :: Deployer .................. SKIPPED
[INFO] Apache Karaf :: Demos :: Deployer :: Kar ........... SKIPPED
[INFO] Apache Karaf :: Demos :: Deployer :: Bundle ........ SKIPPED
[INFO] Apache Karaf :: Demos :: Profiles :: Dynamic Assembly SKIPPED
[INFO] Apache Karaf :: Demos :: Profiles :: Static Assembly SKIPPED
[INFO] Apache Karaf :: Demos :: Profiles .................. SKIPPED
[INFO] Apache Karaf :: Archetypes ......................... SKIPPED
[INFO] Apache Karaf :: Archetypes :: Assembly Archetype ... SKIPPED
[INFO] Apache Karaf :: Archetypes :: Command Archetype .... SKIPPED
[INFO] Apache Karaf :: Archetypes :: Feature Archetype .... SKIPPED
[INFO] Apache Karaf :: Archetypes :: Kar Archetype ........ SKIPPED
[INFO] Apache Karaf :: Archetypes :: Bundle Archetype ..... SKIPPED
[INFO] Apache Karaf :: Archetypes :: Blueprint Archetype .. SKIPPED
[INFO] Apache Karaf :: Integration Tests .................. SKIPPED
[INFO] ------------------------------------------------------------------------
[INFO] BUILD FAILURE
[INFO] ------------------------------------------------------------------------
[INFO] Total time: 01:31 min
[INFO] Finished at: 2017-10-27T04:48:23+00:00
[INFO] Final Memory: 109M/1317M
[INFO] ------------------------------------------------------------------------
[ERROR] Failed to execute goal org.apache.maven.plugins:maven-deploy-plugin:2.8.2:deploy (default-deploy)
on project karaf: Failed to deploy artifacts: Could not transfer artifact org.apache.karaf:karaf:pom:4.2.0.M1
from/to apache.releases.https (https://repository.apache.org/service/local/staging/deploy/maven2):
Failed to transfer file: https://repository.apache.org/service/local/staging/deploy/maven2/org/apache/karaf/karaf/4.2.0.M1/karaf-4.2.0.M1.pom.
Return code is: 401, ReasonPhrase: Unauthorized. -> [Help 1]
org.apache.maven.lifecycle.LifecycleExecutionException: Failed to execute goal org.apache.maven.plugins:maven-deploy-plugin:2.8.2:deploy
(default-deploy) on project karaf: Failed to deploy artifacts: Could not transfer artifact
org.apache.karaf:karaf:pom:4.2.0.M1 from/to apache.releases.https (https://repository.apache.org/service/local/staging/deploy/maven2):
Failed to transfer file: https://repository.apache.org/service/local/staging/deploy/maven2/org/apache/karaf/karaf/4.2.0.M1/karaf-4.2.0.M1.pom.
Return code is: 401, ReasonPhrase: Unauthorized.
	at org.apache.maven.lifecycle.internal.MojoExecutor.execute(MojoExecutor.java:212)
	at org.apache.maven.lifecycle.internal.MojoExecutor.execute(MojoExecutor.java:153)
	at org.apache.maven.lifecycle.internal.MojoExecutor.execute(MojoExecutor.java:145)
	at org.apache.maven.lifecycle.internal.LifecycleModuleBuilder.buildProject(LifecycleModuleBuilder.java:116)
	at org.apache.maven.lifecycle.internal.LifecycleModuleBuilder.buildProject(LifecycleModuleBuilder.java:80)
	at org.apache.maven.lifecycle.internal.builder.singlethreaded.SingleThreadedBuilder.build(SingleThreadedBuilder.java:51)
	at org.apache.maven.lifecycle.internal.LifecycleStarter.execute(LifecycleStarter.java:128)
	at org.apache.maven.DefaultMaven.doExecute(DefaultMaven.java:307)
	at org.apache.maven.DefaultMaven.doExecute(DefaultMaven.java:193)
	at org.apache.maven.DefaultMaven.execute(DefaultMaven.java:106)
	at org.jvnet.hudson.maven3.launcher.Maven33Launcher.main(Maven33Launcher.java:129)
	at sun.reflect.NativeMethodAccessorImpl.invoke0(Native Method)
	at sun.reflect.NativeMethodAccessorImpl.invoke(NativeMethodAccessorImpl.java:62)
	at sun.reflect.DelegatingMethodAccessorImpl.invoke(DelegatingMethodAccessorImpl.java:43)
	at java.lang.reflect.Method.invoke(Method.java:498)
	at org.codehaus.plexus.classworlds.launcher.Launcher.launchStandard(Launcher.java:330)
	at org.codehaus.plexus.classworlds.launcher.Launcher.launch(Launcher.java:238)
	at jenkins.maven3.agent.Maven33Main.launch(Maven33Main.java:176)
	at sun.reflect.NativeMethodAccessorImpl.invoke0(Native Method)
	at sun.reflect.NativeMethodAccessorImpl.invoke(NativeMethodAccessorImpl.java:62)
	at sun.reflect.DelegatingMethodAccessorImpl.invoke(DelegatingMethodAccessorImpl.java:43)
	at java.lang.reflect.Method.invoke(Method.java:498)
	at hudson.maven.Maven3Builder.call(Maven3Builder.java:139)
	at hudson.maven.Maven3Builder.call(Maven3Builder.java:70)
	at hudson.remoting.UserRequest.perform(UserRequest.java:181)
	at hudson.remoting.UserRequest.perform(UserRequest.java:52)
	at hudson.remoting.Request$2.run(Request.java:336)
	at hudson.remoting.InterceptingExecutorService$1.call(InterceptingExecutorService.java:68)
	at java.util.concurrent.FutureTask.run(FutureTask.java:266)
	at java.util.concurrent.ThreadPoolExecutor.runWorker(ThreadPoolExecutor.java:1149)
	at java.util.concurrent.ThreadPoolExecutor$Worker.run(ThreadPoolExecutor.java:624)
	at java.lang.Thread.run(Thread.java:748)
Caused by: org.apache.maven.plugin.MojoExecutionException: Failed to deploy artifacts: Could
not transfer artifact org.apache.karaf:karaf:pom:4.2.0.M1 from/to apache.releases.https (https://repository.apache.org/service/local/staging/deploy/maven2):
Failed to transfer file: https://repository.apache.org/service/local/staging/deploy/maven2/org/apache/karaf/karaf/4.2.0.M1/karaf-4.2.0.M1.pom.
Return code is: 401, ReasonPhrase: Unauthorized.
	at org.apache.maven.plugin.deploy.DeployMojo.deployProject(DeployMojo.java:284)
	at org.apache.maven.plugin.deploy.DeployMojo.execute(DeployMojo.java:169)
	at org.apache.maven.plugin.DefaultBuildPluginManager.executeMojo(DefaultBuildPluginManager.java:134)
	at org.apache.maven.lifecycle.internal.MojoExecutor.execute(MojoExecutor.java:207)
	... 31 more
Caused by: org.apache.maven.artifact.deployer.ArtifactDeploymentException: Failed to deploy
artifacts: Could not transfer artifact org.apache.karaf:karaf:pom:4.2.0.M1 from/to apache.releases.https
(https://repository.apache.org/service/local/staging/deploy/maven2): Failed to transfer file:
https://repository.apache.org/service/local/staging/deploy/maven2/org/apache/karaf/karaf/4.2.0.M1/karaf-4.2.0.M1.pom.
Return code is: 401, ReasonPhrase: Unauthorized.
	at org.apache.maven.artifact.deployer.DefaultArtifactDeployer.deploy(DefaultArtifactDeployer.java:143)
	at org.apache.maven.plugin.deploy.AbstractDeployMojo.deploy(AbstractDeployMojo.java:171)
	at org.apache.maven.plugin.deploy.DeployMojo.deployProject(DeployMojo.java:242)
	... 34 more
Caused by: org.eclipse.aether.deployment.DeploymentException: Failed to deploy artifacts:
Could not transfer artifact org.apache.karaf:karaf:pom:4.2.0.M1 from/to apache.releases.https
(https://repository.apache.org/service/local/staging/deploy/maven2): Failed to transfer file:
https://repository.apache.org/service/local/staging/deploy/maven2/org/apache/karaf/karaf/4.2.0.M1/karaf-4.2.0.M1.pom.
Return code is: 401, ReasonPhrase: Unauthorized.
	at org.eclipse.aether.internal.impl.DefaultDeployer.deploy(DefaultDeployer.java:317)
	at org.eclipse.aether.internal.impl.DefaultDeployer.deploy(DefaultDeployer.java:245)
	at org.eclipse.aether.internal.impl.DefaultRepositorySystem.deploy(DefaultRepositorySystem.java:413)
	at org.apache.maven.artifact.deployer.DefaultArtifactDeployer.deploy(DefaultArtifactDeployer.java:139)
	... 36 more
Caused by: org.eclipse.aether.transfer.ArtifactTransferException: Could not transfer artifact
org.apache.karaf:karaf:pom:4.2.0.M1 from/to apache.releases.https (https://repository.apache.org/service/local/staging/deploy/maven2):
Failed to transfer file: https://repository.apache.org/service/local/staging/deploy/maven2/org/apache/karaf/karaf/4.2.0.M1/karaf-4.2.0.M1.pom.
Return code is: 401, ReasonPhrase: Unauthorized.
	at org.eclipse.aether.connector.basic.ArtifactTransportListener.transferFailed(ArtifactTransportListener.java:43)
	at org.eclipse.aether.connector.basic.BasicRepositoryConnector$TaskRunner.run(BasicRepositoryConnector.java:355)
	at org.eclipse.aether.connector.basic.BasicRepositoryConnector.put(BasicRepositoryConnector.java:274)
	at org.eclipse.aether.internal.impl.DefaultDeployer.deploy(DefaultDeployer.java:311)
	... 39 more
Caused by: org.apache.maven.wagon.TransferFailedException: Failed to transfer file: https://repository.apache.org/service/local/staging/deploy/maven2/org/apache/karaf/karaf/4.2.0.M1/karaf-4.2.0.M1.pom.
Return code is: 401, ReasonPhrase: Unauthorized.
	at org.apache.maven.wagon.providers.http.AbstractHttpClientWagon.put(AbstractHttpClientWagon.java:627)
	at org.apache.maven.wagon.providers.http.AbstractHttpClientWagon.put(AbstractHttpClientWagon.java:541)
	at org.apache.maven.wagon.providers.http.AbstractHttpClientWagon.put(AbstractHttpClientWagon.java:523)
	at org.apache.maven.wagon.providers.http.AbstractHttpClientWagon.put(AbstractHttpClientWagon.java:517)
	at org.apache.maven.wagon.providers.http.AbstractHttpClientWagon.put(AbstractHttpClientWagon.java:497)
	at org.eclipse.aether.transport.wagon.WagonTransporter$PutTaskRunner.run(WagonTransporter.java:644)
	at org.eclipse.aether.transport.wagon.WagonTransporter.execute(WagonTransporter.java:427)
	at org.eclipse.aether.transport.wagon.WagonTransporter.put(WagonTransporter.java:410)
	at org.eclipse.aether.connector.basic.BasicRepositoryConnector$PutTaskRunner.runTask(BasicRepositoryConnector.java:510)
	at org.eclipse.aether.connector.basic.BasicRepositoryConnector$TaskRunner.run(BasicRepositoryConnector.java:350)
	... 41 more
[ERROR] 
[ERROR] Re-run Maven using the -X switch to enable full debug logging.
[ERROR] 
[ERROR] For more information about the errors and possible solutions, please read the following
articles:
[ERROR] [Help 1] http://cwiki.apache.org/confluence/display/MAVEN/MojoExecutionException
[JENKINS] Archiving <https://builds.apache.org/job/karaf-master/ws/archetypes/blueprint/pom.xml>
to org.apache.karaf.archetypes/karaf-blueprint-archetype/4.2.0.M1/karaf-blueprint-archetype-4.2.0.M1.pom
[JENKINS] Archiving <https://builds.apache.org/job/karaf-master/ws/webconsole/gogo/pom.xml>
to org.apache.karaf.webconsole/org.apache.karaf.webconsole.gogo/4.2.0.M1/org.apache.karaf.webconsole.gogo-4.2.0.M1.pom
[JENKINS] Archiving <https://builds.apache.org/job/karaf-master/ws/management/pom.xml>
to org.apache.karaf.management/management/4.2.0.M1/management-4.2.0.M1.pom
[JENKINS] Archiving <https://builds.apache.org/job/karaf-master/ws/jpa/hibernate/pom.xml>
to org.apache.karaf.jpa/hibernate/4.2.0.M1/hibernate-4.2.0.M1.pom
[JENKINS] Archiving <https://builds.apache.org/job/karaf-master/ws/archetypes/pom.xml>
to org.apache.karaf/archetypes/4.2.0.M1/archetypes-4.2.0.M1.pom
[JENKINS] Archiving <https://builds.apache.org/job/karaf-master/ws/demos/profiles/pom.xml>
to org.apache.karaf.demos.profiles/profiles/4.2.0.M1/profiles-4.2.0.M1.pom
[JENKINS] Archiving <https://builds.apache.org/job/karaf-master/ws/maven/pom.xml> to
org.apache.karaf.maven/maven-parent/4.2.0.M1/maven-parent-4.2.0.M1.pom
[JENKINS] Archiving <https://builds.apache.org/job/karaf-master/ws/assemblies/features/pom.xml>
to org.apache.karaf.assemblies.features/features/4.2.0.M1/features-4.2.0.M1.pom
[JENKINS] Archiving <https://builds.apache.org/job/karaf-master/ws/features/core/pom.xml>
to org.apache.karaf.features/org.apache.karaf.features.core/4.2.0.M1/org.apache.karaf.features.core-4.2.0.M1.pom
[JENKINS] Archiving <https://builds.apache.org/job/karaf-master/ws/demos/profiles/dynamic/pom.xml>
to org.apache.karaf.demos.profiles/dynamic/4.2.0.M1/dynamic-4.2.0.M1.pom
[JENKINS] Archiving <https://builds.apache.org/job/karaf-master/ws/demos/dump/pom.xml>
to org.apache.karaf.demos/dump/4.2.0.M1/dump-4.2.0.M1.pom
[JENKINS] Archiving <https://builds.apache.org/job/karaf-master/ws/services/coordinator/pom.xml>
to org.apache.karaf.services/org.apache.karaf.services.coordinator/4.2.0.M1/org.apache.karaf.services.coordinator-4.2.0.M1.pom
[JENKINS] Archiving <https://builds.apache.org/job/karaf-master/ws/system/pom.xml> to
org.apache.karaf.system/org.apache.karaf.system.core/4.2.0.M1/org.apache.karaf.system.core-4.2.0.M1.pom
[JENKINS] Archiving <https://builds.apache.org/job/karaf-master/ws/maven/core/pom.xml>
to org.apache.karaf.maven/org.apache.karaf.maven.core/4.2.0.M1/org.apache.karaf.maven.core-4.2.0.M1.pom
[JENKINS] Archiving <https://builds.apache.org/job/karaf-master/ws/client/pom.xml> to
org.apache.karaf/org.apache.karaf.client/4.2.0.M1/org.apache.karaf.client-4.2.0.M1.pom
[JENKINS] Archiving <https://builds.apache.org/job/karaf-master/ws/jpa/pom.xml> to org.apache.karaf.jpa/jpa-parent/4.2.0.M1/jpa-parent-4.2.0.M1.pom
[JENKINS] Archiving <https://builds.apache.org/job/karaf-master/ws/assemblies/demos/pom.xml>
to org.apache.karaf/demos/4.2.0.M1/demos-4.2.0.M1.pom
[JENKINS] Archiving <https://builds.apache.org/job/karaf-master/ws/bundle/blueprintstate/pom.xml>
to org.apache.karaf.bundle/org.apache.karaf.bundle.blueprintstate/4.2.0.M1/org.apache.karaf.bundle.blueprintstate-4.2.0.M1.pom
[JENKINS] Archiving <https://builds.apache.org/job/karaf-master/ws/main/pom.xml> to
org.apache.karaf/org.apache.karaf.main/4.2.0.M1/org.apache.karaf.main-4.2.0.M1.pom
[JENKINS] Archiving <https://builds.apache.org/job/karaf-master/ws/scr/management/pom.xml>
to org.apache.karaf.scr/org.apache.karaf.scr.management/4.2.0.M1/org.apache.karaf.scr.management-4.2.0.M1.pom
[JENKINS] Archiving <https://builds.apache.org/job/karaf-master/ws/assemblies/pom.xml>
to org.apache.karaf.assemblies/assemblies/4.2.0.M1/assemblies-4.2.0.M1.pom
[JENKINS] Archiving <https://builds.apache.org/job/karaf-master/ws/assemblies/apache-karaf-minimal/pom.xml>
to org.apache.karaf/apache-karaf-minimal/4.2.0.M1/apache-karaf-minimal-4.2.0.M1.pom
[JENKINS] Archiving <https://builds.apache.org/job/karaf-master/ws/bundle/springstate/pom.xml>
to org.apache.karaf.bundle/org.apache.karaf.bundle.springstate/4.2.0.M1/org.apache.karaf.bundle.springstate-4.2.0.M1.pom
[JENKINS] Archiving <https://builds.apache.org/job/karaf-master/ws/diagnostic/core/pom.xml>
to org.apache.karaf.diagnostic/org.apache.karaf.diagnostic.core/4.2.0.M1/org.apache.karaf.diagnostic.core-4.2.0.M1.pom
[JENKINS] Archiving <https://builds.apache.org/job/karaf-master/ws/deployer/spring/pom.xml>
to org.apache.karaf.deployer/org.apache.karaf.deployer.spring/4.2.0.M1/org.apache.karaf.deployer.spring-4.2.0.M1.pom
[JENKINS] Archiving <https://builds.apache.org/job/karaf-master/ws/deployer/pom.xml>
to org.apache.karaf.deployer/deployer/4.2.0.M1/deployer-4.2.0.M1.pom
[JENKINS] Archiving <https://builds.apache.org/job/karaf-master/ws/jms/pom.xml> to org.apache.karaf.jms/org.apache.karaf.jms.core/4.2.0.M1/org.apache.karaf.jms.core-4.2.0.M1.pom
[JENKINS] Archiving <https://builds.apache.org/job/karaf-master/ws/bundle/core/pom.xml>
to org.apache.karaf.bundle/org.apache.karaf.bundle.core/4.2.0.M1/org.apache.karaf.bundle.core-4.2.0.M1.pom
[JENKINS] Archiving <https://builds.apache.org/job/karaf-master/ws/shell/ssh/pom.xml>
to org.apache.karaf.shell/org.apache.karaf.shell.ssh/4.2.0.M1/org.apache.karaf.shell.ssh-4.2.0.M1.pom
[JENKINS] Archiving <https://builds.apache.org/job/karaf-master/ws/webconsole/instance/pom.xml>
to org.apache.karaf.webconsole/org.apache.karaf.webconsole.instance/4.2.0.M1/org.apache.karaf.webconsole.instance-4.2.0.M1.pom
[JENKINS] Archiving <https://builds.apache.org/job/karaf-master/ws/demos/deployer/bundle/pom.xml>
to org.apache.karaf.demos.deployer.bundle/my-bundle/4.2.0.M1/my-bundle-4.2.0.M1.pom
[JENKINS] Archiving <https://builds.apache.org/job/karaf-master/ws/deployer/features/pom.xml>
to org.apache.karaf.deployer/org.apache.karaf.deployer.features/4.2.0.M1/org.apache.karaf.deployer.features-4.2.0.M1.pom
[JENKINS] Archiving <https://builds.apache.org/job/karaf-master/ws/jaas/jasypt/pom.xml>
to org.apache.karaf.jaas/org.apache.karaf.jaas.jasypt/4.2.0.M1/org.apache.karaf.jaas.jasypt-4.2.0.M1.pom
[JENKINS] Archiving <https://builds.apache.org/job/karaf-master/ws/services/pom.xml>
to org.apache.karaf.services/services/4.2.0.M1/services-4.2.0.M1.pom
[JENKINS] Archiving <https://builds.apache.org/job/karaf-master/ws/jaas/blueprint/config/pom.xml>
to org.apache.karaf.jaas.blueprint/org.apache.karaf.jaas.blueprint.config/4.2.0.M1/org.apache.karaf.jaas.blueprint.config-4.2.0.M1.pom
[JENKINS] Archiving <https://builds.apache.org/job/karaf-master/ws/demos/deployer/pom.xml>
to org.apache.karaf.demos/org.apache.karaf.demos.deployer/4.2.0.M1/org.apache.karaf.demos.deployer-4.2.0.M1.pom
[JENKINS] Archiving <https://builds.apache.org/job/karaf-master/ws/pom.xml> to org.apache.karaf/karaf/4.2.0.M1/karaf-4.2.0.M1.pom
[Fast Archiver] Compressed 101.59 KB of artifacts by 63.0% relative to #4738
[JENKINS] Archiving <https://builds.apache.org/job/karaf-master/ws/assemblies/features/base/pom.xml>
to org.apache.karaf.features/base/4.2.0.M1/base-4.2.0.M1.pom
[JENKINS] Archiving <https://builds.apache.org/job/karaf-master/ws/scr/examples/pom.xml>
to org.apache.karaf.scr/org.apache.karaf.scr.examples/4.2.0.M1/org.apache.karaf.scr.examples-4.2.0.M1.pom
[JENKINS] Archiving <https://builds.apache.org/job/karaf-master/ws/assemblies/features/standard/pom.xml>
to org.apache.karaf.features/standard/4.2.0.M1/standard-4.2.0.M1.pom
[JENKINS] Archiving <https://builds.apache.org/job/karaf-master/ws/web/pom.xml> to org.apache.karaf.web/org.apache.karaf.web.core/4.2.0.M1/org.apache.karaf.web.core-4.2.0.M1.pom
[JENKINS] Archiving <https://builds.apache.org/job/karaf-master/ws/log/pom.xml> to org.apache.karaf.log/org.apache.karaf.log.core/4.2.0.M1/org.apache.karaf.log.core-4.2.0.M1.pom
[JENKINS] Archiving <https://builds.apache.org/job/karaf-master/ws/instance/pom.xml>
to org.apache.karaf.instance/org.apache.karaf.instance.core/4.2.0.M1/org.apache.karaf.instance.core-4.2.0.M1.pom
[JENKINS] Archiving <https://builds.apache.org/job/karaf-master/ws/shell/pom.xml> to
org.apache.karaf.shell/shell/4.2.0.M1/shell-4.2.0.M1.pom
[JENKINS] Archiving <https://builds.apache.org/job/karaf-master/ws/features/pom.xml>
to org.apache.karaf.features/features/4.2.0.M1/features-4.2.0.M1.pom
[JENKINS] Archiving <https://builds.apache.org/job/karaf-master/ws/kar/pom.xml> to org.apache.karaf.kar/org.apache.karaf.kar.core/4.2.0.M1/org.apache.karaf.kar.core-4.2.0.M1.pom
[JENKINS] Archiving <https://builds.apache.org/job/karaf-master/ws/service/pom.xml>
to org.apache.karaf.service/service/4.2.0.M1/service-4.2.0.M1.pom
[JENKINS] Archiving <https://builds.apache.org/job/karaf-master/ws/diagnostic/pom.xml>
to org.apache.karaf.diagnostic/diagnostic/4.2.0.M1/diagnostic-4.2.0.M1.pom
[JENKINS] Archiving <https://builds.apache.org/job/karaf-master/ws/jaas/pom.xml> to
org.apache.karaf.jaas/jaas/4.2.0.M1/jaas-4.2.0.M1.pom
[JENKINS] Archiving <https://builds.apache.org/job/karaf-master/ws/diagnostic/boot/pom.xml>
to org.apache.karaf.diagnostic/org.apache.karaf.diagnostic.boot/4.2.0.M1/org.apache.karaf.diagnostic.boot-4.2.0.M1.pom
[JENKINS] Archiving <https://builds.apache.org/job/karaf-master/ws/jndi/pom.xml> to
org.apache.karaf.jndi/org.apache.karaf.jndi.core/4.2.0.M1/org.apache.karaf.jndi.core-4.2.0.M1.pom
[JENKINS] Archiving <https://builds.apache.org/job/karaf-master/ws/event/pom.xml> to
org.apache.karaf/org.apache.karaf.event/4.2.0.M1/org.apache.karaf.event-4.2.0.M1.pom
[JENKINS] Archiving <https://builds.apache.org/job/karaf-master/ws/jaas/blueprint/pom.xml>
to org.apache.karaf.jaas.blueprint/blueprint/4.2.0.M1/blueprint-4.2.0.M1.pom
[JENKINS] Archiving <https://builds.apache.org/job/karaf-master/ws/scr/state/pom.xml>
to org.apache.karaf.scr/org.apache.karaf.scr.state/4.2.0.M1/org.apache.karaf.scr.state-4.2.0.M1.pom
[JENKINS] Archiving <https://builds.apache.org/job/karaf-master/ws/jdbc/pom.xml> to
org.apache.karaf.jdbc/org.apache.karaf.jdbc.core/4.2.0.M1/org.apache.karaf.jdbc.core-4.2.0.M1.pom
[JENKINS] Archiving <https://builds.apache.org/job/karaf-master/ws/demos/web/pom.xml>
to org.apache.karaf.demos/web/4.2.0.M1/web-4.2.0.M1.pom
[JENKINS] Archiving <https://builds.apache.org/job/karaf-master/ws/archetypes/feature/pom.xml>
to org.apache.karaf.archetypes/karaf-feature-archetype/4.2.0.M1/karaf-feature-archetype-4.2.0.M1.pom
[JENKINS] Archiving <https://builds.apache.org/job/karaf-master/ws/shell/core/pom.xml>
to org.apache.karaf.shell/org.apache.karaf.shell.core/4.2.0.M1/org.apache.karaf.shell.core-4.2.0.M1.pom
[JENKINS] Archiving <https://builds.apache.org/job/karaf-master/ws/config/pom.xml> to
org.apache.karaf.config/org.apache.karaf.config.core/4.2.0.M1/org.apache.karaf.config.core-4.2.0.M1.pom
[JENKINS] Archiving <https://builds.apache.org/job/karaf-master/ws/bundle/pom.xml> to
org.apache.karaf.bundle/bundle/4.2.0.M1/bundle-4.2.0.M1.pom
[JENKINS] Archiving <https://builds.apache.org/job/karaf-master/ws/deployer/blueprint/pom.xml>
to org.apache.karaf.deployer/org.apache.karaf.deployer.blueprint/4.2.0.M1/org.apache.karaf.deployer.blueprint-4.2.0.M1.pom
[JENKINS] Archiving <https://builds.apache.org/job/karaf-master/ws/shell/table/pom.xml>
to org.apache.karaf.shell/org.apache.karaf.shell.table/4.2.0.M1/org.apache.karaf.shell.table-4.2.0.M1.pom
[JENKINS] Archiving <https://builds.apache.org/job/karaf-master/ws/assemblies/features/framework/pom.xml>
to org.apache.karaf.features/framework/4.2.0.M1/framework-4.2.0.M1.pom
[JENKINS] Archiving <https://builds.apache.org/job/karaf-master/ws/deployer/kar/pom.xml>
to org.apache.karaf.deployer/org.apache.karaf.deployer.kar/4.2.0.M1/org.apache.karaf.deployer.kar-4.2.0.M1.pom
[JENKINS] Archiving <https://builds.apache.org/job/karaf-master/ws/wrapper/pom.xml>
to org.apache.karaf.wrapper/org.apache.karaf.wrapper.core/4.2.0.M1/org.apache.karaf.wrapper.core-4.2.0.M1.pom
[JENKINS] Archiving <https://builds.apache.org/job/karaf-master/ws/services/eventadmin/pom.xml>
to org.apache.karaf.services/org.apache.karaf.services.eventadmin/4.2.0.M1/org.apache.karaf.services.eventadmin-4.2.0.M1.pom
[JENKINS] Archiving <https://builds.apache.org/job/karaf-master/ws/demos/pom.xml> to
org.apache.karaf.demos/demos/4.2.0.M1/demos-4.2.0.M1.pom
[JENKINS] Archiving <https://builds.apache.org/job/karaf-master/ws/tooling/utils/pom.xml>
to org.apache.karaf.tooling/org.apache.karaf.tools.utils/4.2.0.M1/org.apache.karaf.tools.utils-4.2.0.M1.pom
[JENKINS] Archiving <https://builds.apache.org/job/karaf-master/ws/scr/examples/component-factory/pom.xml>
to org.apache.karaf.scr.examples/org.apache.karaf.scr.examples.component.factories/4.2.0.M1/org.apache.karaf.scr.examples.component.factories-4.2.0.M1.pom
[JENKINS] Archiving <https://builds.apache.org/job/karaf-master/ws/service/core/pom.xml>
to org.apache.karaf.service/org.apache.karaf.service.core/4.2.0.M1/org.apache.karaf.service.core-4.2.0.M1.pom
[JENKINS] Archiving <https://builds.apache.org/job/karaf-master/ws/assemblies/features/spring-legacy/pom.xml>
to org.apache.karaf.features/spring-legacy/4.2.0.M1/spring-legacy-4.2.0.M1.pom
[JENKINS] Archiving <https://builds.apache.org/job/karaf-master/ws/assemblies/features/enterprise/pom.xml>
to org.apache.karaf.features/enterprise/4.2.0.M1/enterprise-4.2.0.M1.pom
[JENKINS] Archiving <https://builds.apache.org/job/karaf-master/ws/demos/deployer/kar/pom.xml>
to org.apache.karaf.demos/my-kar/4.2.0.M1/my-kar-4.2.0.M1.pom
[JENKINS] Archiving <https://builds.apache.org/job/karaf-master/ws/archetypes/kar/pom.xml>
to org.apache.karaf.archetypes/karaf-kar-archetype/4.2.0.M1/karaf-kar-archetype-4.2.0.M1.pom
[JENKINS] Archiving <https://builds.apache.org/job/karaf-master/ws/jaas/command/pom.xml>
to org.apache.karaf.jaas/org.apache.karaf.jaas.command/4.2.0.M1/org.apache.karaf.jaas.command-4.2.0.M1.pom
[JENKINS] Archiving <https://builds.apache.org/job/karaf-master/ws/assemblies/features/spring/pom.xml>
to org.apache.karaf.features/spring/4.2.0.M1/spring-4.2.0.M1.pom
[JENKINS] Archiving <https://builds.apache.org/job/karaf-master/ws/archetypes/command/pom.xml>
to org.apache.karaf.archetypes/karaf-command-archetype/4.2.0.M1/karaf-command-archetype-4.2.0.M1.pom
[JENKINS] Archiving <https://builds.apache.org/job/karaf-master/ws/scr/pom.xml> to org.apache.karaf.scr/scr/4.2.0.M1/scr-4.2.0.M1.pom
[JENKINS] Archiving <https://builds.apache.org/job/karaf-master/ws/tooling/karaf-maven-plugin/pom.xml>
to org.apache.karaf.tooling/karaf-maven-plugin/4.2.0.M1/karaf-maven-plugin-4.2.0.M1.pom
[JENKINS] Archiving <https://builds.apache.org/job/karaf-master/ws/deployer/wrap/pom.xml>
to org.apache.karaf.deployer/org.apache.karaf.deployer.wrap/4.2.0.M1/org.apache.karaf.deployer.wrap-4.2.0.M1.pom
[JENKINS] Archiving <https://builds.apache.org/job/karaf-master/ws/assemblies/features/static/pom.xml>
to org.apache.karaf.features/static/4.2.0.M1/static-4.2.0.M1.pom
[JENKINS] Archiving <https://builds.apache.org/job/karaf-master/ws/webconsole/console/pom.xml>
to org.apache.karaf.webconsole/org.apache.karaf.webconsole.console/4.2.0.M1/org.apache.karaf.webconsole.console-4.2.0.M1.pom
[JENKINS] Archiving <https://builds.apache.org/job/karaf-master/ws/scr/examples/service/pom.xml>
to org.apache.karaf.scr.examples/org.apache.karaf.scr.examples.service/4.2.0.M1/org.apache.karaf.scr.examples.service-4.2.0.M1.pom
[JENKINS] Archiving <https://builds.apache.org/job/karaf-master/ws/scr/examples/managed-service/pom.xml>
to org.apache.karaf.scr.examples/org.apache.karaf.scr.examples.managed.service/4.2.0.M1/org.apache.karaf.scr.examples.managed.service-4.2.0.M1.pom
[JENKINS] Archiving <https://builds.apache.org/job/karaf-master/ws/obr/pom.xml> to org.apache.karaf.obr/org.apache.karaf.obr.core/4.2.0.M1/org.apache.karaf.obr.core-4.2.0.M1.pom
[JENKINS] Archiving <https://builds.apache.org/job/karaf-master/ws/itests/pom.xml> to
org.apache.karaf.itests/itests/4.2.0.M1/itests-4.2.0.M1.pom
[JENKINS] Archiving <https://builds.apache.org/job/karaf-master/ws/jaas/boot/pom.xml>
to org.apache.karaf.jaas/org.apache.karaf.jaas.boot/4.2.0.M1/org.apache.karaf.jaas.boot-4.2.0.M1.pom
[JENKINS] Archiving <https://builds.apache.org/job/karaf-master/ws/profile/pom.xml>
to org.apache.karaf.profile/org.apache.karaf.profile.core/4.2.0.M1/org.apache.karaf.profile.core-4.2.0.M1.pom
[JENKINS] Archiving <https://builds.apache.org/job/karaf-master/ws/demos/command/pom.xml>
to org.apache.karaf.demos/org.apache.karaf.demos.command/4.2.0.M1/org.apache.karaf.demos.command-4.2.0.M1.pom
[JENKINS] Archiving <https://builds.apache.org/job/karaf-master/ws/webconsole/features/pom.xml>
to org.apache.karaf.webconsole/org.apache.karaf.webconsole.features/4.2.0.M1/org.apache.karaf.webconsole.features-4.2.0.M1.pom
[JENKINS] Archiving <https://builds.apache.org/job/karaf-master/ws/tooling/pom.xml>
to org.apache.karaf.tooling/tooling/4.2.0.M1/tooling-4.2.0.M1.pom
[JENKINS] Archiving <https://builds.apache.org/job/karaf-master/ws/assemblies/apache-karaf/pom.xml>
to org.apache.karaf/apache-karaf/4.2.0.M1/apache-karaf-4.2.0.M1.pom
[JENKINS] Archiving <https://builds.apache.org/job/karaf-master/ws/shell/commands/pom.xml>
to org.apache.karaf.shell/org.apache.karaf.shell.commands/4.2.0.M1/org.apache.karaf.shell.commands-4.2.0.M1.pom
[JENKINS] Archiving <https://builds.apache.org/job/karaf-master/ws/demos/profiles/registry/pom.xml>
to org.apache.karaf.demos.profiles/registry/4.2.0.M1/registry-4.2.0.M1.pom
[JENKINS] Archiving <https://builds.apache.org/job/karaf-master/ws/http/pom.xml> to
org.apache.karaf.http/org.apache.karaf.http.core/4.2.0.M1/org.apache.karaf.http.core-4.2.0.M1.pom
[JENKINS] Archiving <https://builds.apache.org/job/karaf-master/ws/webconsole/http/pom.xml>
to org.apache.karaf.webconsole/org.apache.karaf.webconsole.http/4.2.0.M1/org.apache.karaf.webconsole.http-4.2.0.M1.pom
[JENKINS] Archiving <https://builds.apache.org/job/karaf-master/ws/jaas/config/pom.xml>
to org.apache.karaf.jaas/org.apache.karaf.jaas.config/4.2.0.M1/org.apache.karaf.jaas.config-4.2.0.M1.pom
[JENKINS] Archiving <https://builds.apache.org/job/karaf-master/ws/services/staticcm/pom.xml>
to org.apache.karaf.services/org.apache.karaf.services.staticcm/4.2.0.M1/org.apache.karaf.services.staticcm-4.2.0.M1.pom
[JENKINS] Archiving <https://builds.apache.org/job/karaf-master/ws/jaas/blueprint/jasypt/pom.xml>
to org.apache.karaf.jaas.blueprint/org.apache.karaf.jaas.blueprint.jasypt/4.2.0.M1/org.apache.karaf.jaas.blueprint.jasypt-4.2.0.M1.pom
[JENKINS] Archiving <https://builds.apache.org/job/karaf-master/ws/archetypes/bundle/pom.xml>
to org.apache.karaf.archetypes/karaf-bundle-archetype/4.2.0.M1/karaf-bundle-archetype-4.2.0.M1.pom
[JENKINS] Archiving <https://builds.apache.org/job/karaf-master/ws/subsystem/pom.xml>
to org.apache.karaf.subsystem/org.apache.karaf.subsystem.core/4.2.0.M1/org.apache.karaf.subsystem.core-4.2.0.M1.pom
[JENKINS] Archiving <https://builds.apache.org/job/karaf-master/ws/shell/console/pom.xml>
to org.apache.karaf.shell/org.apache.karaf.shell.console/4.2.0.M1/org.apache.karaf.shell.console-4.2.0.M1.pom
[JENKINS] Archiving <https://builds.apache.org/job/karaf-master/ws/webconsole/pom.xml>
to org.apache.karaf.webconsole/webconsole/4.2.0.M1/webconsole-4.2.0.M1.pom
[JENKINS] Archiving <https://builds.apache.org/job/karaf-master/ws/jaas/modules/pom.xml>
to org.apache.karaf.jaas/org.apache.karaf.jaas.modules/4.2.0.M1/org.apache.karaf.jaas.modules-4.2.0.M1.pom
[JENKINS] Archiving <https://builds.apache.org/job/karaf-master/ws/demos/branding/pom.xml>
to org.apache.karaf.demos/org.apache.karaf.demos.branding.shell/4.2.0.M1/org.apache.karaf.demos.branding.shell-4.2.0.M1.pom
[JENKINS] Archiving <https://builds.apache.org/job/karaf-master/ws/assemblies/features/enterprise-legacy/pom.xml>
to org.apache.karaf.features/enterprise-legacy/4.2.0.M1/enterprise-legacy-4.2.0.M1.pom
[JENKINS] Archiving <https://builds.apache.org/job/karaf-master/ws/archetypes/assembly/pom.xml>
to org.apache.karaf.archetypes/karaf-assembly-archetype/4.2.0.M1/karaf-assembly-archetype-4.2.0.M1.pom
[JENKINS] Archiving <https://builds.apache.org/job/karaf-master/ws/features/extension/pom.xml>
to org.apache.karaf.features/org.apache.karaf.features.extension/4.2.0.M1/org.apache.karaf.features.extension-4.2.0.M1.pom
[JENKINS] Archiving <https://builds.apache.org/job/karaf-master/ws/management/server/pom.xml>
to org.apache.karaf.management/org.apache.karaf.management.server/4.2.0.M1/org.apache.karaf.management.server-4.2.0.M1.pom
[JENKINS] Archiving <https://builds.apache.org/job/karaf-master/ws/service/guard/pom.xml>
to org.apache.karaf.service/org.apache.karaf.service.guard/4.2.0.M1/org.apache.karaf.service.guard-4.2.0.M1.pom
[JENKINS] Archiving <https://builds.apache.org/job/karaf-master/ws/demos/profiles/static/pom.xml>
to org.apache.karaf.demos.profiles/static/4.2.0.M1/static-4.2.0.M1.pom
[JENKINS] Archiving <https://builds.apache.org/job/karaf-master/ws/tooling/karaf-services-maven-plugin/pom.xml>
to org.apache.karaf.tooling/karaf-services-maven-plugin/4.2.0.M1/karaf-services-maven-plugin-4.2.0.M1.pom
[JENKINS] Archiving <https://builds.apache.org/job/karaf-master/ws/package/pom.xml>
to org.apache.karaf.package/org.apache.karaf.package.core/4.2.0.M1/org.apache.karaf.package.core-4.2.0.M1.pom
[JENKINS] Archiving <https://builds.apache.org/job/karaf-master/ws/features/command/pom.xml>
to org.apache.karaf.features/org.apache.karaf.features.command/4.2.0.M1/org.apache.karaf.features.command-4.2.0.M1.pom
[JENKINS] Archiving <https://builds.apache.org/job/karaf-master/ws/scheduler/pom.xml>
to org.apache.karaf.scheduler/org.apache.karaf.scheduler.core/4.2.0.M1/org.apache.karaf.scheduler.core-4.2.0.M1.pom
[JENKINS] Archiving <https://builds.apache.org/job/karaf-master/ws/util/pom.xml> to
org.apache.karaf/org.apache.karaf.util/4.2.0.M1/org.apache.karaf.util-4.2.0.M1.pom
channel stopped

Mime
View raw message