karaf-commits mailing list archives

Site index · List index
Message view « Date » · « Thread »
Top « Date » · « Thread »
From Apache Jenkins Server <jenk...@builds.apache.org>
Subject Build failed in Jenkins: karaf-master #4440
Date Thu, 13 Jul 2017 13:28:12 GMT
See <https://builds.apache.org/job/karaf-master/4440/display/redirect?page=changes>

Changes:

[gr.grzybek] [KARAF-5164] Use Maven reactor to resolve artifacts needed by VerifyMojo

------------------------------------------
[...truncated 851.98 KB...]
[INFO] Apache Karaf :: Assemblies ......................... SKIPPED
[INFO] Apache Karaf :: Assemblies :: Features ............. SKIPPED
[INFO] Apache Karaf :: Assemblies :: Features :: Base ..... SKIPPED
[INFO] Apache Karaf :: Assemblies :: Features :: Framework  SKIPPED
[INFO] Apache Karaf :: Assemblies :: Features :: Static ... SKIPPED
[INFO] Apache Karaf :: Assemblies :: Features :: Standard . SKIPPED
[INFO] Apache Karaf :: Assemblies :: Features :: Spring ... SKIPPED
[INFO] Apache Karaf :: Assemblies :: Features :: Spring Legacy SKIPPED
[INFO] Apache Karaf :: Assemblies :: Features :: Enterprise SKIPPED
[INFO] Apache Karaf :: Assemblies :: Features :: Enterprise Legacy SKIPPED
[INFO] Apache Karaf :: Assemblies :: Demos ................ SKIPPED
[INFO] Apache Karaf :: Assemblies :: Minimal Distribution . SKIPPED
[INFO] Apache Karaf :: Assemblies :: Default Distribution . SKIPPED
[INFO] Apache Karaf :: Demos .............................. SKIPPED
[INFO] Apache Karaf :: Demos :: Web ....................... SKIPPED
[INFO] Apache Karaf :: Demos :: Branding :: Shell ......... SKIPPED
[INFO] Apache Karaf :: Demos :: Command :: Extend Console . SKIPPED
[INFO] Apache Karaf :: Demos :: Demo Dump provider ........ SKIPPED
[INFO] Apache Karaf :: Demos :: Deployer .................. SKIPPED
[INFO] Apache Karaf :: Demos :: Deployer :: Kar ........... SKIPPED
[INFO] Apache Karaf :: Demos :: Deployer :: Bundle ........ SKIPPED
[INFO] Apache Karaf :: Demos :: Profiles :: Dynamic Assembly SKIPPED
[INFO] Apache Karaf :: Demos :: Profiles :: Static Assembly SKIPPED
[INFO] Apache Karaf :: Demos :: Profiles .................. SKIPPED
[INFO] Apache Karaf :: Archetypes ......................... SKIPPED
[INFO] Apache Karaf :: Archetypes :: Assembly Archetype ... SKIPPED
[INFO] Apache Karaf :: Archetypes :: Command Archetype .... SKIPPED
[INFO] Apache Karaf :: Archetypes :: Feature Archetype .... SKIPPED
[INFO] Apache Karaf :: Archetypes :: Kar Archetype ........ SKIPPED
[INFO] Apache Karaf :: Archetypes :: Bundle Archetype ..... SKIPPED
[INFO] Apache Karaf :: Archetypes :: Blueprint Archetype .. SKIPPED
[INFO] Apache Karaf :: Integration Tests .................. SKIPPED
[INFO] ------------------------------------------------------------------------
[INFO] BUILD FAILURE
[INFO] ------------------------------------------------------------------------
[INFO] Total time: 31:28 min
[INFO] Finished at: 2017-07-13T12:54:17+00:00
[INFO] Final Memory: 183M/1497M
[INFO] ------------------------------------------------------------------------
Waiting for Jenkins to finish collecting data
[ERROR] Failed to execute goal org.apache.maven.plugins:maven-surefire-plugin:2.18.1:test
(default-test) on project org.apache.karaf.log.core: Execution default-test of goal org.apache.maven.plugins:maven-surefire-plugin:2.18.1:test
failed: The forked VM terminated without properly saying goodbye. VM crash or System.exit
called?
[ERROR] Command was /bin/sh -c cd <https://builds.apache.org/job/karaf-master/ws/log>
&& /usr/local/asfpackages/java/jdk1.8.0_131/jre/bin/java -jar <https://builds.apache.org/job/karaf-master/ws/log/target/surefire/surefirebooter6345717420204726961.jar>
<https://builds.apache.org/job/karaf-master/ws/log/target/surefire/surefire7327079914031262337tmp>
<https://builds.apache.org/job/karaf-master/ws/log/target/surefire/surefire_183815204295232542293tmp>
[ERROR] -> [Help 1]
org.apache.maven.lifecycle.LifecycleExecutionException: Failed to execute goal org.apache.maven.plugins:maven-surefire-plugin:2.18.1:test
(default-test) on project org.apache.karaf.log.core: Execution default-test of goal org.apache.maven.plugins:maven-surefire-plugin:2.18.1:test
failed: The forked VM terminated without properly saying goodbye. VM crash or System.exit
called?
Command was /bin/sh -c cd <https://builds.apache.org/job/karaf-master/ws/log> &&
/usr/local/asfpackages/java/jdk1.8.0_131/jre/bin/java -jar <https://builds.apache.org/job/karaf-master/ws/log/target/surefire/surefirebooter6345717420204726961.jar>
<https://builds.apache.org/job/karaf-master/ws/log/target/surefire/surefire7327079914031262337tmp>
<https://builds.apache.org/job/karaf-master/ws/log/target/surefire/surefire_183815204295232542293tmp>
	at org.apache.maven.lifecycle.internal.MojoExecutor.execute(MojoExecutor.java:212)
	at org.apache.maven.lifecycle.internal.MojoExecutor.execute(MojoExecutor.java:153)
	at org.apache.maven.lifecycle.internal.MojoExecutor.execute(MojoExecutor.java:145)
	at org.apache.maven.lifecycle.internal.LifecycleModuleBuilder.buildProject(LifecycleModuleBuilder.java:116)
	at org.apache.maven.lifecycle.internal.LifecycleModuleBuilder.buildProject(LifecycleModuleBuilder.java:80)
	at org.apache.maven.lifecycle.internal.builder.singlethreaded.SingleThreadedBuilder.build(SingleThreadedBuilder.java:51)
	at org.apache.maven.lifecycle.internal.LifecycleStarter.execute(LifecycleStarter.java:128)
	at org.apache.maven.DefaultMaven.doExecute(DefaultMaven.java:307)
	at org.apache.maven.DefaultMaven.doExecute(DefaultMaven.java:193)
	at org.apache.maven.DefaultMaven.execute(DefaultMaven.java:106)
	at org.jvnet.hudson.maven3.launcher.Maven33Launcher.main(Maven33Launcher.java:129)
	at sun.reflect.NativeMethodAccessorImpl.invoke0(Native Method)
	at sun.reflect.NativeMethodAccessorImpl.invoke(NativeMethodAccessorImpl.java:62)
	at sun.reflect.DelegatingMethodAccessorImpl.invoke(DelegatingMethodAccessorImpl.java:43)
	at java.lang.reflect.Method.invoke(Method.java:498)
	at org.codehaus.plexus.classworlds.launcher.Launcher.launchStandard(Launcher.java:330)
	at org.codehaus.plexus.classworlds.launcher.Launcher.launch(Launcher.java:238)
	at jenkins.maven3.agent.Maven33Main.launch(Maven33Main.java:176)
	at sun.reflect.NativeMethodAccessorImpl.invoke0(Native Method)
	at sun.reflect.NativeMethodAccessorImpl.invoke(NativeMethodAccessorImpl.java:62)
	at sun.reflect.DelegatingMethodAccessorImpl.invoke(DelegatingMethodAccessorImpl.java:43)
	at java.lang.reflect.Method.invoke(Method.java:498)
	at hudson.maven.Maven3Builder.call(Maven3Builder.java:139)
	at hudson.maven.Maven3Builder.call(Maven3Builder.java:70)
	at hudson.remoting.UserRequest.perform(UserRequest.java:153)
	at hudson.remoting.UserRequest.perform(UserRequest.java:50)
	at hudson.remoting.Request$2.run(Request.java:336)
	at hudson.remoting.InterceptingExecutorService$1.call(InterceptingExecutorService.java:68)
	at java.util.concurrent.FutureTask.run(FutureTask.java:266)
	at java.util.concurrent.ThreadPoolExecutor.runWorker(ThreadPoolExecutor.java:1142)
	at java.util.concurrent.ThreadPoolExecutor$Worker.run(ThreadPoolExecutor.java:617)
	at java.lang.Thread.run(Thread.java:748)
Caused by: org.apache.maven.plugin.PluginExecutionException: Execution default-test of goal
org.apache.maven.plugins:maven-surefire-plugin:2.18.1:test failed: The forked VM terminated
without properly saying goodbye. VM crash or System.exit called?
Command was /bin/sh -c cd <https://builds.apache.org/job/karaf-master/ws/log> &&
/usr/local/asfpackages/java/jdk1.8.0_131/jre/bin/java -jar <https://builds.apache.org/job/karaf-master/ws/log/target/surefire/surefirebooter6345717420204726961.jar>
<https://builds.apache.org/job/karaf-master/ws/log/target/surefire/surefire7327079914031262337tmp>
<https://builds.apache.org/job/karaf-master/ws/log/target/surefire/surefire_183815204295232542293tmp>
	at org.apache.maven.plugin.DefaultBuildPluginManager.executeMojo(DefaultBuildPluginManager.java:145)
	at org.apache.maven.lifecycle.internal.MojoExecutor.execute(MojoExecutor.java:207)
	... 31 more
Caused by: java.lang.RuntimeException: The forked VM terminated without properly saying goodbye.
VM crash or System.exit called?
Command was /bin/sh -c cd <https://builds.apache.org/job/karaf-master/ws/log> &&
/usr/local/asfpackages/java/jdk1.8.0_131/jre/bin/java -jar <https://builds.apache.org/job/karaf-master/ws/log/target/surefire/surefirebooter6345717420204726961.jar>
<https://builds.apache.org/job/karaf-master/ws/log/target/surefire/surefire7327079914031262337tmp>
<https://builds.apache.org/job/karaf-master/ws/log/target/surefire/surefire_183815204295232542293tmp>
	at org.apache.maven.plugin.surefire.booterclient.ForkStarter.fork(ForkStarter.java:515)
	at org.apache.maven.plugin.surefire.booterclient.ForkStarter.fork(ForkStarter.java:380)
	at org.apache.maven.plugin.surefire.booterclient.ForkStarter.run(ForkStarter.java:167)
	at org.apache.maven.plugin.surefire.AbstractSurefireMojo.executeProvider(AbstractSurefireMojo.java:990)
	at org.apache.maven.plugin.surefire.AbstractSurefireMojo.executeAfterPreconditionsChecked(AbstractSurefireMojo.java:824)
	at org.apache.maven.plugin.surefire.AbstractSurefireMojo.execute(AbstractSurefireMojo.java:722)
	at org.apache.maven.plugin.DefaultBuildPluginManager.executeMojo(DefaultBuildPluginManager.java:134)
	... 32 more
[ERROR] 
[ERROR] Re-run Maven using the -X switch to enable full debug logging.
[ERROR] 
[ERROR] For more information about the errors and possible solutions, please read the following
articles:
[ERROR] [Help 1] http://cwiki.apache.org/confluence/display/MAVEN/PluginExecutionException
[ERROR] 
[ERROR] After correcting the problems, you can resume the build with the command
[ERROR]   mvn <goals> -rf :org.apache.karaf.log.core
[JENKINS] Archiving <https://builds.apache.org/job/karaf-master/ws/archetypes/blueprint/pom.xml>
to org.apache.karaf.archetypes/karaf-blueprint-archetype/4.2.0-SNAPSHOT/karaf-blueprint-archetype-4.2.0-SNAPSHOT.pom
[JENKINS] Archiving <https://builds.apache.org/job/karaf-master/ws/webconsole/gogo/pom.xml>
to org.apache.karaf.webconsole/org.apache.karaf.webconsole.gogo/4.2.0-SNAPSHOT/org.apache.karaf.webconsole.gogo-4.2.0-SNAPSHOT.pom
[JENKINS] Archiving <https://builds.apache.org/job/karaf-master/ws/management/pom.xml>
to org.apache.karaf.management/management/4.2.0-SNAPSHOT/management-4.2.0-SNAPSHOT.pom
[JENKINS] Archiving <https://builds.apache.org/job/karaf-master/ws/jpa/hibernate/pom.xml>
to org.apache.karaf.jpa/hibernate/4.2.0-SNAPSHOT/hibernate-4.2.0-SNAPSHOT.pom
[JENKINS] Archiving <https://builds.apache.org/job/karaf-master/ws/archetypes/pom.xml>
to org.apache.karaf/archetypes/4.2.0-SNAPSHOT/archetypes-4.2.0-SNAPSHOT.pom
[JENKINS] Archiving <https://builds.apache.org/job/karaf-master/ws/demos/profiles/pom.xml>
to org.apache.karaf.demos.profiles/profiles/4.2.0-SNAPSHOT/profiles-4.2.0-SNAPSHOT.pom
[JENKINS] Archiving <https://builds.apache.org/job/karaf-master/ws/maven/pom.xml> to
org.apache.karaf.maven/maven-parent/4.2.0-SNAPSHOT/maven-parent-4.2.0-SNAPSHOT.pom
[JENKINS] Archiving <https://builds.apache.org/job/karaf-master/ws/assemblies/features/pom.xml>
to org.apache.karaf.assemblies.features/features/4.2.0-SNAPSHOT/features-4.2.0-SNAPSHOT.pom
[JENKINS] Archiving <https://builds.apache.org/job/karaf-master/ws/features/core/pom.xml>
to org.apache.karaf.features/org.apache.karaf.features.core/4.2.0-SNAPSHOT/org.apache.karaf.features.core-4.2.0-SNAPSHOT.pom
[JENKINS] Archiving <https://builds.apache.org/job/karaf-master/ws/features/core/target/org.apache.karaf.features.core-4.2.0-SNAPSHOT.jar>
to org.apache.karaf.features/org.apache.karaf.features.core/4.2.0-20170713.123542-168/org.apache.karaf.features.core-4.2.0-20170713.123542-168.jar
[JENKINS] Archiving <https://builds.apache.org/job/karaf-master/ws/demos/profiles/dynamic/pom.xml>
to org.apache.karaf.demos.profiles/dynamic/4.2.0-SNAPSHOT/dynamic-4.2.0-SNAPSHOT.pom
[JENKINS] Archiving <https://builds.apache.org/job/karaf-master/ws/demos/dump/pom.xml>
to org.apache.karaf.demos/dump/4.2.0-SNAPSHOT/dump-4.2.0-SNAPSHOT.pom
[JENKINS] Archiving <https://builds.apache.org/job/karaf-master/ws/services/coordinator/pom.xml>
to org.apache.karaf.services/org.apache.karaf.services.coordinator/4.2.0-SNAPSHOT/org.apache.karaf.services.coordinator-4.2.0-SNAPSHOT.pom
[JENKINS] Archiving <https://builds.apache.org/job/karaf-master/ws/system/pom.xml> to
org.apache.karaf.system/org.apache.karaf.system.core/4.2.0-SNAPSHOT/org.apache.karaf.system.core-4.2.0-SNAPSHOT.pom
[JENKINS] Archiving <https://builds.apache.org/job/karaf-master/ws/maven/core/pom.xml>
to org.apache.karaf.maven/org.apache.karaf.maven.core/4.2.0-SNAPSHOT/org.apache.karaf.maven.core-4.2.0-SNAPSHOT.pom
[JENKINS] Archiving <https://builds.apache.org/job/karaf-master/ws/client/pom.xml> to
org.apache.karaf/org.apache.karaf.client/4.2.0-SNAPSHOT/org.apache.karaf.client-4.2.0-SNAPSHOT.pom
[JENKINS] Archiving <https://builds.apache.org/job/karaf-master/ws/jpa/pom.xml> to org.apache.karaf.jpa/jpa-parent/4.2.0-SNAPSHOT/jpa-parent-4.2.0-SNAPSHOT.pom
[JENKINS] Archiving <https://builds.apache.org/job/karaf-master/ws/assemblies/demos/pom.xml>
to org.apache.karaf/demos/4.2.0-SNAPSHOT/demos-4.2.0-SNAPSHOT.pom
[JENKINS] Archiving <https://builds.apache.org/job/karaf-master/ws/bundle/blueprintstate/pom.xml>
to org.apache.karaf.bundle/org.apache.karaf.bundle.blueprintstate/4.2.0-SNAPSHOT/org.apache.karaf.bundle.blueprintstate-4.2.0-SNAPSHOT.pom
[JENKINS] Archiving <https://builds.apache.org/job/karaf-master/ws/bundle/blueprintstate/target/org.apache.karaf.bundle.blueprintstate-4.2.0-SNAPSHOT.jar>
to org.apache.karaf.bundle/org.apache.karaf.bundle.blueprintstate/4.2.0-20170713.124253-164/org.apache.karaf.bundle.blueprintstate-4.2.0-20170713.124253-164.jar
[JENKINS] Archiving <https://builds.apache.org/job/karaf-master/ws/main/pom.xml> to
org.apache.karaf/org.apache.karaf.main/4.2.0-SNAPSHOT/org.apache.karaf.main-4.2.0-SNAPSHOT.pom
[JENKINS] Archiving <https://builds.apache.org/job/karaf-master/ws/main/target/org.apache.karaf.main-4.2.0-SNAPSHOT.jar>
to org.apache.karaf/org.apache.karaf.main/4.2.0-20170713.122715-170/org.apache.karaf.main-4.2.0-20170713.122715-170.jar
[JENKINS] Archiving <https://builds.apache.org/job/karaf-master/ws/scr/management/pom.xml>
to org.apache.karaf.scr/org.apache.karaf.scr.management/4.2.0-SNAPSHOT/org.apache.karaf.scr.management-4.2.0-SNAPSHOT.pom
[JENKINS] Archiving <https://builds.apache.org/job/karaf-master/ws/assemblies/pom.xml>
to org.apache.karaf.assemblies/assemblies/4.2.0-SNAPSHOT/assemblies-4.2.0-SNAPSHOT.pom
[JENKINS] Archiving <https://builds.apache.org/job/karaf-master/ws/assemblies/apache-karaf-minimal/pom.xml>
to org.apache.karaf/apache-karaf-minimal/4.2.0-SNAPSHOT/apache-karaf-minimal-4.2.0-SNAPSHOT.pom
[JENKINS] Archiving <https://builds.apache.org/job/karaf-master/ws/bundle/springstate/pom.xml>
to org.apache.karaf.bundle/org.apache.karaf.bundle.springstate/4.2.0-SNAPSHOT/org.apache.karaf.bundle.springstate-4.2.0-SNAPSHOT.pom
[JENKINS] Archiving <https://builds.apache.org/job/karaf-master/ws/bundle/springstate/target/org.apache.karaf.bundle.springstate-4.2.0-SNAPSHOT.jar>
to org.apache.karaf.bundle/org.apache.karaf.bundle.springstate/4.2.0-20170713.124348-164/org.apache.karaf.bundle.springstate-4.2.0-20170713.124348-164.jar
[JENKINS] Archiving <https://builds.apache.org/job/karaf-master/ws/diagnostic/core/pom.xml>
to org.apache.karaf.diagnostic/org.apache.karaf.diagnostic.core/4.2.0-SNAPSHOT/org.apache.karaf.diagnostic.core-4.2.0-SNAPSHOT.pom
[JENKINS] Archiving <https://builds.apache.org/job/karaf-master/ws/deployer/spring/pom.xml>
to org.apache.karaf.deployer/org.apache.karaf.deployer.spring/4.2.0-SNAPSHOT/org.apache.karaf.deployer.spring-4.2.0-SNAPSHOT.pom
[JENKINS] Archiving <https://builds.apache.org/job/karaf-master/ws/deployer/spring/target/org.apache.karaf.deployer.spring-4.2.0-SNAPSHOT.jar>
to org.apache.karaf.deployer/org.apache.karaf.deployer.spring/4.2.0-20170713.124650-164/org.apache.karaf.deployer.spring-4.2.0-20170713.124650-164.jar
[JENKINS] Archiving <https://builds.apache.org/job/karaf-master/ws/deployer/pom.xml>
to org.apache.karaf.deployer/deployer/4.2.0-SNAPSHOT/deployer-4.2.0-SNAPSHOT.pom
[JENKINS] Archiving <https://builds.apache.org/job/karaf-master/ws/jms/core/pom.xml>
to org.apache.karaf.jms/org.apache.karaf.jms.core/4.2.0-SNAPSHOT/org.apache.karaf.jms.core-4.2.0-SNAPSHOT.pom
[JENKINS] Archiving <https://builds.apache.org/job/karaf-master/ws/bundle/core/pom.xml>
to org.apache.karaf.bundle/org.apache.karaf.bundle.core/4.2.0-SNAPSHOT/org.apache.karaf.bundle.core-4.2.0-SNAPSHOT.pom
[JENKINS] Archiving <https://builds.apache.org/job/karaf-master/ws/bundle/core/target/org.apache.karaf.bundle.core-4.2.0-SNAPSHOT.jar>
to org.apache.karaf.bundle/org.apache.karaf.bundle.core/4.2.0-20170713.124211-164/org.apache.karaf.bundle.core-4.2.0-20170713.124211-164.jar
[JENKINS] Archiving <https://builds.apache.org/job/karaf-master/ws/shell/ssh/pom.xml>
to org.apache.karaf.shell/org.apache.karaf.shell.ssh/4.2.0-SNAPSHOT/org.apache.karaf.shell.ssh-4.2.0-SNAPSHOT.pom
[JENKINS] Archiving <https://builds.apache.org/job/karaf-master/ws/webconsole/instance/pom.xml>
to org.apache.karaf.webconsole/org.apache.karaf.webconsole.instance/4.2.0-SNAPSHOT/org.apache.karaf.webconsole.instance-4.2.0-SNAPSHOT.pom
[JENKINS] Archiving <https://builds.apache.org/job/karaf-master/ws/demos/deployer/bundle/pom.xml>
to org.apache.karaf.demos.deployer.bundle/my-bundle/4.2.0-SNAPSHOT/my-bundle-4.2.0-SNAPSHOT.pom
[JENKINS] Archiving <https://builds.apache.org/job/karaf-master/ws/deployer/features/pom.xml>
to org.apache.karaf.deployer/org.apache.karaf.deployer.features/4.2.0-SNAPSHOT/org.apache.karaf.deployer.features-4.2.0-SNAPSHOT.pom
[JENKINS] Archiving <https://builds.apache.org/job/karaf-master/ws/jaas/jasypt/pom.xml>
to org.apache.karaf.jaas/org.apache.karaf.jaas.jasypt/4.2.0-SNAPSHOT/org.apache.karaf.jaas.jasypt-4.2.0-SNAPSHOT.pom
[JENKINS] Archiving <https://builds.apache.org/job/karaf-master/ws/services/pom.xml>
to org.apache.karaf.services/services/4.2.0-SNAPSHOT/services-4.2.0-SNAPSHOT.pom
[JENKINS] Archiving <https://builds.apache.org/job/karaf-master/ws/jaas/blueprint/config/pom.xml>
to org.apache.karaf.jaas.blueprint/org.apache.karaf.jaas.blueprint.config/4.2.0-SNAPSHOT/org.apache.karaf.jaas.blueprint.config-4.2.0-SNAPSHOT.pom
[JENKINS] Archiving <https://builds.apache.org/job/karaf-master/ws/demos/deployer/pom.xml>
to org.apache.karaf.demos/org.apache.karaf.demos.deployer/4.2.0-SNAPSHOT/org.apache.karaf.demos.deployer-4.2.0-SNAPSHOT.pom
[JENKINS] Archiving <https://builds.apache.org/job/karaf-master/ws/pom.xml> to org.apache.karaf/karaf/4.2.0-SNAPSHOT/karaf-4.2.0-SNAPSHOT.pom
Compressed 103.56 KB of artifacts by 92.7% relative to #4439
[JENKINS] Archiving <https://builds.apache.org/job/karaf-master/ws/assemblies/features/base/pom.xml>
to org.apache.karaf.features/base/4.2.0-SNAPSHOT/base-4.2.0-SNAPSHOT.pom
[JENKINS] Archiving <https://builds.apache.org/job/karaf-master/ws/scr/examples/pom.xml>
to org.apache.karaf.scr/org.apache.karaf.scr.examples/4.2.0-SNAPSHOT/org.apache.karaf.scr.examples-4.2.0-SNAPSHOT.pom
[JENKINS] Archiving <https://builds.apache.org/job/karaf-master/ws/assemblies/features/standard/pom.xml>
to org.apache.karaf.features/standard/4.2.0-SNAPSHOT/standard-4.2.0-SNAPSHOT.pom
[JENKINS] Archiving <https://builds.apache.org/job/karaf-master/ws/web/pom.xml> to org.apache.karaf.web/org.apache.karaf.web.core/4.2.0-SNAPSHOT/org.apache.karaf.web.core-4.2.0-SNAPSHOT.pom
[JENKINS] Archiving <https://builds.apache.org/job/karaf-master/ws/log/pom.xml> to org.apache.karaf.log/org.apache.karaf.log.core/4.2.0-SNAPSHOT/org.apache.karaf.log.core-4.2.0-SNAPSHOT.pom
[JENKINS] Archiving <https://builds.apache.org/job/karaf-master/ws/exception/pom.xml>
to org.apache.karaf/org.apache.karaf.exception/4.2.0-SNAPSHOT/org.apache.karaf.exception-4.2.0-SNAPSHOT.pom
[JENKINS] Archiving <https://builds.apache.org/job/karaf-master/ws/instance/pom.xml>
to org.apache.karaf.instance/org.apache.karaf.instance.core/4.2.0-SNAPSHOT/org.apache.karaf.instance.core-4.2.0-SNAPSHOT.pom
[JENKINS] Archiving <https://builds.apache.org/job/karaf-master/ws/instance/target/org.apache.karaf.instance.core-4.2.0-SNAPSHOT.jar>
to org.apache.karaf.instance/org.apache.karaf.instance.core/4.2.0-20170713.124846-164/org.apache.karaf.instance.core-4.2.0-20170713.124846-164.jar
[JENKINS] Archiving <https://builds.apache.org/job/karaf-master/ws/shell/pom.xml> to
org.apache.karaf.shell/shell/4.2.0-SNAPSHOT/shell-4.2.0-SNAPSHOT.pom
[JENKINS] Archiving <https://builds.apache.org/job/karaf-master/ws/features/pom.xml>
to org.apache.karaf.features/features/4.2.0-SNAPSHOT/features-4.2.0-SNAPSHOT.pom
[JENKINS] Archiving <https://builds.apache.org/job/karaf-master/ws/kar/pom.xml> to org.apache.karaf.kar/org.apache.karaf.kar.core/4.2.0-SNAPSHOT/org.apache.karaf.kar.core-4.2.0-SNAPSHOT.pom
[JENKINS] Archiving <https://builds.apache.org/job/karaf-master/ws/kar/target/org.apache.karaf.kar.core-4.2.0-SNAPSHOT.jar>
to org.apache.karaf.kar/org.apache.karaf.kar.core/4.2.0-20170713.123759-168/org.apache.karaf.kar.core-4.2.0-20170713.123759-168.jar
[JENKINS] Archiving <https://builds.apache.org/job/karaf-master/ws/service/pom.xml>
to org.apache.karaf.service/service/4.2.0-SNAPSHOT/service-4.2.0-SNAPSHOT.pom
[JENKINS] Archiving <https://builds.apache.org/job/karaf-master/ws/diagnostic/pom.xml>
to org.apache.karaf.diagnostic/diagnostic/4.2.0-SNAPSHOT/diagnostic-4.2.0-SNAPSHOT.pom
[JENKINS] Archiving <https://builds.apache.org/job/karaf-master/ws/jaas/pom.xml> to
org.apache.karaf.jaas/jaas/4.2.0-SNAPSHOT/jaas-4.2.0-SNAPSHOT.pom
[JENKINS] Archiving <https://builds.apache.org/job/karaf-master/ws/diagnostic/boot/pom.xml>
to org.apache.karaf.diagnostic/org.apache.karaf.diagnostic.boot/4.2.0-SNAPSHOT/org.apache.karaf.diagnostic.boot-4.2.0-SNAPSHOT.pom
[JENKINS] Archiving <https://builds.apache.org/job/karaf-master/ws/jndi/pom.xml> to
org.apache.karaf.jndi/org.apache.karaf.jndi.core/4.2.0-SNAPSHOT/org.apache.karaf.jndi.core-4.2.0-SNAPSHOT.pom
[JENKINS] Archiving <https://builds.apache.org/job/karaf-master/ws/event/pom.xml> to
org.apache.karaf/org.apache.karaf.event/4.2.0-SNAPSHOT/org.apache.karaf.event-4.2.0-SNAPSHOT.pom
[JENKINS] Archiving <https://builds.apache.org/job/karaf-master/ws/jaas/blueprint/pom.xml>
to org.apache.karaf.jaas.blueprint/blueprint/4.2.0-SNAPSHOT/blueprint-4.2.0-SNAPSHOT.pom
[JENKINS] Archiving <https://builds.apache.org/job/karaf-master/ws/scr/state/pom.xml>
to org.apache.karaf.scr/org.apache.karaf.scr.state/4.2.0-SNAPSHOT/org.apache.karaf.scr.state-4.2.0-SNAPSHOT.pom
[JENKINS] Archiving <https://builds.apache.org/job/karaf-master/ws/jdbc/pom.xml> to
org.apache.karaf.jdbc/org.apache.karaf.jdbc.core/4.2.0-SNAPSHOT/org.apache.karaf.jdbc.core-4.2.0-SNAPSHOT.pom
[JENKINS] Archiving <https://builds.apache.org/job/karaf-master/ws/demos/web/pom.xml>
to org.apache.karaf.demos/web/4.2.0-SNAPSHOT/web-4.2.0-SNAPSHOT.pom
[JENKINS] Archiving <https://builds.apache.org/job/karaf-master/ws/archetypes/feature/pom.xml>
to org.apache.karaf.archetypes/karaf-feature-archetype/4.2.0-SNAPSHOT/karaf-feature-archetype-4.2.0-SNAPSHOT.pom
[JENKINS] Archiving <https://builds.apache.org/job/karaf-master/ws/shell/core/pom.xml>
to org.apache.karaf.shell/org.apache.karaf.shell.core/4.2.0-SNAPSHOT/org.apache.karaf.shell.core-4.2.0-SNAPSHOT.pom
[JENKINS] Archiving <https://builds.apache.org/job/karaf-master/ws/shell/core/target/org.apache.karaf.shell.core-4.2.0-SNAPSHOT.jar>
to org.apache.karaf.shell/org.apache.karaf.shell.core/4.2.0-20170713.123214-168/org.apache.karaf.shell.core-4.2.0-20170713.123214-168.jar
Compressed 624.68 KB of artifacts by 35.9% relative to #4439
[JENKINS] Archiving <https://builds.apache.org/job/karaf-master/ws/config/pom.xml> to
org.apache.karaf.config/org.apache.karaf.config.core/4.2.0-SNAPSHOT/org.apache.karaf.config.core-4.2.0-SNAPSHOT.pom
[JENKINS] Archiving <https://builds.apache.org/job/karaf-master/ws/config/target/org.apache.karaf.config.core-4.2.0-SNAPSHOT.jar>
to org.apache.karaf.config/org.apache.karaf.config.core/4.2.0-20170713.124415-164/org.apache.karaf.config.core-4.2.0-20170713.124415-164.jar
[JENKINS] Archiving <https://builds.apache.org/job/karaf-master/ws/bundle/pom.xml> to
org.apache.karaf.bundle/bundle/4.2.0-SNAPSHOT/bundle-4.2.0-SNAPSHOT.pom
[JENKINS] Archiving <https://builds.apache.org/job/karaf-master/ws/deployer/blueprint/pom.xml>
to org.apache.karaf.deployer/org.apache.karaf.deployer.blueprint/4.2.0-SNAPSHOT/org.apache.karaf.deployer.blueprint-4.2.0-SNAPSHOT.pom
[JENKINS] Archiving <https://builds.apache.org/job/karaf-master/ws/deployer/blueprint/target/org.apache.karaf.deployer.blueprint-4.2.0-SNAPSHOT.jar>
to org.apache.karaf.deployer/org.apache.karaf.deployer.blueprint/4.2.0-20170713.124600-164/org.apache.karaf.deployer.blueprint-4.2.0-20170713.124600-164.jar
[JENKINS] Archiving <https://builds.apache.org/job/karaf-master/ws/shell/table/pom.xml>
to org.apache.karaf.shell/org.apache.karaf.shell.table/4.2.0-SNAPSHOT/org.apache.karaf.shell.table-4.2.0-SNAPSHOT.pom
[JENKINS] Archiving <https://builds.apache.org/job/karaf-master/ws/assemblies/features/framework/pom.xml>
to org.apache.karaf.features/framework/4.2.0-SNAPSHOT/framework-4.2.0-SNAPSHOT.pom
[JENKINS] Archiving <https://builds.apache.org/job/karaf-master/ws/deployer/kar/pom.xml>
to org.apache.karaf.deployer/org.apache.karaf.deployer.kar/4.2.0-SNAPSHOT/org.apache.karaf.deployer.kar-4.2.0-SNAPSHOT.pom
[JENKINS] Archiving <https://builds.apache.org/job/karaf-master/ws/wrapper/pom.xml>
to org.apache.karaf.wrapper/org.apache.karaf.wrapper.core/4.2.0-SNAPSHOT/org.apache.karaf.wrapper.core-4.2.0-SNAPSHOT.pom
[JENKINS] Archiving <https://builds.apache.org/job/karaf-master/ws/services/eventadmin/pom.xml>
to org.apache.karaf.services/org.apache.karaf.services.eventadmin/4.2.0-SNAPSHOT/org.apache.karaf.services.eventadmin-4.2.0-SNAPSHOT.pom
[JENKINS] Archiving <https://builds.apache.org/job/karaf-master/ws/demos/pom.xml> to
org.apache.karaf.demos/demos/4.2.0-SNAPSHOT/demos-4.2.0-SNAPSHOT.pom
[JENKINS] Archiving <https://builds.apache.org/job/karaf-master/ws/tooling/utils/pom.xml>
to org.apache.karaf.tooling/org.apache.karaf.tools.utils/4.2.0-SNAPSHOT/org.apache.karaf.tools.utils-4.2.0-SNAPSHOT.pom
[JENKINS] Archiving <https://builds.apache.org/job/karaf-master/ws/tooling/utils/target/org.apache.karaf.tools.utils-4.2.0-SNAPSHOT.jar>
to org.apache.karaf.tooling/org.apache.karaf.tools.utils/4.2.0-20170713.124449-164/org.apache.karaf.tools.utils-4.2.0-20170713.124449-164.jar
[JENKINS] Archiving <https://builds.apache.org/job/karaf-master/ws/scr/examples/component-factory/pom.xml>
to org.apache.karaf.scr.examples/org.apache.karaf.scr.examples.component.factories/4.2.0-SNAPSHOT/org.apache.karaf.scr.examples.component.factories-4.2.0-SNAPSHOT.pom
[JENKINS] Archiving <https://builds.apache.org/job/karaf-master/ws/service/core/pom.xml>
to org.apache.karaf.service/org.apache.karaf.service.core/4.2.0-SNAPSHOT/org.apache.karaf.service.core-4.2.0-SNAPSHOT.pom
[JENKINS] Archiving <https://builds.apache.org/job/karaf-master/ws/service/core/target/org.apache.karaf.service.core-4.2.0-SNAPSHOT.jar>
to org.apache.karaf.service/org.apache.karaf.service.core/4.2.0-20170713.125100-164/org.apache.karaf.service.core-4.2.0-20170713.125100-164.jar
[JENKINS] Archiving <https://builds.apache.org/job/karaf-master/ws/jms/pool/pom.xml>
to org.apache.karaf.jms/org.apache.karaf.jms.pool/4.2.0-SNAPSHOT/org.apache.karaf.jms.pool-4.2.0-SNAPSHOT.pom
[JENKINS] Archiving <https://builds.apache.org/job/karaf-master/ws/assemblies/features/spring-legacy/pom.xml>
to org.apache.karaf.features/spring-legacy/4.2.0-SNAPSHOT/spring-legacy-4.2.0-SNAPSHOT.pom
[JENKINS] Archiving <https://builds.apache.org/job/karaf-master/ws/assemblies/features/enterprise/pom.xml>
to org.apache.karaf.features/enterprise/4.2.0-SNAPSHOT/enterprise-4.2.0-SNAPSHOT.pom
[JENKINS] Archiving <https://builds.apache.org/job/karaf-master/ws/demos/deployer/kar/pom.xml>
to org.apache.karaf.demos/my-kar/4.2.0-SNAPSHOT/my-kar-4.2.0-SNAPSHOT.pom
[JENKINS] Archiving <https://builds.apache.org/job/karaf-master/ws/archetypes/kar/pom.xml>
to org.apache.karaf.archetypes/karaf-kar-archetype/4.2.0-SNAPSHOT/karaf-kar-archetype-4.2.0-SNAPSHOT.pom
[JENKINS] Archiving <https://builds.apache.org/job/karaf-master/ws/scr/command/pom.xml>
to org.apache.karaf.scr/org.apache.karaf.scr.command/4.2.0-SNAPSHOT/org.apache.karaf.scr.command-4.2.0-SNAPSHOT.pom
[JENKINS] Archiving <https://builds.apache.org/job/karaf-master/ws/jaas/command/pom.xml>
to org.apache.karaf.jaas/org.apache.karaf.jaas.command/4.2.0-SNAPSHOT/org.apache.karaf.jaas.command-4.2.0-SNAPSHOT.pom
[JENKINS] Archiving <https://builds.apache.org/job/karaf-master/ws/assemblies/features/spring/pom.xml>
to org.apache.karaf.features/spring/4.2.0-SNAPSHOT/spring-4.2.0-SNAPSHOT.pom
[JENKINS] Archiving <https://builds.apache.org/job/karaf-master/ws/archetypes/command/pom.xml>
to org.apache.karaf.archetypes/karaf-command-archetype/4.2.0-SNAPSHOT/karaf-command-archetype-4.2.0-SNAPSHOT.pom
[JENKINS] Archiving <https://builds.apache.org/job/karaf-master/ws/scr/pom.xml> to org.apache.karaf.scr/scr/4.2.0-SNAPSHOT/scr-4.2.0-SNAPSHOT.pom
[JENKINS] Archiving <https://builds.apache.org/job/karaf-master/ws/tooling/karaf-maven-plugin/pom.xml>
to org.apache.karaf.tooling/karaf-maven-plugin/4.2.0-SNAPSHOT/karaf-maven-plugin-4.2.0-SNAPSHOT.pom
[JENKINS] Archiving <https://builds.apache.org/job/karaf-master/ws/deployer/wrap/pom.xml>
to org.apache.karaf.deployer/org.apache.karaf.deployer.wrap/4.2.0-SNAPSHOT/org.apache.karaf.deployer.wrap-4.2.0-SNAPSHOT.pom
[JENKINS] Archiving <https://builds.apache.org/job/karaf-master/ws/jms/pom.xml> to org.apache.karaf.jms/parent/4.2.0-SNAPSHOT/parent-4.2.0-SNAPSHOT.pom
[JENKINS] Archiving <https://builds.apache.org/job/karaf-master/ws/assemblies/features/static/pom.xml>
to org.apache.karaf.features/static/4.2.0-SNAPSHOT/static-4.2.0-SNAPSHOT.pom
[JENKINS] Archiving <https://builds.apache.org/job/karaf-master/ws/webconsole/console/pom.xml>
to org.apache.karaf.webconsole/org.apache.karaf.webconsole.console/4.2.0-SNAPSHOT/org.apache.karaf.webconsole.console-4.2.0-SNAPSHOT.pom
[JENKINS] Archiving <https://builds.apache.org/job/karaf-master/ws/scr/examples/service/pom.xml>
to org.apache.karaf.scr.examples/org.apache.karaf.scr.examples.service/4.2.0-SNAPSHOT/org.apache.karaf.scr.examples.service-4.2.0-SNAPSHOT.pom
[JENKINS] Archiving <https://builds.apache.org/job/karaf-master/ws/scr/examples/managed-service/pom.xml>
to org.apache.karaf.scr.examples/org.apache.karaf.scr.examples.managed.service/4.2.0-SNAPSHOT/org.apache.karaf.scr.examples.managed.service-4.2.0-SNAPSHOT.pom
[JENKINS] Archiving <https://builds.apache.org/job/karaf-master/ws/obr/pom.xml> to org.apache.karaf.obr/org.apache.karaf.obr.core/4.2.0-SNAPSHOT/org.apache.karaf.obr.core-4.2.0-SNAPSHOT.pom
[JENKINS] Archiving <https://builds.apache.org/job/karaf-master/ws/itests/pom.xml> to
org.apache.karaf.itests/itests/4.2.0-SNAPSHOT/itests-4.2.0-SNAPSHOT.pom
[JENKINS] Archiving <https://builds.apache.org/job/karaf-master/ws/jaas/boot/pom.xml>
to org.apache.karaf.jaas/org.apache.karaf.jaas.boot/4.2.0-SNAPSHOT/org.apache.karaf.jaas.boot-4.2.0-SNAPSHOT.pom
[JENKINS] Archiving <https://builds.apache.org/job/karaf-master/ws/jaas/boot/target/org.apache.karaf.jaas.boot-4.2.0-SNAPSHOT.jar>
to org.apache.karaf.jaas/org.apache.karaf.jaas.boot/4.2.0-20170713.122413-171/org.apache.karaf.jaas.boot-4.2.0-20170713.122413-171.jar
[JENKINS] Archiving <https://builds.apache.org/job/karaf-master/ws/profile/pom.xml>
to org.apache.karaf.profile/org.apache.karaf.profile.core/4.2.0-SNAPSHOT/org.apache.karaf.profile.core-4.2.0-SNAPSHOT.pom
[JENKINS] Archiving <https://builds.apache.org/job/karaf-master/ws/profile/target/org.apache.karaf.profile.core-4.2.0-SNAPSHOT.jar>
to org.apache.karaf.profile/org.apache.karaf.profile.core/4.2.0-20170713.124750-164/org.apache.karaf.profile.core-4.2.0-20170713.124750-164.jar
[JENKINS] Archiving <https://builds.apache.org/job/karaf-master/ws/demos/command/pom.xml>
to org.apache.karaf.demos/org.apache.karaf.demos.command/4.2.0-SNAPSHOT/org.apache.karaf.demos.command-4.2.0-SNAPSHOT.pom
[JENKINS] Archiving <https://builds.apache.org/job/karaf-master/ws/webconsole/features/pom.xml>
to org.apache.karaf.webconsole/org.apache.karaf.webconsole.features/4.2.0-SNAPSHOT/org.apache.karaf.webconsole.features-4.2.0-SNAPSHOT.pom
[JENKINS] Archiving <https://builds.apache.org/job/karaf-master/ws/tooling/pom.xml>
to org.apache.karaf.tooling/tooling/4.2.0-SNAPSHOT/tooling-4.2.0-SNAPSHOT.pom
[JENKINS] Archiving <https://builds.apache.org/job/karaf-master/ws/assemblies/apache-karaf/pom.xml>
to org.apache.karaf/apache-karaf/4.2.0-SNAPSHOT/apache-karaf-4.2.0-SNAPSHOT.pom
[JENKINS] Archiving <https://builds.apache.org/job/karaf-master/ws/shell/commands/pom.xml>
to org.apache.karaf.shell/org.apache.karaf.shell.commands/4.2.0-SNAPSHOT/org.apache.karaf.shell.commands-4.2.0-SNAPSHOT.pom
[JENKINS] Archiving <https://builds.apache.org/job/karaf-master/ws/demos/profiles/registry/pom.xml>
to org.apache.karaf.demos.profiles/registry/4.2.0-SNAPSHOT/registry-4.2.0-SNAPSHOT.pom
[JENKINS] Archiving <https://builds.apache.org/job/karaf-master/ws/demos/profiles/registry/target/registry-4.2.0-SNAPSHOT.jar>
to org.apache.karaf.demos.profiles/registry/4.2.0-20170713.124714-164/registry-4.2.0-20170713.124714-164.jar
[JENKINS] Archiving <https://builds.apache.org/job/karaf-master/ws/http/pom.xml> to
org.apache.karaf.http/org.apache.karaf.http.core/4.2.0-SNAPSHOT/org.apache.karaf.http.core-4.2.0-SNAPSHOT.pom
[JENKINS] Archiving <https://builds.apache.org/job/karaf-master/ws/http/target/org.apache.karaf.http.core-4.2.0-SNAPSHOT.jar>
to org.apache.karaf.http/org.apache.karaf.http.core/4.2.0-20170713.125031-164/org.apache.karaf.http.core-4.2.0-20170713.125031-164.jar
[JENKINS] Archiving <https://builds.apache.org/job/karaf-master/ws/webconsole/http/pom.xml>
to org.apache.karaf.webconsole/org.apache.karaf.webconsole.http/4.2.0-SNAPSHOT/org.apache.karaf.webconsole.http-4.2.0-SNAPSHOT.pom
[JENKINS] Archiving <https://builds.apache.org/job/karaf-master/ws/jaas/config/pom.xml>
to org.apache.karaf.jaas/org.apache.karaf.jaas.config/4.2.0-SNAPSHOT/org.apache.karaf.jaas.config-4.2.0-SNAPSHOT.pom
[JENKINS] Archiving <https://builds.apache.org/job/karaf-master/ws/jaas/config/target/org.apache.karaf.jaas.config-4.2.0-SNAPSHOT.jar>
to org.apache.karaf.jaas/org.apache.karaf.jaas.config/4.2.0-20170713.123829-168/org.apache.karaf.jaas.config-4.2.0-20170713.123829-168.jar
[JENKINS] Archiving <https://builds.apache.org/job/karaf-master/ws/services/staticcm/pom.xml>
to org.apache.karaf.services/org.apache.karaf.services.staticcm/4.2.0-SNAPSHOT/org.apache.karaf.services.staticcm-4.2.0-SNAPSHOT.pom
[JENKINS] Archiving <https://builds.apache.org/job/karaf-master/ws/jaas/blueprint/jasypt/pom.xml>
to org.apache.karaf.jaas.blueprint/org.apache.karaf.jaas.blueprint.jasypt/4.2.0-SNAPSHOT/org.apache.karaf.jaas.blueprint.jasypt-4.2.0-SNAPSHOT.pom
[JENKINS] Archiving <https://builds.apache.org/job/karaf-master/ws/archetypes/bundle/pom.xml>
to org.apache.karaf.archetypes/karaf-bundle-archetype/4.2.0-SNAPSHOT/karaf-bundle-archetype-4.2.0-SNAPSHOT.pom
[JENKINS] Archiving <https://builds.apache.org/job/karaf-master/ws/subsystem/pom.xml>
to org.apache.karaf.subsystem/org.apache.karaf.subsystem.core/4.2.0-SNAPSHOT/org.apache.karaf.subsystem.core-4.2.0-SNAPSHOT.pom
[JENKINS] Archiving <https://builds.apache.org/job/karaf-master/ws/shell/console/pom.xml>
to org.apache.karaf.shell/org.apache.karaf.shell.console/4.2.0-SNAPSHOT/org.apache.karaf.shell.console-4.2.0-SNAPSHOT.pom
[JENKINS] Archiving <https://builds.apache.org/job/karaf-master/ws/webconsole/pom.xml>
to org.apache.karaf.webconsole/webconsole/4.2.0-SNAPSHOT/webconsole-4.2.0-SNAPSHOT.pom
[JENKINS] Archiving <https://builds.apache.org/job/karaf-master/ws/jaas/modules/pom.xml>
to org.apache.karaf.jaas/org.apache.karaf.jaas.modules/4.2.0-SNAPSHOT/org.apache.karaf.jaas.modules-4.2.0-SNAPSHOT.pom
[JENKINS] Archiving <https://builds.apache.org/job/karaf-master/ws/jaas/modules/target/org.apache.karaf.jaas.modules-4.2.0-SNAPSHOT.jar>
to org.apache.karaf.jaas/org.apache.karaf.jaas.modules/4.2.0-20170713.124048-164/org.apache.karaf.jaas.modules-4.2.0-20170713.124048-164.jar
Compressed 1.22 MB of artifacts by 20.5% relative to #4439
[JENKINS] Archiving <https://builds.apache.org/job/karaf-master/ws/demos/branding/pom.xml>
to org.apache.karaf.demos/org.apache.karaf.demos.branding.shell/4.2.0-SNAPSHOT/org.apache.karaf.demos.branding.shell-4.2.0-SNAPSHOT.pom
[JENKINS] Archiving <https://builds.apache.org/job/karaf-master/ws/assemblies/features/enterprise-legacy/pom.xml>
to org.apache.karaf.features/enterprise-legacy/4.2.0-SNAPSHOT/enterprise-legacy-4.2.0-SNAPSHOT.pom
[JENKINS] Archiving <https://builds.apache.org/job/karaf-master/ws/archetypes/assembly/pom.xml>
to org.apache.karaf.archetypes/karaf-assembly-archetype/4.2.0-SNAPSHOT/karaf-assembly-archetype-4.2.0-SNAPSHOT.pom
[JENKINS] Archiving <https://builds.apache.org/job/karaf-master/ws/features/extension/pom.xml>
to org.apache.karaf.features/org.apache.karaf.features.extension/4.2.0-SNAPSHOT/org.apache.karaf.features.extension-4.2.0-SNAPSHOT.pom
[JENKINS] Archiving <https://builds.apache.org/job/karaf-master/ws/features/extension/target/org.apache.karaf.features.extension-4.2.0-SNAPSHOT.jar>
to org.apache.karaf.features/org.apache.karaf.features.extension/4.2.0-20170713.122916-170/org.apache.karaf.features.extension-4.2.0-20170713.122916-170.jar
[JENKINS] Archiving <https://builds.apache.org/job/karaf-master/ws/management/server/pom.xml>
to org.apache.karaf.management/org.apache.karaf.management.server/4.2.0-SNAPSHOT/org.apache.karaf.management.server-4.2.0-SNAPSHOT.pom
[JENKINS] Archiving <https://builds.apache.org/job/karaf-master/ws/service/guard/pom.xml>
to org.apache.karaf.service/org.apache.karaf.service.guard/4.2.0-SNAPSHOT/org.apache.karaf.service.guard-4.2.0-SNAPSHOT.pom
[JENKINS] Archiving <https://builds.apache.org/job/karaf-master/ws/service/guard/target/org.apache.karaf.service.guard-4.2.0-SNAPSHOT.jar>
to org.apache.karaf.service/org.apache.karaf.service.guard/4.2.0-20170713.123029-168/org.apache.karaf.service.guard-4.2.0-20170713.123029-168.jar
[JENKINS] Archiving <https://builds.apache.org/job/karaf-master/ws/demos/profiles/static/pom.xml>
to org.apache.karaf.demos.profiles/static/4.2.0-SNAPSHOT/static-4.2.0-SNAPSHOT.pom
[JENKINS] Archiving <https://builds.apache.org/job/karaf-master/ws/tooling/karaf-services-maven-plugin/pom.xml>
to org.apache.karaf.tooling/karaf-services-maven-plugin/4.2.0-SNAPSHOT/karaf-services-maven-plugin-4.2.0-SNAPSHOT.pom
[JENKINS] Archiving <https://builds.apache.org/job/karaf-master/ws/tooling/karaf-services-maven-plugin/target/karaf-services-maven-plugin-4.2.0-SNAPSHOT.jar>
to org.apache.karaf.tooling/karaf-services-maven-plugin/4.2.0-20170713.123422-168/karaf-services-maven-plugin-4.2.0-20170713.123422-168.jar
[JENKINS] Archiving <https://builds.apache.org/job/karaf-master/ws/package/pom.xml>
to org.apache.karaf.package/org.apache.karaf.package.core/4.2.0-SNAPSHOT/org.apache.karaf.package.core-4.2.0-SNAPSHOT.pom
[JENKINS] Archiving <https://builds.apache.org/job/karaf-master/ws/package/target/org.apache.karaf.package.core-4.2.0-SNAPSHOT.jar>
to org.apache.karaf.package/org.apache.karaf.package.core/4.2.0-20170713.124953-164/org.apache.karaf.package.core-4.2.0-20170713.124953-164.jar
[JENKINS] Archiving <https://builds.apache.org/job/karaf-master/ws/features/command/pom.xml>
to org.apache.karaf.features/org.apache.karaf.features.command/4.2.0-SNAPSHOT/org.apache.karaf.features.command-4.2.0-SNAPSHOT.pom
[JENKINS] Archiving <https://builds.apache.org/job/karaf-master/ws/features/command/target/org.apache.karaf.features.command-4.2.0-SNAPSHOT.jar>
to org.apache.karaf.features/org.apache.karaf.features.command/4.2.0-20170713.123648-168/org.apache.karaf.features.command-4.2.0-20170713.123648-168.jar
[JENKINS] Archiving <https://builds.apache.org/job/karaf-master/ws/scheduler/pom.xml>
to org.apache.karaf.scheduler/org.apache.karaf.scheduler.core/4.2.0-SNAPSHOT/org.apache.karaf.scheduler.core-4.2.0-SNAPSHOT.pom
[JENKINS] Archiving <https://builds.apache.org/job/karaf-master/ws/util/pom.xml> to
org.apache.karaf/org.apache.karaf.util/4.2.0-SNAPSHOT/org.apache.karaf.util-4.2.0-SNAPSHOT.pom
[JENKINS] Archiving <https://builds.apache.org/job/karaf-master/ws/util/target/org.apache.karaf.util-4.2.0-SNAPSHOT.jar>
to org.apache.karaf/org.apache.karaf.util/4.2.0-20170713.122604-170/org.apache.karaf.util-4.2.0-20170713.122604-170.jar
channel stopped

Mime
View raw message