karaf-commits mailing list archives

Site index · List index
Message view « Date » · « Thread »
Top « Date » · « Thread »
From Apache Jenkins Server <jenk...@builds.apache.org>
Subject Build failed in Jenkins: karaf-decanter-master » Apache Karaf :: Decanter :: Collector :: Camel #190
Date Mon, 17 Jul 2017 08:09:48 GMT
See <https://builds.apache.org/job/karaf-decanter-master/org.apache.karaf.decanter.collector$org.apache.karaf.decanter.collector.camel/190/display/redirect?page=changes>

Changes:

[jbonofre] Include bodyType event even if body is not included in the posted event

------------------------------------------
[INFO]                                                                         
[INFO] ------------------------------------------------------------------------
[INFO] Building Apache Karaf :: Decanter :: Collector :: Camel 1.4.0-SNAPSHOT
[INFO] ------------------------------------------------------------------------
[INFO] 
[INFO] --- maven-clean-plugin:2.5:clean (default-clean) @ org.apache.karaf.decanter.collector.camel
---
[INFO] Deleting <https://builds.apache.org/job/karaf-decanter-master/org.apache.karaf.decanter.collector$org.apache.karaf.decanter.collector.camel/ws/target>
[INFO] 
[INFO] --- maven-antrun-plugin:1.7:run (copy-notice) @ org.apache.karaf.decanter.collector.camel
---
[INFO] Executing tasks

main:
     [copy] Copying 1 file to <https://builds.apache.org/job/karaf-decanter-master/org.apache.karaf.decanter.collector$org.apache.karaf.decanter.collector.camel/ws/target/maven-shared-archive-resources/META-INF>
[INFO] Executed tasks
[INFO] 
[INFO] --- maven-remote-resources-plugin:1.5:process (default) @ org.apache.karaf.decanter.collector.camel
---
[INFO] 
[INFO] --- maven-resources-plugin:2.6:resources (default-resources) @ org.apache.karaf.decanter.collector.camel
---
[INFO] Using 'UTF-8' encoding to copy filtered resources.
[INFO] skip non existing resourceDirectory <https://builds.apache.org/job/karaf-decanter-master/org.apache.karaf.decanter.collector$org.apache.karaf.decanter.collector.camel/ws/src/main/resources>
[INFO] Copying 3 resources
[INFO] 
[INFO] --- maven-compiler-plugin:3.1:compile (default-compile) @ org.apache.karaf.decanter.collector.camel
---
[INFO] Changes detected - recompiling the module!
[INFO] Compiling 3 source files to <https://builds.apache.org/job/karaf-decanter-master/org.apache.karaf.decanter.collector$org.apache.karaf.decanter.collector.camel/ws/target/classes>
[INFO] -------------------------------------------------------------
[ERROR] COMPILATION ERROR : 
[INFO] -------------------------------------------------------------
[ERROR] <https://builds.apache.org/job/karaf-decanter-master/org.apache.karaf.decanter.collector$org.apache.karaf.decanter.collector.camel/ws/src/main/java/org/apache/karaf/decanter/collector/camel/DecanterTraceEventHandler.java>:[108,87]
not a statement
[ERROR] <https://builds.apache.org/job/karaf-decanter-master/org.apache.karaf.decanter.collector$org.apache.karaf.decanter.collector.camel/ws/src/main/java/org/apache/karaf/decanter/collector/camel/DecanterTraceEventHandler.java>:[108,88]
';' expected
[INFO] 2 errors 
[INFO] -------------------------------------------------------------

Mime
View raw message