karaf-commits mailing list archives

Site index · List index
Message view « Date » · « Thread »
Top « Date » · « Thread »
From Apache Jenkins Server <jenk...@builds.apache.org>
Subject Build failed in Jenkins: karaf-master #4287
Date Wed, 10 May 2017 12:50:59 GMT
See <https://builds.apache.org/job/karaf-master/4287/display/redirect?page=changes>

Changes:

[chris] [KARAF-5121] Fix connection factory template

------------------------------------------
[...truncated 2.21 MB...]
[INFO] --- maven-jar-plugin:3.0.2:test-jar (jar-test-classes) @ itests ---
[INFO] Building jar: <https://builds.apache.org/job/karaf-master/ws/itests/target/itests-4.2.0-SNAPSHOT-tests.jar>
[INFO] 
[INFO] --- maven-install-plugin:2.5.2:install (default-install) @ itests ---
[INFO] Installing <https://builds.apache.org/job/karaf-master/ws/itests/target/itests-4.2.0-SNAPSHOT.jar>
to <https://builds.apache.org/job/karaf-master/ws/.repository/org/apache/karaf/itests/itests/4.2.0-SNAPSHOT/itests-4.2.0-SNAPSHOT.jar>
[INFO] Installing <https://builds.apache.org/job/karaf-master/ws/itests/pom.xml> to
<https://builds.apache.org/job/karaf-master/ws/.repository/org/apache/karaf/itests/itests/4.2.0-SNAPSHOT/itests-4.2.0-SNAPSHOT.pom>
[INFO] Installing <https://builds.apache.org/job/karaf-master/ws/itests/target/itests-4.2.0-SNAPSHOT-tests.jar>
to <https://builds.apache.org/job/karaf-master/ws/.repository/org/apache/karaf/itests/itests/4.2.0-SNAPSHOT/itests-4.2.0-SNAPSHOT-tests.jar>
[INFO] 
[INFO] --- maven-deploy-plugin:2.8.2:deploy (default-deploy) @ itests ---
[INFO] Downloading: https://repository.apache.org/content/repositories/snapshots/org/apache/karaf/itests/itests/4.2.0-SNAPSHOT/maven-metadata.xml
[INFO] Downloaded: https://repository.apache.org/content/repositories/snapshots/org/apache/karaf/itests/itests/4.2.0-SNAPSHOT/maven-metadata.xml
(995 B at 1.4 KB/sec)
[INFO] Uploading: https://repository.apache.org/content/repositories/snapshots/org/apache/karaf/itests/itests/4.2.0-SNAPSHOT/itests-4.2.0-20170510.124504-21.jar
[INFO] Uploaded: https://repository.apache.org/content/repositories/snapshots/org/apache/karaf/itests/itests/4.2.0-SNAPSHOT/itests-4.2.0-20170510.124504-21.jar
(11 KB at 11.6 KB/sec)
[INFO] Uploading: https://repository.apache.org/content/repositories/snapshots/org/apache/karaf/itests/itests/4.2.0-SNAPSHOT/itests-4.2.0-20170510.124504-21.pom
[INFO] Uploaded: https://repository.apache.org/content/repositories/snapshots/org/apache/karaf/itests/itests/4.2.0-SNAPSHOT/itests-4.2.0-20170510.124504-21.pom
(11 KB at 12.3 KB/sec)
[INFO] Downloading: https://repository.apache.org/content/repositories/snapshots/org/apache/karaf/itests/itests/maven-metadata.xml
[INFO] Downloaded: https://repository.apache.org/content/repositories/snapshots/org/apache/karaf/itests/itests/maven-metadata.xml
(674 B at 0.9 KB/sec)
[INFO] Uploading: https://repository.apache.org/content/repositories/snapshots/org/apache/karaf/itests/itests/4.2.0-SNAPSHOT/maven-metadata.xml
[INFO] Uploaded: https://repository.apache.org/content/repositories/snapshots/org/apache/karaf/itests/itests/4.2.0-SNAPSHOT/maven-metadata.xml
(995 B at 1.2 KB/sec)
[INFO] Uploading: https://repository.apache.org/content/repositories/snapshots/org/apache/karaf/itests/itests/maven-metadata.xml
[INFO] Uploaded: https://repository.apache.org/content/repositories/snapshots/org/apache/karaf/itests/itests/maven-metadata.xml
(674 B at 0.8 KB/sec)
[INFO] Uploading: https://repository.apache.org/content/repositories/snapshots/org/apache/karaf/itests/itests/4.2.0-SNAPSHOT/itests-4.2.0-20170510.124504-21-tests.jar
[INFO] Uploaded: https://repository.apache.org/content/repositories/snapshots/org/apache/karaf/itests/itests/4.2.0-SNAPSHOT/itests-4.2.0-20170510.124504-21-tests.jar
(129 KB at 119.5 KB/sec)
[INFO] Uploading: https://repository.apache.org/content/repositories/snapshots/org/apache/karaf/itests/itests/4.2.0-SNAPSHOT/maven-metadata.xml
[INFO] Uploaded: https://repository.apache.org/content/repositories/snapshots/org/apache/karaf/itests/itests/4.2.0-SNAPSHOT/maven-metadata.xml
(995 B at 1.2 KB/sec)
[INFO] ------------------------------------------------------------------------
[INFO] Reactor Summary:
[INFO] 
[INFO] Apache Karaf ....................................... SUCCESS [  8.852 s]
[INFO] Apache Karaf :: JAAS ............................... SUCCESS [  6.058 s]
[INFO] Apache Karaf :: JAAS :: Boot ....................... SUCCESS [  8.952 s]
[INFO] Apache Karaf :: Util ............................... SUCCESS [ 28.229 s]
[INFO] Apache Karaf :: Main ............................... SUCCESS [ 21.349 s]
[INFO] Apache Karaf :: Features ........................... SUCCESS [  5.077 s]
[INFO] Apache Karaf :: Features :: Extension .............. SUCCESS [  7.131 s]
[INFO] Apache Karaf :: Service ............................ SUCCESS [  4.554 s]
[INFO] Apache Karaf :: Service :: Guard ................... SUCCESS [ 12.489 s]
[INFO] Apache Karaf :: Shell .............................. SUCCESS [  5.140 s]
[INFO] Apache Karaf :: Shell :: Core ...................... SUCCESS [ 12.065 s]
[INFO] Apache Karaf :: Tooling ............................ SUCCESS [  5.409 s]
[INFO] Apache Karaf :: Tooling :: Maven Karaf Plugin for Services Metadata SUCCESS [ 13.320
s]
[INFO] Apache Karaf :: Features :: Core ................... SUCCESS [ 16.776 s]
[INFO] Apache Karaf :: Features :: Command ................ SUCCESS [  8.383 s]
[INFO] Apache Karaf :: KAR :: Core ........................ SUCCESS [  7.922 s]
[INFO] Apache Karaf :: JAAS :: Config ..................... SUCCESS [  7.385 s]
[INFO] Apache Karaf :: JAAS :: Modules .................... SUCCESS [02:40 min]
[INFO] Apache Karaf :: Bundle ............................. SUCCESS [  4.262 s]
[INFO] Apache Karaf :: Bundle :: Core ..................... SUCCESS [ 16.461 s]
[INFO] Apache Karaf :: Bundle :: BlueprintStateService .... SUCCESS [  9.054 s]
[INFO] Apache Karaf :: Bundle :: SpringStateService ....... SUCCESS [  7.017 s]
[INFO] Apache Karaf :: ConfigAdmin :: Core ................ SUCCESS [  8.657 s]
[INFO] Apache Karaf :: Tooling :: Utils ................... SUCCESS [ 18.589 s]
[INFO] Apache Karaf :: Deployer ........................... SUCCESS [  5.893 s]
[INFO] Apache Karaf :: Deployer :: Blueprint .............. SUCCESS [  6.886 s]
[INFO] Apache Karaf :: Deployer :: Spring ................. SUCCESS [  7.949 s]
[INFO] Apache Karaf :: Demos :: Profiles :: Registry ...... SUCCESS [  5.772 s]
[INFO] Apache Karaf :: Profile :: Core .................... SUCCESS [ 13.840 s]
[INFO] Apache Karaf :: Instance :: Core ................... SUCCESS [ 12.725 s]
[INFO] Apache Karaf :: Package :: Core .................... SUCCESS [  9.333 s]
[INFO] Apache Karaf :: HTTP :: Core ....................... SUCCESS [ 11.237 s]
[INFO] Apache Karaf :: Service :: Core .................... SUCCESS [ 12.020 s]
[INFO] Apache Karaf :: Log :: Core ........................ SUCCESS [ 11.668 s]
[INFO] Apache Karaf :: Deployer :: Features ............... SUCCESS [  7.381 s]
[INFO] Apache Karaf :: Deployer :: Karaf Archive (.kar) ... SUCCESS [  7.842 s]
[INFO] Apache Karaf :: Deployer :: Wrap Non OSGi Jar ...... SUCCESS [ 10.414 s]
[INFO] Apache Karaf :: Shell :: Various Commands .......... SUCCESS [  8.518 s]
[INFO] Apache Karaf :: Shell :: Console ................... SUCCESS [  7.779 s]
[INFO] Apache Karaf :: Shell :: Table ..................... SUCCESS [  7.363 s]
[INFO] Apache Karaf :: Shell :: SSH ....................... SUCCESS [ 46.225 s]
[INFO] Apache Karaf :: JAAS :: Jasypt Encryption .......... SUCCESS [  9.574 s]
[INFO] Apache Karaf :: JAAS :: Command .................... SUCCESS [ 11.206 s]
[INFO] Apache Karaf :: JAAS :: Blueprint .................. SUCCESS [  4.681 s]
[INFO] Apache Karaf :: JAAS :: Blueprint :: Config ........ SUCCESS [  7.927 s]
[INFO] Apache Karaf :: JAAS :: Blueprint :: Jasypt ........ SUCCESS [ 11.358 s]
[INFO] Apache Karaf :: Client ............................. SUCCESS [ 11.771 s]
[INFO] Apache Karaf :: Management ......................... SUCCESS [  5.735 s]
[INFO] Apache Karaf :: Management ......................... SUCCESS [  9.313 s]
[INFO] Apache Karaf :: System :: Core ..................... SUCCESS [  8.131 s]
[INFO] Apache Karaf :: Web :: Core ........................ SUCCESS [  8.966 s]
[INFO] Apache Karaf :: Wrapper :: Core .................... SUCCESS [  9.006 s]
[INFO] Apache Karaf :: Web Console ........................ SUCCESS [  5.093 s]
[INFO] Apache Karaf :: Web Console :: Console ............. SUCCESS [  8.418 s]
[INFO] Apache Karaf :: Web Console :: Features Plugin ..... SUCCESS [  8.545 s]
[INFO] Apache Karaf :: Web Console :: Gogo Plugin ......... SUCCESS [  9.959 s]
[INFO] Apache Karaf :: Web Console :: HTTP Plugin ......... SUCCESS [  8.422 s]
[INFO] Apache Karaf :: Web Console :: Instance Plugin ..... SUCCESS [  9.023 s]
[INFO] Apache Karaf :: Exception .......................... SUCCESS [  6.643 s]
[INFO] Apache Karaf :: Scheduler :: Core .................. SUCCESS [ 12.815 s]
[INFO] Apache Karaf :: Declarative Services (DS) .......... SUCCESS [  5.168 s]
[INFO] Apache Karaf :: SCR :: Shell Commands .............. SUCCESS [  7.048 s]
[INFO] Apache Karaf :: SCR :: Management MBeans ........... SUCCESS [  6.888 s]
[INFO] Apache Karaf :: SCR :: Bundle State ................ SUCCESS [  7.303 s]
[INFO] Apache Karaf :: SCR :: Examples .................... SUCCESS [  7.651 s]
[INFO] Apache Karaf :: SCR :: Examples :: Basic Service ... SUCCESS [  8.008 s]
[INFO] Apache Karaf :: SCR :: Examples :: Managed Services  SUCCESS [  9.383 s]
[INFO] Apache Karaf :: SCR :: Examples :: Component Factories SUCCESS [  7.134 s]
[INFO] Apache Karaf :: Diagnostic ......................... SUCCESS [  4.553 s]
[INFO] Apache Karaf :: Diagnostic :: Boot ................. SUCCESS [ 11.502 s]
[INFO] Apache Karaf :: Diagnostic :: Core ................. SUCCESS [ 10.305 s]
[INFO] Apache Karaf :: OBR :: Core ........................ SUCCESS [  8.231 s]
[INFO] Apache Karaf :: JNDI :: Core ....................... SUCCESS [ 15.425 s]
[INFO] Apache Karaf :: JDBC :: Core ....................... SUCCESS [  9.234 s]
[INFO] Apache Karaf :: JMS :: Core ........................ SUCCESS [  8.328 s]
[INFO] Apache Karaf :: Features ........................... SUCCESS [  4.901 s]
[INFO] Apache Karaf :: JPA :: Parent ...................... SUCCESS [  5.823 s]
[INFO] Apache Karaf :: JPA :: Hibernate ................... SUCCESS [ 12.493 s]
[INFO] Apache Karaf :: OSGi Services :: Coordinator ....... SUCCESS [ 10.664 s]
[INFO] Apache Karaf :: OSGi Services :: EventAdmin ........ SUCCESS [ 10.379 s]
[INFO] Apache Karaf :: OSGi Services :: Static ConfigAdmin  SUCCESS [ 10.287 s]
[INFO] Apache Karaf :: OSGi Services ...................... SUCCESS [  8.453 s]
[INFO] Apache Karaf :: Subsystem :: Core .................. SUCCESS [  9.712 s]
[INFO] Apache Karaf :: OSGi Services :: Event ............. SUCCESS [ 12.488 s]
[INFO] Apache Karaf :: Tooling :: Maven Karaf Plugin ...... SUCCESS [04:42 min]
[INFO] Apache Karaf :: Assemblies ......................... SUCCESS [ 23.142 s]
[INFO] Apache Karaf :: Assemblies :: Features ............. SUCCESS [ 13.217 s]
[INFO] Apache Karaf :: Assemblies :: Features :: Base ..... SUCCESS [ 10.005 s]
[INFO] Apache Karaf :: Assemblies :: Features :: Framework  SUCCESS [ 15.524 s]
[INFO] Apache Karaf :: Assemblies :: Features :: Static ... SUCCESS [ 14.119 s]
[INFO] Apache Karaf :: Assemblies :: Features :: Standard . SUCCESS [ 36.986 s]
[INFO] Apache Karaf :: Assemblies :: Features :: Spring ... SUCCESS [ 17.733 s]
[INFO] Apache Karaf :: Assemblies :: Features :: Spring Legacy SUCCESS [ 40.861 s]
[INFO] Apache Karaf :: Assemblies :: Features :: Enterprise SUCCESS [ 15.123 s]
[INFO] Apache Karaf :: Assemblies :: Features :: Enterprise Legacy SUCCESS [ 13.983 s]
[INFO] Apache Karaf :: Assemblies :: Demos ................ SUCCESS [ 10.405 s]
[INFO] Apache Karaf :: Assemblies :: Minimal Distribution . SUCCESS [ 21.588 s]
[INFO] Apache Karaf :: Assemblies :: Default Distribution . SUCCESS [ 23.807 s]
[INFO] Apache Karaf :: Demos .............................. SUCCESS [ 10.480 s]
[INFO] Apache Karaf :: Demos :: Web ....................... SUCCESS [ 15.640 s]
[INFO] Apache Karaf :: Demos :: Branding :: Shell ......... SUCCESS [ 15.095 s]
[INFO] Apache Karaf :: Demos :: Command :: Extend Console . SUCCESS [ 12.438 s]
[INFO] Apache Karaf :: Demos :: Demo Dump provider ........ SUCCESS [ 21.424 s]
[INFO] Apache Karaf :: Demos :: Deployer .................. SUCCESS [  8.301 s]
[INFO] Apache Karaf :: Demos :: Deployer :: Kar ........... SUCCESS [  8.996 s]
[INFO] Apache Karaf :: Demos :: Deployer :: Bundle ........ SUCCESS [ 10.740 s]
[INFO] Apache Karaf :: Demos :: Profiles :: Dynamic Assembly SUCCESS [ 41.798 s]
[INFO] Apache Karaf :: Demos :: Profiles :: Static Assembly SUCCESS [01:00 min]
[INFO] Apache Karaf :: Demos :: Profiles .................. SUCCESS [ 12.925 s]
[INFO] Apache Karaf :: Archetypes ......................... SUCCESS [ 14.377 s]
[INFO] Apache Karaf :: Archetypes :: Assembly Archetype ... SUCCESS [ 45.722 s]
[INFO] Apache Karaf :: Archetypes :: Command Archetype .... SUCCESS [ 14.522 s]
[INFO] Apache Karaf :: Archetypes :: Feature Archetype .... SUCCESS [ 14.854 s]
[INFO] Apache Karaf :: Archetypes :: Kar Archetype ........ SUCCESS [ 22.480 s]
[INFO] Apache Karaf :: Archetypes :: Bundle Archetype ..... SUCCESS [ 15.165 s]
[INFO] Apache Karaf :: Archetypes :: Blueprint Archetype .. SUCCESS [ 16.483 s]
[INFO] Apache Karaf :: Integration Tests .................. SUCCESS [21:21 min]
[INFO] ------------------------------------------------------------------------
[INFO] BUILD SUCCESS
[INFO] ------------------------------------------------------------------------
[INFO] Total time: 01:03 h
[INFO] Finished at: 2017-05-10T12:45:56+00:00
[INFO] Final Memory: 242M/2984M
[INFO] ------------------------------------------------------------------------
Waiting for Jenkins to finish collecting data
[JENKINS] Archiving <https://builds.apache.org/job/karaf-master/ws/archetypes/blueprint/pom.xml>
to org.apache.karaf.archetypes/karaf-blueprint-archetype/4.2.0-SNAPSHOT/karaf-blueprint-archetype-4.2.0-SNAPSHOT.pom
[JENKINS] Archiving <https://builds.apache.org/job/karaf-master/ws/archetypes/blueprint/target/karaf-blueprint-archetype-4.2.0-SNAPSHOT.jar>
to org.apache.karaf.archetypes/karaf-blueprint-archetype/4.2.0-20170510.122338-25/karaf-blueprint-archetype-4.2.0-20170510.122338-25.jar
No artifacts from karaf-master » Apache Karaf :: Archetypes :: Blueprint Archetype #4286
to compare, so performing full copy of artifacts
[JENKINS] Archiving <https://builds.apache.org/job/karaf-master/ws/webconsole/gogo/pom.xml>
to org.apache.karaf.webconsole/org.apache.karaf.webconsole.gogo/4.2.0-SNAPSHOT/org.apache.karaf.webconsole.gogo-4.2.0-SNAPSHOT.pom
[JENKINS] Archiving <https://builds.apache.org/job/karaf-master/ws/webconsole/gogo/target/org.apache.karaf.webconsole.gogo-4.2.0-SNAPSHOT.jar>
to org.apache.karaf.webconsole/org.apache.karaf.webconsole.gogo/4.2.0-20170510.115708-25/org.apache.karaf.webconsole.gogo-4.2.0-20170510.115708-25.jar
No artifacts from karaf-master » Apache Karaf :: Web Console :: Gogo Plugin #4286 to compare,
so performing full copy of artifacts
[JENKINS] Archiving <https://builds.apache.org/job/karaf-master/ws/management/pom.xml>
to org.apache.karaf.management/management/4.2.0-SNAPSHOT/management-4.2.0-SNAPSHOT.pom
No artifacts from karaf-master » Apache Karaf :: Management #4286 to compare, so performing
full copy of artifacts
[JENKINS] Archiving <https://builds.apache.org/job/karaf-master/ws/jpa/hibernate/pom.xml>
to org.apache.karaf.jpa/hibernate/4.2.0-SNAPSHOT/hibernate-4.2.0-SNAPSHOT.pom
[JENKINS] Archiving <https://builds.apache.org/job/karaf-master/ws/jpa/hibernate/target/hibernate-4.2.0-SNAPSHOT.jar>
to org.apache.karaf.jpa/hibernate/4.2.0-20170510.120126-25/hibernate-4.2.0-20170510.120126-25.jar
No artifacts from karaf-master » Apache Karaf :: JPA :: Hibernate #4286 to compare, so performing
full copy of artifacts
[JENKINS] Archiving <https://builds.apache.org/job/karaf-master/ws/archetypes/pom.xml>
to org.apache.karaf/archetypes/4.2.0-SNAPSHOT/archetypes-4.2.0-SNAPSHOT.pom
No artifacts from karaf-master » Apache Karaf :: Archetypes #4286 to compare, so performing
full copy of artifacts
[JENKINS] Archiving <https://builds.apache.org/job/karaf-master/ws/demos/profiles/pom.xml>
to org.apache.karaf.demos.profiles/profiles/4.2.0-SNAPSHOT/profiles-4.2.0-SNAPSHOT.pom
No artifacts from karaf-master » Apache Karaf :: Demos :: Profiles #4286 to compare, so performing
full copy of artifacts
[JENKINS] Archiving <https://builds.apache.org/job/karaf-master/ws/assemblies/features/pom.xml>
to org.apache.karaf.assemblies.features/features/4.2.0-SNAPSHOT/features-4.2.0-SNAPSHOT.pom
No artifacts from karaf-master » Apache Karaf :: Assemblies :: Features #4286 to compare,
so performing full copy of artifacts
[JENKINS] Archiving <https://builds.apache.org/job/karaf-master/ws/features/core/pom.xml>
to org.apache.karaf.features/org.apache.karaf.features.core/4.2.0-SNAPSHOT/org.apache.karaf.features.core-4.2.0-SNAPSHOT.pom
[JENKINS] Archiving <https://builds.apache.org/job/karaf-master/ws/features/core/target/org.apache.karaf.features.core-4.2.0-SNAPSHOT.jar>
to org.apache.karaf.features/org.apache.karaf.features.core/4.2.0-20170510.114544-26/org.apache.karaf.features.core-4.2.0-20170510.114544-26.jar
No artifacts from karaf-master » Apache Karaf :: Features :: Core #4286 to compare, so performing
full copy of artifacts
[JENKINS] Archiving <https://builds.apache.org/job/karaf-master/ws/demos/profiles/dynamic/pom.xml>
to org.apache.karaf.demos.profiles/dynamic/4.2.0-SNAPSHOT/dynamic-4.2.0-SNAPSHOT.pom
[JENKINS] Archiving <https://builds.apache.org/job/karaf-master/ws/demos/profiles/dynamic/target/dynamic-4.2.0-SNAPSHOT.tar.gz>
to org.apache.karaf.demos.profiles/dynamic/4.2.0-20170510.121652-25/dynamic-4.2.0-20170510.121652-25.tar.gz
[JENKINS] Archiving <https://builds.apache.org/job/karaf-master/ws/demos/profiles/dynamic/target/dynamic-4.2.0-SNAPSHOT.zip>
to org.apache.karaf.demos.profiles/dynamic/4.2.0-20170510.121652-25/dynamic-4.2.0-20170510.121652-25.zip
No artifacts from karaf-master » Apache Karaf :: Demos :: Profiles :: Dynamic Assembly #4286
to compare, so performing full copy of artifacts
Build timed out (after 70 minutes). Marking the build as aborted.
ERROR: Failed to parse POMs
java.io.IOException: java.lang.InterruptedException
	at java.lang.Object.wait(Native Method)
	at hudson.remoting.FastPipedInputStream.read(FastPipedInputStream.java:175)
Caused: java.io.IOException
	at hudson.remoting.FastPipedInputStream.read(FastPipedInputStream.java:177)
	at hudson.util.HeadBufferingStream.read(HeadBufferingStream.java:61)
	at com.jcraft.jzlib.InflaterInputStream.fill(InflaterInputStream.java:175)
	at com.jcraft.jzlib.InflaterInputStream.read(InflaterInputStream.java:106)
	at org.apache.commons.compress.archivers.tar.TarArchiveInputStream.read(TarArchiveInputStream.java:614)
	at java.io.InputStream.read(InputStream.java:101)
	at org.apache.commons.io.IOUtils.copyLarge(IOUtils.java:1792)
	at org.apache.commons.io.IOUtils.copyLarge(IOUtils.java:1769)
	at org.apache.commons.io.IOUtils.copy(IOUtils.java:1744)
	at hudson.util.IOUtils.copy(IOUtils.java:40)
	at hudson.FilePath.readFromTar(FilePath.java:2279)
Caused: java.io.IOException: Failed to extract <https://builds.apache.org/job/karaf-master/ws/demos/profiles/dynamic/transfer>
of 3 files
	at hudson.FilePath.readFromTar(FilePath.java:2289)
	at hudson.FilePath.copyRecursiveTo(FilePath.java:2199)
	at jenkins.model.StandardArtifactManager.archive(StandardArtifactManager.java:61)
	at com.cloudbees.jenkins.plugins.jsync.archiver.JSyncArtifactManager.remoteSync(JSyncArtifactManager.java:128)
	at com.cloudbees.jenkins.plugins.jsync.archiver.JSyncArtifactManager.archive(JSyncArtifactManager.java:76)
	at hudson.maven.MavenBuild$ProxyImpl.performArchiving(MavenBuild.java:486)
	at hudson.maven.MavenModuleSetBuild$MavenModuleSetBuildExecution.doRun(MavenModuleSetBuild.java:875)
	at hudson.model.AbstractBuild$AbstractBuildExecution.run(AbstractBuild.java:534)
	at hudson.model.Run.execute(Run.java:1728)
	at hudson.maven.MavenModuleSetBuild.run(MavenModuleSetBuild.java:544)
	at hudson.model.ResourceController.execute(ResourceController.java:98)
	at hudson.model.Executor.run(Executor.java:405)

	at hudson.FilePath.copyRecursiveTo(FilePath.java:2206)
	at jenkins.model.StandardArtifactManager.archive(StandardArtifactManager.java:61)
	at com.cloudbees.jenkins.plugins.jsync.archiver.JSyncArtifactManager.remoteSync(JSyncArtifactManager.java:128)
	at com.cloudbees.jenkins.plugins.jsync.archiver.JSyncArtifactManager.archive(JSyncArtifactManager.java:76)
	at hudson.maven.MavenBuild$ProxyImpl.performArchiving(MavenBuild.java:486)
	at hudson.maven.MavenModuleSetBuild$MavenModuleSetBuildExecution.doRun(MavenModuleSetBuild.java:875)
	at hudson.model.AbstractBuild$AbstractBuildExecution.run(AbstractBuild.java:534)
	at hudson.model.Run.execute(Run.java:1728)
	at hudson.maven.MavenModuleSetBuild.run(MavenModuleSetBuild.java:544)
	at hudson.model.ResourceController.execute(ResourceController.java:98)
	at hudson.model.Executor.run(Executor.java:405)
Caused by: java.util.concurrent.ExecutionException: java.io.IOException: This archives contains
unclosed entries.
	at hudson.remoting.Channel$2.adapt(Channel.java:862)
	at hudson.remoting.Channel$2.adapt(Channel.java:857)
	at hudson.remoting.FutureAdapter.get(FutureAdapter.java:59)
	at hudson.FilePath.copyRecursiveTo(FilePath.java:2202)
	... 10 more
Caused by: java.io.IOException: This archives contains unclosed entries.
	at org.apache.commons.compress.archivers.tar.TarArchiveOutputStream.finish(TarArchiveOutputStream.java:225)
	at org.apache.commons.compress.archivers.tar.TarArchiveOutputStream.close(TarArchiveOutputStream.java:241)
	at hudson.util.io.TarArchiver.close(TarArchiver.java:121)
	at hudson.FilePath.writeToTar(FilePath.java:2253)
	at hudson.FilePath.access$2100(FilePath.java:195)
	at hudson.FilePath$45.invoke(FilePath.java:2194)
	at hudson.FilePath$45.invoke(FilePath.java:2190)
	at hudson.FilePath$FileCallableWrapper.call(FilePath.java:2731)
	at hudson.remoting.UserRequest.perform(UserRequest.java:153)
	at hudson.remoting.UserRequest.perform(UserRequest.java:50)
	at hudson.remoting.Request$2.run(Request.java:336)
	at hudson.remoting.InterceptingExecutorService$1.call(InterceptingExecutorService.java:68)
	at java.util.concurrent.FutureTask.run(FutureTask.java:262)
	at java.util.concurrent.ThreadPoolExecutor.runWorker(ThreadPoolExecutor.java:1145)
	at java.util.concurrent.ThreadPoolExecutor$Worker.run(ThreadPoolExecutor.java:615)
	at java.lang.Thread.run(Thread.java:745)
	at ......remote call to ubuntu-6(Native Method)
	at hudson.remoting.Channel.attachCallSiteStackTrace(Channel.java:1545)
	at hudson.remoting.UserResponse.retrieve(UserRequest.java:253)
	at hudson.remoting.Channel$2.adapt(Channel.java:860)
	... 13 more
channel stopped
Not sending mail to unregistered user ancosen@gmail.com

Mime
View raw message