karaf-commits mailing list archives

Site index · List index
Message view « Date » · « Thread »
Top « Date » · « Thread »
From Apache Jenkins Server <jenk...@builds.apache.org>
Subject Build failed in Jenkins: karaf-4.0.x » Apache Karaf :: Assemblies :: Features :: Spring #306
Date Sun, 22 Jan 2017 22:39:17 GMT
See <https://builds.apache.org/job/karaf-4.0.x/org.apache.karaf.features$spring/306/>

------------------------------------------
[...truncated 258 lines...]
	at java.util.concurrent.ScheduledThreadPoolExecutor$ScheduledFutureTask.access$201(ScheduledThreadPoolExecutor.java:180)
	at java.util.concurrent.ScheduledThreadPoolExecutor$ScheduledFutureTask.run(ScheduledThreadPoolExecutor.java:293)
	at java.util.concurrent.ThreadPoolExecutor.runWorker(ThreadPoolExecutor.java:1142)
	at java.util.concurrent.ThreadPoolExecutor$Worker.run(ThreadPoolExecutor.java:617)
	at java.lang.Thread.run(Thread.java:745)
	Suppressed: shaded.org.eclipse.aether.transfer.ArtifactNotFoundException: Could not find
artifact org.apache.servicemix.bundles:org.apache.servicemix.bundles.spring-aspects:jar:3.2.18.RELEASE_1
in servicemix (http://svn.apache.org/repos/asf/servicemix/m2-repo/)
		at shaded.org.eclipse.aether.connector.basic.ArtifactTransportListener.transferFailed(ArtifactTransportListener.java:39)
		at shaded.org.eclipse.aether.connector.basic.BasicRepositoryConnector$TaskRunner.run(BasicRepositoryConnector.java:355)
		at shaded.org.eclipse.aether.util.concurrency.RunnableErrorForwarder$1.run(RunnableErrorForwarder.java:67)
		at shaded.org.eclipse.aether.connector.basic.BasicRepositoryConnector$DirectExecutor.execute(BasicRepositoryConnector.java:581)
		at shaded.org.eclipse.aether.connector.basic.BasicRepositoryConnector.get(BasicRepositoryConnector.java:249)
		at shaded.org.eclipse.aether.internal.impl.DefaultArtifactResolver.performDownloads(DefaultArtifactResolver.java:520)
		at shaded.org.eclipse.aether.internal.impl.DefaultArtifactResolver.resolve(DefaultArtifactResolver.java:421)
		at shaded.org.eclipse.aether.internal.impl.DefaultArtifactResolver.resolveArtifacts(DefaultArtifactResolver.java:246)
		at shaded.org.eclipse.aether.internal.impl.DefaultArtifactResolver.resolveArtifact(DefaultArtifactResolver.java:223)
		at shaded.org.eclipse.aether.internal.impl.DefaultRepositorySystem.resolveArtifact(DefaultRepositorySystem.java:294)
		at org.ops4j.pax.url.mvn.internal.AetherBasedResolver.resolve(AetherBasedResolver.java:705)
		... 12 more
	Suppressed: shaded.org.eclipse.aether.transfer.ArtifactNotFoundException: Could not find
artifact org.apache.servicemix.bundles:org.apache.servicemix.bundles.spring-aspects:jar:3.2.18.RELEASE_1
in zodiac-repository (http://repository.springsource.com/maven/bundles/release/)
		at shaded.org.eclipse.aether.connector.basic.ArtifactTransportListener.transferFailed(ArtifactTransportListener.java:39)
		at shaded.org.eclipse.aether.connector.basic.BasicRepositoryConnector$TaskRunner.run(BasicRepositoryConnector.java:355)
		at shaded.org.eclipse.aether.util.concurrency.RunnableErrorForwarder$1.run(RunnableErrorForwarder.java:67)
		at shaded.org.eclipse.aether.connector.basic.BasicRepositoryConnector$DirectExecutor.execute(BasicRepositoryConnector.java:581)
		at shaded.org.eclipse.aether.connector.basic.BasicRepositoryConnector.get(BasicRepositoryConnector.java:249)
		at shaded.org.eclipse.aether.internal.impl.DefaultArtifactResolver.performDownloads(DefaultArtifactResolver.java:520)
		at shaded.org.eclipse.aether.internal.impl.DefaultArtifactResolver.resolve(DefaultArtifactResolver.java:421)
		at shaded.org.eclipse.aether.internal.impl.DefaultArtifactResolver.resolveArtifacts(DefaultArtifactResolver.java:246)
		at shaded.org.eclipse.aether.internal.impl.DefaultArtifactResolver.resolveArtifact(DefaultArtifactResolver.java:223)
		at shaded.org.eclipse.aether.internal.impl.DefaultRepositorySystem.resolveArtifact(DefaultRepositorySystem.java:294)
		at org.ops4j.pax.url.mvn.internal.AetherBasedResolver.resolve(AetherBasedResolver.java:705)
		... 12 more
	Suppressed: shaded.org.eclipse.aether.transfer.ArtifactNotFoundException: Could not find
artifact org.apache.servicemix.bundles:org.apache.servicemix.bundles.spring-aspects:jar:3.2.18.RELEASE_1
in spring-ebr-repository (http://repository.springsource.com/maven/bundles/external/)
		at shaded.org.eclipse.aether.connector.basic.ArtifactTransportListener.transferFailed(ArtifactTransportListener.java:39)
		at shaded.org.eclipse.aether.connector.basic.BasicRepositoryConnector$TaskRunner.run(BasicRepositoryConnector.java:355)
		at shaded.org.eclipse.aether.util.concurrency.RunnableErrorForwarder$1.run(RunnableErrorForwarder.java:67)
		at shaded.org.eclipse.aether.connector.basic.BasicRepositoryConnector$DirectExecutor.execute(BasicRepositoryConnector.java:581)
		at shaded.org.eclipse.aether.connector.basic.BasicRepositoryConnector.get(BasicRepositoryConnector.java:249)
		at shaded.org.eclipse.aether.internal.impl.DefaultArtifactResolver.performDownloads(DefaultArtifactResolver.java:520)
		at shaded.org.eclipse.aether.internal.impl.DefaultArtifactResolver.resolve(DefaultArtifactResolver.java:421)
		at shaded.org.eclipse.aether.internal.impl.DefaultArtifactResolver.resolveArtifacts(DefaultArtifactResolver.java:246)
		at shaded.org.eclipse.aether.internal.impl.DefaultArtifactResolver.resolveArtifact(DefaultArtifactResolver.java:223)
		at shaded.org.eclipse.aether.internal.impl.DefaultRepositorySystem.resolveArtifact(DefaultRepositorySystem.java:294)
		at org.ops4j.pax.url.mvn.internal.AetherBasedResolver.resolve(AetherBasedResolver.java:705)
		... 12 more
	Suppressed: shaded.org.eclipse.aether.transfer.ArtifactNotFoundException: Could not find
artifact org.apache.servicemix.bundles:org.apache.servicemix.bundles.spring-aspects:jar:3.2.18.RELEASE_1
in central (https://repo.maven.apache.org/maven2/)
		at shaded.org.eclipse.aether.connector.basic.ArtifactTransportListener.transferFailed(ArtifactTransportListener.java:39)
		at shaded.org.eclipse.aether.connector.basic.BasicRepositoryConnector$TaskRunner.run(BasicRepositoryConnector.java:355)
		at shaded.org.eclipse.aether.util.concurrency.RunnableErrorForwarder$1.run(RunnableErrorForwarder.java:67)
		at shaded.org.eclipse.aether.connector.basic.BasicRepositoryConnector$DirectExecutor.execute(BasicRepositoryConnector.java:581)
		at shaded.org.eclipse.aether.connector.basic.BasicRepositoryConnector.get(BasicRepositoryConnector.java:249)
		at shaded.org.eclipse.aether.internal.impl.DefaultArtifactResolver.performDownloads(DefaultArtifactResolver.java:520)
		at shaded.org.eclipse.aether.internal.impl.DefaultArtifactResolver.resolve(DefaultArtifactResolver.java:421)
		at shaded.org.eclipse.aether.internal.impl.DefaultArtifactResolver.resolveArtifacts(DefaultArtifactResolver.java:246)
		at shaded.org.eclipse.aether.internal.impl.DefaultArtifactResolver.resolveArtifact(DefaultArtifactResolver.java:223)
		at shaded.org.eclipse.aether.internal.impl.DefaultRepositorySystem.resolveArtifact(DefaultRepositorySystem.java:294)
		at org.ops4j.pax.url.mvn.internal.AetherBasedResolver.resolve(AetherBasedResolver.java:705)
		... 12 more
Caused by: shaded.org.eclipse.aether.resolution.ArtifactResolutionException: Error resolving
artifact org.apache.servicemix.bundles:org.apache.servicemix.bundles.spring-aspects:jar:3.2.18.RELEASE_1
	at shaded.org.eclipse.aether.internal.impl.DefaultArtifactResolver.resolve(DefaultArtifactResolver.java:444)
	at shaded.org.eclipse.aether.internal.impl.DefaultArtifactResolver.resolveArtifacts(DefaultArtifactResolver.java:246)
	at shaded.org.eclipse.aether.internal.impl.DefaultArtifactResolver.resolveArtifact(DefaultArtifactResolver.java:223)
	at shaded.org.eclipse.aether.internal.impl.DefaultRepositorySystem.resolveArtifact(DefaultRepositorySystem.java:294)
	at org.ops4j.pax.url.mvn.internal.AetherBasedResolver.resolve(AetherBasedResolver.java:705)
	... 12 more
[WARNING] 
org.apache.maven.plugin.MojoExecutionException: Feature resolution failed for [spring-aspects/3.2.18.RELEASE_1]
Message: Error
Repositories: {
	<https://builds.apache.org/job/karaf-4.0.x/org.apache.karaf.features$spring/ws/target/feature/feature.xml>
	mvn:org.apache.karaf.features/framework/4.0.9-SNAPSHOT/xml/features
	mvn:org.apache.karaf.features/standard/4.0.9-SNAPSHOT/xml/features
	mvn:org.ops4j.pax.web/pax-web-features/4.3.0/xml/features
}
Resources: {
	mvn:org.apache.felix/org.apache.felix.configadmin/1.8.12
	mvn:org.apache.felix/org.apache.felix.fileinstall/3.5.6
	mvn:org.apache.karaf.features/org.apache.karaf.features.core/4.0.9-SNAPSHOT
	mvn:org.apache.servicemix.bundles/org.apache.servicemix.bundles.spring-aspects/3.2.18.RELEASE_1
	mvn:org.ops4j.pax.logging/pax-logging-api/1.8.5
	mvn:org.ops4j.pax.logging/pax-logging-service/1.8.5
	mvn:org.ops4j.pax.url/pax-url-aether/2.5.2
}
	at org.apache.karaf.tooling.VerifyMojo.verifyResolution(VerifyMojo.java:413)
	at org.apache.karaf.tooling.VerifyMojo.doExecute(VerifyMojo.java:292)
	at org.apache.karaf.tooling.VerifyMojo.execute(VerifyMojo.java:175)
	at org.apache.maven.plugin.DefaultBuildPluginManager.executeMojo(DefaultBuildPluginManager.java:134)
	at org.apache.maven.lifecycle.internal.MojoExecutor.execute(MojoExecutor.java:208)
	at org.apache.maven.lifecycle.internal.MojoExecutor.execute(MojoExecutor.java:153)
	at org.apache.maven.lifecycle.internal.MojoExecutor.execute(MojoExecutor.java:145)
	at org.apache.maven.lifecycle.internal.LifecycleModuleBuilder.buildProject(LifecycleModuleBuilder.java:116)
	at org.apache.maven.lifecycle.internal.LifecycleModuleBuilder.buildProject(LifecycleModuleBuilder.java:80)
	at org.apache.maven.lifecycle.internal.builder.singlethreaded.SingleThreadedBuilder.build(SingleThreadedBuilder.java:51)
	at org.apache.maven.lifecycle.internal.LifecycleStarter.execute(LifecycleStarter.java:128)
	at org.apache.maven.DefaultMaven.doExecute(DefaultMaven.java:307)
	at org.apache.maven.DefaultMaven.doExecute(DefaultMaven.java:193)
	at org.apache.maven.DefaultMaven.execute(DefaultMaven.java:106)
	at org.jvnet.hudson.maven3.launcher.Maven32Launcher.main(Maven32Launcher.java:132)
	at sun.reflect.NativeMethodAccessorImpl.invoke0(Native Method)
	at sun.reflect.NativeMethodAccessorImpl.invoke(NativeMethodAccessorImpl.java:62)
	at sun.reflect.DelegatingMethodAccessorImpl.invoke(DelegatingMethodAccessorImpl.java:43)
	at java.lang.reflect.Method.invoke(Method.java:498)
	at org.codehaus.plexus.classworlds.launcher.Launcher.launchStandard(Launcher.java:330)
	at org.codehaus.plexus.classworlds.launcher.Launcher.launch(Launcher.java:238)
	at jenkins.maven3.agent.Maven32Main.launch(Maven32Main.java:186)
	at sun.reflect.NativeMethodAccessorImpl.invoke0(Native Method)
	at sun.reflect.NativeMethodAccessorImpl.invoke(NativeMethodAccessorImpl.java:62)
	at sun.reflect.DelegatingMethodAccessorImpl.invoke(DelegatingMethodAccessorImpl.java:43)
	at java.lang.reflect.Method.invoke(Method.java:498)
	at hudson.maven.Maven3Builder.call(Maven3Builder.java:136)
	at hudson.maven.Maven3Builder.call(Maven3Builder.java:71)
	at hudson.remoting.UserRequest.perform(UserRequest.java:153)
	at hudson.remoting.UserRequest.perform(UserRequest.java:50)
	at hudson.remoting.Request$2.run(Request.java:332)
	at hudson.remoting.InterceptingExecutorService$1.call(InterceptingExecutorService.java:68)
	at java.util.concurrent.FutureTask.run(FutureTask.java:266)
	at java.util.concurrent.ThreadPoolExecutor.runWorker(ThreadPoolExecutor.java:1142)
	at java.util.concurrent.ThreadPoolExecutor$Worker.run(ThreadPoolExecutor.java:617)
	at java.lang.Thread.run(Thread.java:745)
Caused by: org.apache.karaf.features.internal.util.MultiException: Error
	at org.apache.karaf.features.internal.download.impl.MavenDownloadManager$MavenDownloader.<init>(MavenDownloadManager.java:84)
	at org.apache.karaf.features.internal.download.impl.MavenDownloadManager.createDownloader(MavenDownloadManager.java:72)
	at org.apache.karaf.features.internal.region.Subsystem.downloadBundles(Subsystem.java:363)
	at org.apache.karaf.features.internal.region.Subsystem.downloadBundles(Subsystem.java:360)
	at org.apache.karaf.features.internal.region.SubsystemResolver.resolve(SubsystemResolver.java:187)
	at org.apache.karaf.features.internal.service.Deployer.deploy(Deployer.java:263)
	at org.apache.karaf.tooling.VerifyMojo.verifyResolution(VerifyMojo.java:398)
	... 35 more
	Suppressed: java.io.IOException: Error downloading mvn:org.apache.servicemix.bundles/org.apache.servicemix.bundles.spring-aspects/3.2.18.RELEASE_1
		at org.apache.karaf.features.internal.download.impl.AbstractRetryableDownloadTask.run(AbstractRetryableDownloadTask.java:77)
		at java.util.concurrent.Executors$RunnableAdapter.call(Executors.java:511)
		at java.util.concurrent.FutureTask.run(FutureTask.java:266)
		at java.util.concurrent.ScheduledThreadPoolExecutor$ScheduledFutureTask.access$201(ScheduledThreadPoolExecutor.java:180)
		at java.util.concurrent.ScheduledThreadPoolExecutor$ScheduledFutureTask.run(ScheduledThreadPoolExecutor.java:293)
		... 3 more
	Caused by: java.io.IOException: Error resolving artifact org.apache.servicemix.bundles:org.apache.servicemix.bundles.spring-aspects:jar:3.2.18.RELEASE_1:
[Could not find artifact org.apache.servicemix.bundles:org.apache.servicemix.bundles.spring-aspects:jar:3.2.18.RELEASE_1
in servicemix (http://svn.apache.org/repos/asf/servicemix/m2-repo/), Could not find artifact
org.apache.servicemix.bundles:org.apache.servicemix.bundles.spring-aspects:jar:3.2.18.RELEASE_1
in zodiac-repository (http://repository.springsource.com/maven/bundles/release/), Could not
find artifact org.apache.servicemix.bundles:org.apache.servicemix.bundles.spring-aspects:jar:3.2.18.RELEASE_1
in spring-ebr-repository (http://repository.springsource.com/maven/bundles/external/), Could
not find artifact org.apache.servicemix.bundles:org.apache.servicemix.bundles.spring-aspects:jar:3.2.18.RELEASE_1
in central (https://repo.maven.apache.org/maven2/)]
		at org.ops4j.pax.url.mvn.internal.AetherBasedResolver.resolve(AetherBasedResolver.java:720)
		at org.ops4j.pax.url.mvn.internal.AetherBasedResolver.resolve(AetherBasedResolver.java:659)
		at org.ops4j.pax.url.mvn.internal.AetherBasedResolver.resolve(AetherBasedResolver.java:600)
		at org.ops4j.pax.url.mvn.internal.AetherBasedResolver.resolve(AetherBasedResolver.java:567)
		at org.apache.karaf.features.internal.download.impl.MavenDownloadTask.download(MavenDownloadTask.java:36)
		at org.apache.karaf.features.internal.download.impl.AbstractRetryableDownloadTask.run(AbstractRetryableDownloadTask.java:60)
		... 7 more
		Suppressed: shaded.org.eclipse.aether.transfer.ArtifactNotFoundException: Could not find
artifact org.apache.servicemix.bundles:org.apache.servicemix.bundles.spring-aspects:jar:3.2.18.RELEASE_1
in servicemix (http://svn.apache.org/repos/asf/servicemix/m2-repo/)
			at shaded.org.eclipse.aether.connector.basic.ArtifactTransportListener.transferFailed(ArtifactTransportListener.java:39)
			at shaded.org.eclipse.aether.connector.basic.BasicRepositoryConnector$TaskRunner.run(BasicRepositoryConnector.java:355)
			at shaded.org.eclipse.aether.util.concurrency.RunnableErrorForwarder$1.run(RunnableErrorForwarder.java:67)
			at shaded.org.eclipse.aether.connector.basic.BasicRepositoryConnector$DirectExecutor.execute(BasicRepositoryConnector.java:581)
			at shaded.org.eclipse.aether.connector.basic.BasicRepositoryConnector.get(BasicRepositoryConnector.java:249)
			at shaded.org.eclipse.aether.internal.impl.DefaultArtifactResolver.performDownloads(DefaultArtifactResolver.java:520)
			at shaded.org.eclipse.aether.internal.impl.DefaultArtifactResolver.resolve(DefaultArtifactResolver.java:421)
			at shaded.org.eclipse.aether.internal.impl.DefaultArtifactResolver.resolveArtifacts(DefaultArtifactResolver.java:246)
			at shaded.org.eclipse.aether.internal.impl.DefaultArtifactResolver.resolveArtifact(DefaultArtifactResolver.java:223)
			at shaded.org.eclipse.aether.internal.impl.DefaultRepositorySystem.resolveArtifact(DefaultRepositorySystem.java:294)
			at org.ops4j.pax.url.mvn.internal.AetherBasedResolver.resolve(AetherBasedResolver.java:705)
			... 12 more
		Suppressed: shaded.org.eclipse.aether.transfer.ArtifactNotFoundException: Could not find
artifact org.apache.servicemix.bundles:org.apache.servicemix.bundles.spring-aspects:jar:3.2.18.RELEASE_1
in zodiac-repository (http://repository.springsource.com/maven/bundles/release/)
			at shaded.org.eclipse.aether.connector.basic.ArtifactTransportListener.transferFailed(ArtifactTransportListener.java:39)
			at shaded.org.eclipse.aether.connector.basic.BasicRepositoryConnector$TaskRunner.run(BasicRepositoryConnector.java:355)
			at shaded.org.eclipse.aether.util.concurrency.RunnableErrorForwarder$1.run(RunnableErrorForwarder.java:67)
			at shaded.org.eclipse.aether.connector.basic.BasicRepositoryConnector$DirectExecutor.execute(BasicRepositoryConnector.java:581)
			at shaded.org.eclipse.aether.connector.basic.BasicRepositoryConnector.get(BasicRepositoryConnector.java:249)
			at shaded.org.eclipse.aether.internal.impl.DefaultArtifactResolver.performDownloads(DefaultArtifactResolver.java:520)
			at shaded.org.eclipse.aether.internal.impl.DefaultArtifactResolver.resolve(DefaultArtifactResolver.java:421)
			at shaded.org.eclipse.aether.internal.impl.DefaultArtifactResolver.resolveArtifacts(DefaultArtifactResolver.java:246)
			at shaded.org.eclipse.aether.internal.impl.DefaultArtifactResolver.resolveArtifact(DefaultArtifactResolver.java:223)
			at shaded.org.eclipse.aether.internal.impl.DefaultRepositorySystem.resolveArtifact(DefaultRepositorySystem.java:294)
			at org.ops4j.pax.url.mvn.internal.AetherBasedResolver.resolve(AetherBasedResolver.java:705)
			... 12 more
		Suppressed: shaded.org.eclipse.aether.transfer.ArtifactNotFoundException: Could not find
artifact org.apache.servicemix.bundles:org.apache.servicemix.bundles.spring-aspects:jar:3.2.18.RELEASE_1
in spring-ebr-repository (http://repository.springsource.com/maven/bundles/external/)
			at shaded.org.eclipse.aether.connector.basic.ArtifactTransportListener.transferFailed(ArtifactTransportListener.java:39)
			at shaded.org.eclipse.aether.connector.basic.BasicRepositoryConnector$TaskRunner.run(BasicRepositoryConnector.java:355)
			at shaded.org.eclipse.aether.util.concurrency.RunnableErrorForwarder$1.run(RunnableErrorForwarder.java:67)
			at shaded.org.eclipse.aether.connector.basic.BasicRepositoryConnector$DirectExecutor.execute(BasicRepositoryConnector.java:581)
			at shaded.org.eclipse.aether.connector.basic.BasicRepositoryConnector.get(BasicRepositoryConnector.java:249)
			at shaded.org.eclipse.aether.internal.impl.DefaultArtifactResolver.performDownloads(DefaultArtifactResolver.java:520)
			at shaded.org.eclipse.aether.internal.impl.DefaultArtifactResolver.resolve(DefaultArtifactResolver.java:421)
			at shaded.org.eclipse.aether.internal.impl.DefaultArtifactResolver.resolveArtifacts(DefaultArtifactResolver.java:246)
			at shaded.org.eclipse.aether.internal.impl.DefaultArtifactResolver.resolveArtifact(DefaultArtifactResolver.java:223)
			at shaded.org.eclipse.aether.internal.impl.DefaultRepositorySystem.resolveArtifact(DefaultRepositorySystem.java:294)
			at org.ops4j.pax.url.mvn.internal.AetherBasedResolver.resolve(AetherBasedResolver.java:705)
			... 12 more
		Suppressed: shaded.org.eclipse.aether.transfer.ArtifactNotFoundException: Could not find
artifact org.apache.servicemix.bundles:org.apache.servicemix.bundles.spring-aspects:jar:3.2.18.RELEASE_1
in central (https://repo.maven.apache.org/maven2/)
			at shaded.org.eclipse.aether.connector.basic.ArtifactTransportListener.transferFailed(ArtifactTransportListener.java:39)
			at shaded.org.eclipse.aether.connector.basic.BasicRepositoryConnector$TaskRunner.run(BasicRepositoryConnector.java:355)
			at shaded.org.eclipse.aether.util.concurrency.RunnableErrorForwarder$1.run(RunnableErrorForwarder.java:67)
			at shaded.org.eclipse.aether.connector.basic.BasicRepositoryConnector$DirectExecutor.execute(BasicRepositoryConnector.java:581)
			at shaded.org.eclipse.aether.connector.basic.BasicRepositoryConnector.get(BasicRepositoryConnector.java:249)
			at shaded.org.eclipse.aether.internal.impl.DefaultArtifactResolver.performDownloads(DefaultArtifactResolver.java:520)
			at shaded.org.eclipse.aether.internal.impl.DefaultArtifactResolver.resolve(DefaultArtifactResolver.java:421)
			at shaded.org.eclipse.aether.internal.impl.DefaultArtifactResolver.resolveArtifacts(DefaultArtifactResolver.java:246)
			at shaded.org.eclipse.aether.internal.impl.DefaultArtifactResolver.resolveArtifact(DefaultArtifactResolver.java:223)
			at shaded.org.eclipse.aether.internal.impl.DefaultRepositorySystem.resolveArtifact(DefaultRepositorySystem.java:294)
			at org.ops4j.pax.url.mvn.internal.AetherBasedResolver.resolve(AetherBasedResolver.java:705)
			... 12 more
	Caused by: shaded.org.eclipse.aether.resolution.ArtifactResolutionException: Error resolving
artifact org.apache.servicemix.bundles:org.apache.servicemix.bundles.spring-aspects:jar:3.2.18.RELEASE_1
		at shaded.org.eclipse.aether.internal.impl.DefaultArtifactResolver.resolve(DefaultArtifactResolver.java:444)
		at shaded.org.eclipse.aether.internal.impl.DefaultArtifactResolver.resolveArtifacts(DefaultArtifactResolver.java:246)
		at shaded.org.eclipse.aether.internal.impl.DefaultArtifactResolver.resolveArtifact(DefaultArtifactResolver.java:223)
		at shaded.org.eclipse.aether.internal.impl.DefaultRepositorySystem.resolveArtifact(DefaultRepositorySystem.java:294)
		at org.ops4j.pax.url.mvn.internal.AetherBasedResolver.resolve(AetherBasedResolver.java:705)
		... 12 more
[INFO] Verification of feature spring-instrument/3.2.18.RELEASE_1 succeeded
[INFO] Verification of feature spring-jdbc/3.2.18.RELEASE_1 succeeded
[INFO] Verification of feature spring-jms/3.2.18.RELEASE_1 succeeded
[INFO] Verification of feature spring-struts/3.2.18.RELEASE_1 succeeded
[INFO] Verification of feature spring-test/3.2.18.RELEASE_1 succeeded
[INFO] Verification of feature spring-orm/3.2.18.RELEASE_1 succeeded
[INFO] Verification of feature spring-oxm/3.2.18.RELEASE_1 succeeded
[INFO] Verification of feature spring-tx/3.2.18.RELEASE_1 succeeded
[INFO] Verification of feature spring-web/3.2.18.RELEASE_1 succeeded
[INFO] Verification of feature spring-web-portlet/3.2.18.RELEASE_1 succeeded
[INFO] Verification of feature spring/4.0.7.RELEASE_3 succeeded
[INFO] Verification of feature spring-aspects/4.0.7.RELEASE_3 succeeded
[INFO] Verification of feature spring-instrument/4.0.7.RELEASE_3 succeeded
[INFO] Verification of feature spring-jdbc/4.0.7.RELEASE_3 succeeded
[INFO] Verification of feature spring-jms/4.0.7.RELEASE_3 succeeded
[INFO] Verification of feature spring-test/4.0.7.RELEASE_3 succeeded
[INFO] Verification of feature spring-orm/4.0.7.RELEASE_3 succeeded
[INFO] Verification of feature spring-oxm/4.0.7.RELEASE_3 succeeded
[INFO] Verification of feature spring-tx/4.0.7.RELEASE_3 succeeded
[INFO] Verification of feature spring-web/4.0.7.RELEASE_3 succeeded
[INFO] Verification of feature spring-web-portlet/4.0.7.RELEASE_3 succeeded
[INFO] Verification of feature spring-websocket/4.0.7.RELEASE_3 succeeded
[INFO] Verification of feature spring/4.1.9.RELEASE_1 succeeded
[INFO] Verification of feature spring-aspects/4.1.9.RELEASE_1 succeeded
[INFO] Verification of feature spring-instrument/4.1.9.RELEASE_1 succeeded
[INFO] Verification of feature spring-jdbc/4.1.9.RELEASE_1 succeeded
[INFO] Verification of feature spring-jms/4.1.9.RELEASE_1 succeeded
[INFO] Verification of feature spring-test/4.1.9.RELEASE_1 succeeded
[INFO] Verification of feature spring-orm/4.1.9.RELEASE_1 succeeded
[INFO] Verification of feature spring-oxm/4.1.9.RELEASE_1 succeeded
[INFO] Verification of feature spring-tx/4.1.9.RELEASE_1 succeeded
[INFO] Verification of feature spring-web/4.1.9.RELEASE_1 succeeded
[INFO] Verification of feature spring-web-portlet/4.1.9.RELEASE_1 succeeded
[INFO] Verification of feature spring-websocket/4.1.9.RELEASE_1 succeeded
[INFO] Verification of feature spring/4.2.9.RELEASE_1 succeeded
[INFO] Verification of feature spring-aspects/4.2.9.RELEASE_1 succeeded
[INFO] Verification of feature spring-instrument/4.2.9.RELEASE_1 succeeded
[INFO] Verification of feature spring-jdbc/4.2.9.RELEASE_1 succeeded
[INFO] Verification of feature spring-jms/4.2.9.RELEASE_1 succeeded
[INFO] Verification of feature spring-test/4.2.9.RELEASE_1 succeeded
[INFO] Verification of feature spring-orm/4.2.9.RELEASE_1 succeeded
[INFO] Verification of feature spring-oxm/4.2.9.RELEASE_1 succeeded
[INFO] Verification of feature spring-tx/4.2.9.RELEASE_1 succeeded
[INFO] Verification of feature spring-web/4.2.9.RELEASE_1 succeeded
[INFO] Verification of feature spring-web-portlet/4.2.9.RELEASE_1 succeeded
[INFO] Verification of feature spring-websocket/4.2.9.RELEASE_1 succeeded
[INFO] Verification of feature spring-security/3.1.4.RELEASE succeeded
[INFO] Verification of feature gemini-blueprint/1.0.2.RELEASE succeeded

Mime
View raw message