karaf-commits mailing list archives

Site index · List index
Message view « Date » · « Thread »
Top « Date » · « Thread »
From Apache Jenkins Server <jenk...@builds.apache.org>
Subject Build failed in Jenkins: karaf-4.0.x #284
Date Fri, 09 Dec 2016 15:37:02 GMT
See <https://builds.apache.org/job/karaf-4.0.x/284/changes>

Changes:

[chris] Add feature repo for brave

------------------------------------------
[...truncated 24262 lines...]
Results :

Tests run: 193, Failures: 0, Errors: 0, Skipped: 4

[JENKINS] Recording test results
[INFO] 
[INFO] --- maven-jar-plugin:2.6:jar (default-jar) @ itests ---
[INFO] Building jar: <https://builds.apache.org/job/karaf-4.0.x/ws/itests/target/itests-4.0.8-SNAPSHOT.jar>
[INFO] 
[INFO] --- maven-site-plugin:3.5:attach-descriptor (attach-descriptor) @ itests ---
[INFO] 
[INFO] --- maven-jar-plugin:2.6:test-jar (jar-test-classes) @ itests ---
[INFO] Building jar: <https://builds.apache.org/job/karaf-4.0.x/ws/itests/target/itests-4.0.8-SNAPSHOT-tests.jar>
[INFO] 
[INFO] --- maven-install-plugin:2.5.2:install (default-install) @ itests ---
[INFO] Installing <https://builds.apache.org/job/karaf-4.0.x/ws/itests/target/itests-4.0.8-SNAPSHOT.jar>
to /home/jenkins/jenkins-slave/maven-repositories/0/org/apache/karaf/itests/itests/4.0.8-SNAPSHOT/itests-4.0.8-SNAPSHOT.jar
[INFO] Installing <https://builds.apache.org/job/karaf-4.0.x/ws/itests/pom.xml> to /home/jenkins/jenkins-slave/maven-repositories/0/org/apache/karaf/itests/itests/4.0.8-SNAPSHOT/itests-4.0.8-SNAPSHOT.pom
[INFO] Installing <https://builds.apache.org/job/karaf-4.0.x/ws/itests/target/itests-4.0.8-SNAPSHOT-tests.jar>
to /home/jenkins/jenkins-slave/maven-repositories/0/org/apache/karaf/itests/itests/4.0.8-SNAPSHOT/itests-4.0.8-SNAPSHOT-tests.jar
[INFO] 
[INFO] --- maven-deploy-plugin:2.8.2:deploy (default-deploy) @ itests ---
[INFO] Downloading: https://repository.apache.org/content/repositories/snapshots/org/apache/karaf/itests/itests/4.0.8-SNAPSHOT/maven-metadata.xml
[INFO] Downloaded: https://repository.apache.org/content/repositories/snapshots/org/apache/karaf/itests/itests/4.0.8-SNAPSHOT/maven-metadata.xml
(995 B at 1.5 KB/sec)
[INFO] Uploading: https://repository.apache.org/content/repositories/snapshots/org/apache/karaf/itests/itests/4.0.8-SNAPSHOT/itests-4.0.8-20161209.150840-41.jar
[INFO] Uploaded: https://repository.apache.org/content/repositories/snapshots/org/apache/karaf/itests/itests/4.0.8-SNAPSHOT/itests-4.0.8-20161209.150840-41.jar
(10 KB at 12.1 KB/sec)
[INFO] Uploading: https://repository.apache.org/content/repositories/snapshots/org/apache/karaf/itests/itests/4.0.8-SNAPSHOT/itests-4.0.8-20161209.150840-41.pom
[INFO] Uploaded: https://repository.apache.org/content/repositories/snapshots/org/apache/karaf/itests/itests/4.0.8-SNAPSHOT/itests-4.0.8-20161209.150840-41.pom
(8 KB at 9.5 KB/sec)
[INFO] Downloading: https://repository.apache.org/content/repositories/snapshots/org/apache/karaf/itests/itests/maven-metadata.xml
[INFO] Downloaded: https://repository.apache.org/content/repositories/snapshots/org/apache/karaf/itests/itests/maven-metadata.xml
(633 B at 0.9 KB/sec)
[INFO] Uploading: https://repository.apache.org/content/repositories/snapshots/org/apache/karaf/itests/itests/4.0.8-SNAPSHOT/maven-metadata.xml
[INFO] Uploaded: https://repository.apache.org/content/repositories/snapshots/org/apache/karaf/itests/itests/4.0.8-SNAPSHOT/maven-metadata.xml
(995 B at 1.2 KB/sec)
[INFO] Uploading: https://repository.apache.org/content/repositories/snapshots/org/apache/karaf/itests/itests/maven-metadata.xml
[INFO] Uploaded: https://repository.apache.org/content/repositories/snapshots/org/apache/karaf/itests/itests/maven-metadata.xml
(633 B at 0.8 KB/sec)
[INFO] Uploading: https://repository.apache.org/content/repositories/snapshots/org/apache/karaf/itests/itests/4.0.8-SNAPSHOT/itests-4.0.8-20161209.150840-41-tests.jar
[INFO] Uploaded: https://repository.apache.org/content/repositories/snapshots/org/apache/karaf/itests/itests/4.0.8-SNAPSHOT/itests-4.0.8-20161209.150840-41-tests.jar
(110 KB at 106.2 KB/sec)
[INFO] Uploading: https://repository.apache.org/content/repositories/snapshots/org/apache/karaf/itests/itests/4.0.8-SNAPSHOT/maven-metadata.xml
[INFO] Uploaded: https://repository.apache.org/content/repositories/snapshots/org/apache/karaf/itests/itests/4.0.8-SNAPSHOT/maven-metadata.xml
(995 B at 1.2 KB/sec)
[INFO] ------------------------------------------------------------------------
[INFO] Reactor Summary:
[INFO] 
[INFO] Apache Karaf ....................................... SUCCESS [  9.009 s]
[INFO] Apache Karaf :: JAAS ............................... SUCCESS [ 14.527 s]
[INFO] Apache Karaf :: JAAS :: Boot ....................... SUCCESS [ 12.288 s]
[INFO] Apache Karaf :: Util ............................... SUCCESS [ 44.256 s]
[INFO] Apache Karaf :: Main ............................... SUCCESS [ 21.778 s]
[INFO] Apache Karaf :: Features ........................... SUCCESS [  9.679 s]
[INFO] Apache Karaf :: Service ............................ SUCCESS [  7.795 s]
[INFO] Apache Karaf :: Service :: Guard ................... SUCCESS [ 15.979 s]
[INFO] Apache Karaf :: Shell .............................. SUCCESS [  6.066 s]
[INFO] Apache Karaf :: Shell :: Core ...................... SUCCESS [ 14.069 s]
[INFO] Apache Karaf :: Tooling ............................ SUCCESS [  7.318 s]
[INFO] Apache Karaf :: Tooling :: Maven Karaf Plugin for Services Metadata SUCCESS [ 16.704
s]
[INFO] Apache Karaf :: Features :: Core ................... SUCCESS [ 21.416 s]
[INFO] Apache Karaf :: Features :: Command ................ SUCCESS [ 14.858 s]
[INFO] Apache Karaf :: KAR :: Core ........................ SUCCESS [ 14.858 s]
[INFO] Apache Karaf :: JAAS :: Config ..................... SUCCESS [ 10.257 s]
[INFO] Apache Karaf :: JAAS :: Modules .................... SUCCESS [01:27 min]
[INFO] Apache Karaf :: Bundle ............................. SUCCESS [  5.700 s]
[INFO] Apache Karaf :: Bundle :: Core ..................... SUCCESS [ 16.396 s]
[INFO] Apache Karaf :: Bundle :: BlueprintStateService .... SUCCESS [ 10.612 s]
[INFO] Apache Karaf :: Bundle :: SpringStateService ....... SUCCESS [ 15.485 s]
[INFO] Apache Karaf :: ConfigAdmin :: Core ................ SUCCESS [ 11.423 s]
[INFO] Apache Karaf :: Tooling :: Utils ................... SUCCESS [ 11.457 s]
[INFO] Apache Karaf :: Deployer ........................... SUCCESS [ 11.005 s]
[INFO] Apache Karaf :: Deployer :: Blueprint .............. SUCCESS [ 15.122 s]
[INFO] Apache Karaf :: Deployer :: Spring ................. SUCCESS [ 11.957 s]
[INFO] Apache Karaf :: Demos :: Profiles :: Registry ...... SUCCESS [ 10.580 s]
[INFO] Apache Karaf :: Profile :: Core .................... SUCCESS [ 16.564 s]
[INFO] Apache Karaf :: Instance :: Core ................... SUCCESS [ 13.714 s]
[INFO] Apache Karaf :: Package :: Core .................... SUCCESS [ 10.446 s]
[INFO] Apache Karaf :: HTTP :: Core ....................... SUCCESS [ 11.793 s]
[INFO] Apache Karaf :: Service :: Core .................... SUCCESS [ 11.786 s]
[INFO] Apache Karaf :: Log :: Core ........................ SUCCESS [  9.151 s]
[INFO] Apache Karaf :: Deployer :: Features ............... SUCCESS [  9.333 s]
[INFO] Apache Karaf :: Deployer :: Karaf Archive (.kar) ... SUCCESS [ 12.161 s]
[INFO] Apache Karaf :: Deployer :: Wrap Non OSGi Jar ...... SUCCESS [ 10.136 s]
[INFO] Apache Karaf :: Shell :: Various Commands .......... SUCCESS [ 13.035 s]
[INFO] Apache Karaf :: Shell :: Console ................... SUCCESS [ 11.384 s]
[INFO] Apache Karaf :: Shell :: SSH ....................... SUCCESS [ 29.027 s]
[INFO] Apache Karaf :: Shell :: Table ..................... SUCCESS [ 16.556 s]
[INFO] Apache Karaf :: JAAS :: Jasypt Encryption .......... SUCCESS [ 17.604 s]
[INFO] Apache Karaf :: JAAS :: Command .................... SUCCESS [ 16.548 s]
[INFO] Apache Karaf :: JAAS :: Blueprint .................. SUCCESS [  7.539 s]
[INFO] Apache Karaf :: JAAS :: Blueprint :: Config ........ SUCCESS [  9.437 s]
[INFO] Apache Karaf :: JAAS :: Blueprint :: Jasypt ........ SUCCESS [ 18.278 s]
[INFO] Apache Karaf :: Client ............................. SUCCESS [ 11.062 s]
[INFO] Apache Karaf :: Management ......................... SUCCESS [  5.417 s]
[INFO] Apache Karaf :: Management ......................... SUCCESS [ 11.245 s]
[INFO] Apache Karaf :: System :: Core ..................... SUCCESS [ 10.038 s]
[INFO] Apache Karaf :: Web :: Core ........................ SUCCESS [ 10.055 s]
[INFO] Apache Karaf :: Wrapper :: Core .................... SUCCESS [ 12.693 s]
[INFO] Apache Karaf :: Web Console ........................ SUCCESS [ 12.385 s]
[INFO] Apache Karaf :: Web Console :: Console ............. SUCCESS [  8.404 s]
[INFO] Apache Karaf :: Web Console :: Features Plugin ..... SUCCESS [ 14.674 s]
[INFO] Apache Karaf :: Web Console :: Gogo Plugin ......... SUCCESS [ 10.559 s]
[INFO] Apache Karaf :: Web Console :: HTTP Plugin ......... SUCCESS [ 11.134 s]
[INFO] Apache Karaf :: Web Console :: Instance Plugin ..... SUCCESS [ 10.383 s]
[INFO] Apache Karaf :: Exception .......................... SUCCESS [  8.871 s]
[INFO] Apache Karaf :: Scheduler :: Core .................. SUCCESS [ 10.899 s]
[INFO] Apache Karaf :: Declarative Services (DS) .......... SUCCESS [  6.393 s]
[INFO] Apache Karaf :: SCR :: Shell Commands .............. SUCCESS [ 10.026 s]
[INFO] Apache Karaf :: SCR :: Management MBeans ........... SUCCESS [ 11.057 s]
[INFO] Apache Karaf :: SCR :: Examples .................... SUCCESS [  6.756 s]
[INFO] Apache Karaf :: SCR :: Examples :: Basic Service ... SUCCESS [ 10.805 s]
[INFO] Apache Karaf :: SCR :: Examples :: Managed Services  SUCCESS [  8.051 s]
[INFO] Apache Karaf :: SCR :: Examples :: Component Factories SUCCESS [  8.441 s]
[INFO] Apache Karaf :: Diagnostic ......................... SUCCESS [  9.849 s]
[INFO] Apache Karaf :: Diagnostic :: Boot ................. SUCCESS [  9.415 s]
[INFO] Apache Karaf :: Diagnostic :: Core ................. SUCCESS [ 10.430 s]
[INFO] Apache Karaf :: OBR :: Core ........................ SUCCESS [ 10.452 s]
[INFO] Apache Karaf :: JNDI :: Core ....................... SUCCESS [ 11.147 s]
[INFO] Apache Karaf :: JDBC :: Core ....................... SUCCESS [  9.227 s]
[INFO] Apache Karaf :: JMS :: Core ........................ SUCCESS [ 10.735 s]
[INFO] Apache Karaf :: Features ........................... SUCCESS [  4.721 s]
[INFO] Apache Karaf :: JPA :: Parent ...................... SUCCESS [  4.758 s]
[INFO] Apache Karaf :: JPA :: Hibernate ................... SUCCESS [ 10.900 s]
[INFO] Apache Karaf :: OSGi Services :: Coordinator ....... SUCCESS [  8.804 s]
[INFO] Apache Karaf :: OSGi Services :: EventAdmin ........ SUCCESS [  7.840 s]
[INFO] Apache Karaf :: OSGi Services :: Static ConfigAdmin  SUCCESS [  7.462 s]
[INFO] Apache Karaf :: OSGi Services ...................... SUCCESS [  5.229 s]
[INFO] Apache Karaf :: Subsystem :: Core .................. SUCCESS [ 11.658 s]
[INFO] Apache Karaf :: Tooling :: Maven Karaf Plugin ...... SUCCESS [04:04 min]
[INFO] Apache Karaf :: Assemblies ......................... SUCCESS [  6.296 s]
[INFO] Apache Karaf :: Assemblies :: Features ............. SUCCESS [  6.685 s]
[INFO] Apache Karaf :: Assemblies :: Features :: Base ..... SUCCESS [ 11.520 s]
[INFO] Apache Karaf :: Assemblies :: Features :: Framework  SUCCESS [ 16.191 s]
[INFO] Apache Karaf :: Assemblies :: Features :: Static ... SUCCESS [ 13.869 s]
[INFO] Apache Karaf :: Assemblies :: Features :: Standard . SUCCESS [ 45.729 s]
[INFO] Apache Karaf :: Assemblies :: Features :: Spring ... SUCCESS [01:15 min]
[INFO] Apache Karaf :: Assemblies :: Features :: Enterprise SUCCESS [ 45.270 s]
[INFO] Apache Karaf :: Assemblies :: Demos ................ SUCCESS [  8.988 s]
[INFO] Apache Karaf :: Assemblies :: Minimal Distribution . SUCCESS [ 19.967 s]
[INFO] Apache Karaf :: Assemblies :: Default Distribution . SUCCESS [ 53.577 s]
[INFO] Apache Karaf :: Demos .............................. SUCCESS [  4.913 s]
[INFO] Apache Karaf :: Demos :: Web ....................... SUCCESS [ 19.050 s]
[INFO] Apache Karaf :: Demos :: Branding :: Shell ......... SUCCESS [  9.475 s]
[INFO] Apache Karaf :: Demos :: Command :: Extend Console . SUCCESS [  9.812 s]
[INFO] Apache Karaf :: Demos :: Demo Dump provider ........ SUCCESS [  8.930 s]
[INFO] Apache Karaf :: Demos :: Deployer .................. SUCCESS [  5.656 s]
[INFO] Apache Karaf :: Demos :: Deployer :: Kar ........... SUCCESS [  9.296 s]
[INFO] Apache Karaf :: Demos :: Deployer :: Bundle ........ SUCCESS [  9.712 s]
[INFO] Apache Karaf :: Demos :: Profiles :: Dynamic Assembly SUCCESS [01:33 min]
[INFO] Apache Karaf :: Demos :: Profiles :: Static Assembly SUCCESS [ 22.817 s]
[INFO] Apache Karaf :: Demos :: Profiles .................. SUCCESS [  8.352 s]
[INFO] Apache Karaf :: Archetypes ......................... SUCCESS [  5.237 s]
[INFO] Apache Karaf :: Archetypes :: Assembly Archetype ... SUCCESS [ 21.839 s]
[INFO] Apache Karaf :: Archetypes :: Command Archetype .... SUCCESS [ 13.504 s]
[INFO] Apache Karaf :: Archetypes :: Feature Archetype .... SUCCESS [ 10.927 s]
[INFO] Apache Karaf :: Archetypes :: Kar Archetype ........ SUCCESS [ 11.869 s]
[INFO] Apache Karaf :: Archetypes :: Bundle Archetype ..... SUCCESS [ 13.433 s]
[INFO] Apache Karaf :: Archetypes :: Blueprint Archetype .. SUCCESS [ 17.280 s]
[INFO] Apache Karaf :: Integration Tests .................. SUCCESS [08:36 min]
[INFO] ------------------------------------------------------------------------
[INFO] BUILD SUCCESS
[INFO] ------------------------------------------------------------------------
[INFO] Total time: 50:43 min
[INFO] Finished at: 2016-12-09T15:10:10+00:00
[INFO] Final Memory: 165M/645M
[INFO] ------------------------------------------------------------------------
Waiting for Jenkins to finish collecting data
[JENKINS] Archiving <https://builds.apache.org/job/karaf-4.0.x/ws/archetypes/blueprint/pom.xml>
to org.apache.karaf.archetypes/karaf-blueprint-archetype/4.0.8-SNAPSHOT/karaf-blueprint-archetype-4.0.8-SNAPSHOT.pom
[JENKINS] Archiving <https://builds.apache.org/job/karaf-4.0.x/ws/archetypes/blueprint/target/karaf-blueprint-archetype-4.0.8-SNAPSHOT.jar>
to org.apache.karaf.archetypes/karaf-blueprint-archetype/4.0.8-20161209.150004-42/karaf-blueprint-archetype-4.0.8-20161209.150004-42.jar
[JENKINS] Archiving <https://builds.apache.org/job/karaf-4.0.x/ws/webconsole/gogo/pom.xml>
to org.apache.karaf.webconsole/org.apache.karaf.webconsole.gogo/4.0.8-SNAPSHOT/org.apache.karaf.webconsole.gogo-4.0.8-SNAPSHOT.pom
[JENKINS] Archiving <https://builds.apache.org/job/karaf-4.0.x/ws/webconsole/gogo/target/org.apache.karaf.webconsole.gogo-4.0.8-SNAPSHOT.jar>
to org.apache.karaf.webconsole/org.apache.karaf.webconsole.gogo/4.0.8-20161209.143754-46/org.apache.karaf.webconsole.gogo-4.0.8-20161209.143754-46.jar
[JENKINS] Archiving <https://builds.apache.org/job/karaf-4.0.x/ws/management/pom.xml>
to org.apache.karaf.management/management/4.0.8-SNAPSHOT/management-4.0.8-SNAPSHOT.pom
[JENKINS] Archiving <https://builds.apache.org/job/karaf-4.0.x/ws/jpa/hibernate/pom.xml>
to org.apache.karaf.jpa/hibernate/4.0.8-SNAPSHOT/hibernate-4.0.8-SNAPSHOT.pom
[JENKINS] Archiving <https://builds.apache.org/job/karaf-4.0.x/ws/jpa/hibernate/target/hibernate-4.0.8-SNAPSHOT.jar>
to org.apache.karaf.jpa/hibernate/4.0.8-20161209.144245-46/hibernate-4.0.8-20161209.144245-46.jar
[JENKINS] Archiving <https://builds.apache.org/job/karaf-4.0.x/ws/archetypes/pom.xml>
to org.apache.karaf/archetypes/4.0.8-SNAPSHOT/archetypes-4.0.8-SNAPSHOT.pom
[JENKINS] Archiving <https://builds.apache.org/job/karaf-4.0.x/ws/demos/profiles/pom.xml>
to org.apache.karaf.demos.profiles/profiles/4.0.8-SNAPSHOT/profiles-4.0.8-SNAPSHOT.pom
[JENKINS] Archiving <https://builds.apache.org/job/karaf-4.0.x/ws/assemblies/features/pom.xml>
to org.apache.karaf.assemblies.features/features/4.0.8-SNAPSHOT/features-4.0.8-SNAPSHOT.pom
[JENKINS] Archiving <https://builds.apache.org/job/karaf-4.0.x/ws/features/core/pom.xml>
to org.apache.karaf.features/org.apache.karaf.features.core/4.0.8-SNAPSHOT/org.apache.karaf.features.core-4.0.8-SNAPSHOT.pom
[JENKINS] Archiving <https://builds.apache.org/job/karaf-4.0.x/ws/features/core/target/org.apache.karaf.features.core-4.0.8-SNAPSHOT.jar>
to org.apache.karaf.features/org.apache.karaf.features.core/4.0.8-20161209.142349-49/org.apache.karaf.features.core-4.0.8-20161209.142349-49.jar
[JENKINS] Archiving <https://builds.apache.org/job/karaf-4.0.x/ws/demos/profiles/dynamic/pom.xml>
to org.apache.karaf.demos.profiles/dynamic/4.0.8-SNAPSHOT/dynamic-4.0.8-SNAPSHOT.pom
[JENKINS] Archiving <https://builds.apache.org/job/karaf-4.0.x/ws/demos/profiles/dynamic/target/dynamic-4.0.8-SNAPSHOT.tar.gz>
to org.apache.karaf.demos.profiles/dynamic/4.0.8-20161209.145607-45/dynamic-4.0.8-20161209.145607-45.tar.gz
[JENKINS] Archiving <https://builds.apache.org/job/karaf-4.0.x/ws/demos/profiles/dynamic/target/dynamic-4.0.8-SNAPSHOT.zip>
to org.apache.karaf.demos.profiles/dynamic/4.0.8-20161209.145607-45/dynamic-4.0.8-20161209.145607-45.zip
No artifacts from karaf-4.0.x ยป Apache Karaf :: Demos :: Profiles :: Dynamic Assembly #283
to compare, so performing full copy of artifacts
Build timed out (after 70 minutes). Marking the build as aborted.
Sending e-mails to: commits@karaf.apache.org
ERROR: Failed to parse POMs
java.io.IOException: java.io.IOException: Failed to extract <https://builds.apache.org/job/karaf-4.0.x/ws/demos/profiles/dynamic/transfer>
of 3 files
	at hudson.FilePath.readFromTar(FilePath.java:2328)
	at hudson.FilePath.copyRecursiveTo(FilePath.java:2237)
	at jenkins.model.StandardArtifactManager.archive(StandardArtifactManager.java:61)
	at com.cloudbees.jenkins.plugins.jsync.archiver.JSyncArtifactManager.remoteSync(JSyncArtifactManager.java:128)
	at com.cloudbees.jenkins.plugins.jsync.archiver.JSyncArtifactManager.archive(JSyncArtifactManager.java:76)
	at hudson.maven.MavenBuild$ProxyImpl.performArchiving(MavenBuild.java:483)
	at hudson.maven.MavenModuleSetBuild$MavenModuleSetBuildExecution.doRun(MavenModuleSetBuild.java:855)
	at hudson.model.AbstractBuild$AbstractBuildExecution.run(AbstractBuild.java:534)
	at hudson.model.Run.execute(Run.java:1741)
	at hudson.maven.MavenModuleSetBuild.run(MavenModuleSetBuild.java:531)
	at hudson.model.ResourceController.execute(ResourceController.java:98)
	at hudson.model.Executor.run(Executor.java:410)
Caused by: java.io.IOException: java.lang.InterruptedException
	at hudson.remoting.FastPipedInputStream.read(FastPipedInputStream.java:177)
	at hudson.util.HeadBufferingStream.read(HeadBufferingStream.java:61)
	at com.jcraft.jzlib.InflaterInputStream.fill(InflaterInputStream.java:175)
	at com.jcraft.jzlib.InflaterInputStream.read(InflaterInputStream.java:106)
	at org.apache.commons.compress.archivers.tar.TarArchiveInputStream.read(TarArchiveInputStream.java:614)
	at java.io.InputStream.read(InputStream.java:101)
	at org.apache.commons.io.IOUtils.copyLarge(IOUtils.java:1792)
	at org.apache.commons.io.IOUtils.copyLarge(IOUtils.java:1769)
	at org.apache.commons.io.IOUtils.copy(IOUtils.java:1744)
	at hudson.util.IOUtils.copy(IOUtils.java:40)
	at hudson.FilePath.readFromTar(FilePath.java:2318)
	... 11 more
Caused by: java.lang.InterruptedException
	at java.lang.Object.wait(Native Method)
	at hudson.remoting.FastPipedInputStream.read(FastPipedInputStream.java:175)
	... 21 more

	at hudson.FilePath.copyRecursiveTo(FilePath.java:2244)
	at jenkins.model.StandardArtifactManager.archive(StandardArtifactManager.java:61)
	at com.cloudbees.jenkins.plugins.jsync.archiver.JSyncArtifactManager.remoteSync(JSyncArtifactManager.java:128)
	at com.cloudbees.jenkins.plugins.jsync.archiver.JSyncArtifactManager.archive(JSyncArtifactManager.java:76)
	at hudson.maven.MavenBuild$ProxyImpl.performArchiving(MavenBuild.java:483)
	at hudson.maven.MavenModuleSetBuild$MavenModuleSetBuildExecution.doRun(MavenModuleSetBuild.java:855)
	at hudson.model.AbstractBuild$AbstractBuildExecution.run(AbstractBuild.java:534)
	at hudson.model.Run.execute(Run.java:1741)
	at hudson.maven.MavenModuleSetBuild.run(MavenModuleSetBuild.java:531)
	at hudson.model.ResourceController.execute(ResourceController.java:98)
	at hudson.model.Executor.run(Executor.java:410)
Caused by: java.util.concurrent.ExecutionException: java.io.IOException: This archives contains
unclosed entries.
	at hudson.remoting.Channel$2.adapt(Channel.java:813)
	at hudson.remoting.Channel$2.adapt(Channel.java:808)
	at hudson.remoting.FutureAdapter.get(FutureAdapter.java:59)
	at hudson.FilePath.copyRecursiveTo(FilePath.java:2240)
	... 10 more
Caused by: java.io.IOException: This archives contains unclosed entries.
	at org.apache.commons.compress.archivers.tar.TarArchiveOutputStream.finish(TarArchiveOutputStream.java:225)
	at org.apache.commons.compress.archivers.tar.TarArchiveOutputStream.close(TarArchiveOutputStream.java:241)
	at hudson.util.io.TarArchiver.close(TarArchiver.java:111)
	at hudson.FilePath.writeToTar(FilePath.java:2291)
	at hudson.FilePath.access$2100(FilePath.java:195)
	at hudson.FilePath$45.invoke(FilePath.java:2230)
	at hudson.FilePath$45.invoke(FilePath.java:2226)
	at hudson.FilePath$FileCallableWrapper.call(FilePath.java:2772)
	at hudson.remoting.UserRequest.perform(UserRequest.java:153)
	at hudson.remoting.UserRequest.perform(UserRequest.java:50)
	at hudson.remoting.Request$2.run(Request.java:332)
	at hudson.remoting.InterceptingExecutorService$1.call(InterceptingExecutorService.java:68)
	at java.util.concurrent.FutureTask.run(FutureTask.java:262)
	at java.util.concurrent.ThreadPoolExecutor.runWorker(ThreadPoolExecutor.java:1145)
	at java.util.concurrent.ThreadPoolExecutor$Worker.run(ThreadPoolExecutor.java:615)
	at java.lang.Thread.run(Thread.java:745)
	at ......remote call to H16(Native Method)
	at hudson.remoting.Channel.attachCallSiteStackTrace(Channel.java:1416)
	at hudson.remoting.UserResponse.retrieve(UserRequest.java:253)
	at hudson.remoting.Channel$2.adapt(Channel.java:811)
	... 13 more
channel stopped

Mime
View raw message