karaf-commits mailing list archives

Site index · List index
Message view « Date » · « Thread »
Top « Date » · « Thread »
From Apache Jenkins Server <jenk...@builds.apache.org>
Subject Build failed in Jenkins: karaf-3.0.x » Apache Karaf :: Tooling :: Maven Karaf Plugin #993
Date Thu, 04 Aug 2016 14:18:49 GMT
See <https://builds.apache.org/job/karaf-3.0.x/org.apache.karaf.tooling$karaf-maven-plugin/993/>

------------------------------------------
[INFO]                                                                         
[INFO] ------------------------------------------------------------------------
[INFO] Building Apache Karaf :: Tooling :: Maven Karaf Plugin 3.0.8-SNAPSHOT
[INFO] ------------------------------------------------------------------------
Downloading: http://repo.maven.apache.org/maven2/org/apache/maven/plugins/maven-invoker-plugin/1.6/maven-invoker-plugin-1.6.pom
Downloaded: http://repo.maven.apache.org/maven2/org/apache/maven/plugins/maven-invoker-plugin/1.6/maven-invoker-plugin-1.6.pom
(11 KB at 78.7 KB/sec)
Downloading: http://repo.maven.apache.org/maven2/org/apache/maven/plugins/maven-invoker-plugin/1.6/maven-invoker-plugin-1.6.jar
Downloaded: http://repo.maven.apache.org/maven2/org/apache/maven/plugins/maven-invoker-plugin/1.6/maven-invoker-plugin-1.6.jar
(89 KB at 1222.6 KB/sec)
[INFO] 
[INFO] --- maven-clean-plugin:2.5:clean (default-clean) @ karaf-maven-plugin ---
[INFO] 
[INFO] --- maven-enforcer-plugin:1.3.1:enforce (enforce-maven) @ karaf-maven-plugin ---
[INFO] 
[INFO] --- maven-bundle-plugin:2.5.4:cleanVersions (cleanVersions) @ karaf-maven-plugin ---
[INFO] 
[INFO] --- maven-plugin-plugin:3.3:descriptor (default-descriptor) @ karaf-maven-plugin ---
[INFO] Using 'UTF-8' encoding to read mojo metadata.
[INFO] Applying mojo extractor for language: java-annotations
Downloading: http://svn.apache.org/repos/asf/servicemix/m2-repo/org/apache/felix/maven-bundle-plugin/2.5.4/maven-bundle-plugin-2.5.4-sources.jar
Downloading: http://zodiac.springsource.com/maven/bundles/release/org/apache/felix/maven-bundle-plugin/2.5.4/maven-bundle-plugin-2.5.4-sources.jar
Downloading: http://repo.maven.apache.org/maven2/org/apache/felix/maven-bundle-plugin/2.5.4/maven-bundle-plugin-2.5.4-sources.jar
Downloaded: http://repo.maven.apache.org/maven2/org/apache/felix/maven-bundle-plugin/2.5.4/maven-bundle-plugin-2.5.4-sources.jar
(113 KB at 588.7 KB/sec)
[INFO] Mojo extractor for language: java-annotations found 0 mojo descriptors.
[INFO] Applying mojo extractor for language: java
[INFO] Mojo extractor for language: java found 8 mojo descriptors.
[INFO] Applying mojo extractor for language: bsh
[INFO] Mojo extractor for language: bsh found 0 mojo descriptors.
[INFO] 
[INFO] --- maven-remote-resources-plugin:1.5:process (default) @ karaf-maven-plugin ---
[INFO] 
[INFO] --- maven-resources-plugin:2.6:resources (default-resources) @ karaf-maven-plugin ---
[INFO] Using 'UTF-8' encoding to copy filtered resources.
[INFO] Copying 4 resources
[INFO] Copying 3 resources
[INFO] 
[INFO] --- maven-compiler-plugin:3.2:compile (default-compile) @ karaf-maven-plugin ---
[INFO] Changes detected - recompiling the module!
[INFO] Compiling 34 source files to <https://builds.apache.org/job/karaf-3.0.x/org.apache.karaf.tooling$karaf-maven-plugin/ws/target/classes>
[INFO] <https://builds.apache.org/job/karaf-3.0.x/org.apache.karaf.tooling$karaf-maven-plugin/ws/src/main/java/org/apache/karaf/tooling/utils/MojoSupport.java>:
Some input files use or override a deprecated API.
[INFO] <https://builds.apache.org/job/karaf-3.0.x/org.apache.karaf.tooling$karaf-maven-plugin/ws/src/main/java/org/apache/karaf/tooling/utils/MojoSupport.java>:
Recompile with -Xlint:deprecation for details.
[INFO] <https://builds.apache.org/job/karaf-3.0.x/org.apache.karaf.tooling$karaf-maven-plugin/ws/src/main/java/org/apache/karaf/tooling/instances/CreateArchiveMojo.java>:
<https://builds.apache.org/job/karaf-3.0.x/org.apache.karaf.tooling$karaf-maven-plugin/ws/src/main/java/org/apache/karaf/tooling/instances/CreateArchiveMojo.java>
uses unchecked or unsafe operations.
[INFO] <https://builds.apache.org/job/karaf-3.0.x/org.apache.karaf.tooling$karaf-maven-plugin/ws/src/main/java/org/apache/karaf/tooling/instances/CreateArchiveMojo.java>:
Recompile with -Xlint:unchecked for details.
[INFO] 
[INFO] --- maven-resources-plugin:2.6:testResources (default-testResources) @ karaf-maven-plugin
---
[INFO] Using 'UTF-8' encoding to copy filtered resources.
[INFO] Copying 3 resources
[INFO] Copying 3 resources
[INFO] 
[INFO] --- maven-compiler-plugin:3.2:testCompile (default-testCompile) @ karaf-maven-plugin
---
[INFO] Changes detected - recompiling the module!
[INFO] Compiling 6 source files to <https://builds.apache.org/job/karaf-3.0.x/org.apache.karaf.tooling$karaf-maven-plugin/ws/target/test-classes>
[INFO] 
[INFO] --- maven-surefire-plugin:2.17:test (default-test) @ karaf-maven-plugin ---
[INFO] Surefire report directory: <https://builds.apache.org/job/karaf-3.0.x/org.apache.karaf.tooling$karaf-maven-plugin/ws/target/surefire-reports>

-------------------------------------------------------
 T E S T S
-------------------------------------------------------
Running org.apache.karaf.tooling.features.FeatureMetaDataExporterTest
Tests run: 1, Failures: 0, Errors: 0, Skipped: 0, Time elapsed: 0.259 sec - in org.apache.karaf.tooling.features.FeatureMetaDataExporterTest
Running org.apache.karaf.tooling.features.MavenUtilTest
Tests run: 8, Failures: 0, Errors: 0, Skipped: 2, Time elapsed: 0.276 sec - in org.apache.karaf.tooling.features.MavenUtilTest
Running org.apache.karaf.tooling.features.BundleToArtifactTest
Tests run: 3, Failures: 0, Errors: 0, Skipped: 0, Time elapsed: 0.03 sec - in org.apache.karaf.tooling.features.BundleToArtifactTest
Running org.apache.karaf.tooling.features.AddToRepositoryMojoTest
Tests run: 1, Failures: 0, Errors: 0, Skipped: 0, Time elapsed: 0.046 sec - in org.apache.karaf.tooling.features.AddToRepositoryMojoTest
Running org.apache.karaf.tooling.features.ManifestUtilsTest
Tests run: 2, Failures: 0, Errors: 0, Skipped: 0, Time elapsed: 0.05 sec - in org.apache.karaf.tooling.features.ManifestUtilsTest
Running org.apache.karaf.tooling.features.GenerateDescriptorMojoTest
Tests run: 2, Failures: 0, Errors: 0, Skipped: 0, Time elapsed: 0.293 sec - in org.apache.karaf.tooling.features.GenerateDescriptorMojoTest

Results :

Tests run: 17, Failures: 0, Errors: 0, Skipped: 2

[JENKINS] Recording test results
[INFO] 
[INFO] --- maven-jar-plugin:2.5:jar (default-jar) @ karaf-maven-plugin ---
[INFO] Building jar: <https://builds.apache.org/job/karaf-3.0.x/org.apache.karaf.tooling$karaf-maven-plugin/ws/target/karaf-maven-plugin-3.0.8-SNAPSHOT.jar>
[INFO] 
[INFO] --- maven-plugin-plugin:3.3:addPluginArtifactMetadata (default-addPluginArtifactMetadata)
@ karaf-maven-plugin ---
[INFO] 
[INFO] --- maven-site-plugin:3.4:attach-descriptor (attach-descriptor) @ karaf-maven-plugin
---
[INFO] 
[INFO] --- maven-invoker-plugin:1.6:install (integration-test) @ karaf-maven-plugin ---
Downloading: http://repo.maven.apache.org/maven2/org/codehaus/groovy/groovy/1.8.6/groovy-1.8.6.pom
Downloaded: http://repo.maven.apache.org/maven2/org/codehaus/groovy/groovy/1.8.6/groovy-1.8.6.pom
(32 KB at 459.7 KB/sec)
Downloading: http://repo.maven.apache.org/maven2/org/codehaus/groovy/groovy/1.8.6/groovy-1.8.6.jar
Downloaded: http://repo.maven.apache.org/maven2/org/codehaus/groovy/groovy/1.8.6/groovy-1.8.6.jar
(5417 KB at 15128.8 KB/sec)
[INFO] Installing /home/jenkins/jenkins-slave/workspace/karaf-3.0.x/features/core/pom.xml
to <https://builds.apache.org/job/karaf-3.0.x/org.apache.karaf.tooling$karaf-maven-plugin/ws/target/system/org/apache/karaf/features/org.apache.karaf.features.core/3.0.8-SNAPSHOT/org.apache.karaf.features.core-3.0.8-SNAPSHOT.pom>
[INFO] Installing /home/jenkins/jenkins-slave/workspace/karaf-3.0.x/features/core/target/org.apache.karaf.features.core-3.0.8-SNAPSHOT.jar
to <https://builds.apache.org/job/karaf-3.0.x/org.apache.karaf.tooling$karaf-maven-plugin/ws/target/system/org/apache/karaf/features/org.apache.karaf.features.core/3.0.8-SNAPSHOT/org.apache.karaf.features.core-3.0.8-SNAPSHOT.jar>
[INFO] Installing /home/jenkins/jenkins-slave/workspace/karaf-3.0.x/features/core/pom.xml
to <https://builds.apache.org/job/karaf-3.0.x/org.apache.karaf.tooling$karaf-maven-plugin/ws/target/system/org/apache/karaf/features/org.apache.karaf.features.core/3.0.8-SNAPSHOT/org.apache.karaf.features.core-3.0.8-SNAPSHOT.pom>
[INFO] Installing /home/jenkins/jenkins-slave/workspace/karaf-3.0.x/features/pom.xml to <https://builds.apache.org/job/karaf-3.0.x/org.apache.karaf.tooling$karaf-maven-plugin/ws/target/system/org/apache/karaf/features/features/3.0.8-SNAPSHOT/features-3.0.8-SNAPSHOT.pom>
[INFO] Installing /home/jenkins/jenkins-slave/workspace/karaf-3.0.x/pom.xml to <https://builds.apache.org/job/karaf-3.0.x/org.apache.karaf.tooling$karaf-maven-plugin/ws/target/system/org/apache/karaf/karaf/3.0.8-SNAPSHOT/karaf-3.0.8-SNAPSHOT.pom>
[INFO] Installing /home/jenkins/jenkins-slave/workspace/karaf-3.0.x/deployer/spring/pom.xml
to <https://builds.apache.org/job/karaf-3.0.x/org.apache.karaf.tooling$karaf-maven-plugin/ws/target/system/org/apache/karaf/deployer/org.apache.karaf.deployer.spring/3.0.8-SNAPSHOT/org.apache.karaf.deployer.spring-3.0.8-SNAPSHOT.pom>
[INFO] Installing /home/jenkins/jenkins-slave/workspace/karaf-3.0.x/deployer/spring/target/org.apache.karaf.deployer.spring-3.0.8-SNAPSHOT.jar
to <https://builds.apache.org/job/karaf-3.0.x/org.apache.karaf.tooling$karaf-maven-plugin/ws/target/system/org/apache/karaf/deployer/org.apache.karaf.deployer.spring/3.0.8-SNAPSHOT/org.apache.karaf.deployer.spring-3.0.8-SNAPSHOT.jar>
[INFO] Installing /home/jenkins/jenkins-slave/workspace/karaf-3.0.x/deployer/spring/pom.xml
to <https://builds.apache.org/job/karaf-3.0.x/org.apache.karaf.tooling$karaf-maven-plugin/ws/target/system/org/apache/karaf/deployer/org.apache.karaf.deployer.spring/3.0.8-SNAPSHOT/org.apache.karaf.deployer.spring-3.0.8-SNAPSHOT.pom>
[INFO] Installing /home/jenkins/jenkins-slave/workspace/karaf-3.0.x/deployer/pom.xml to <https://builds.apache.org/job/karaf-3.0.x/org.apache.karaf.tooling$karaf-maven-plugin/ws/target/system/org/apache/karaf/deployer/deployer/3.0.8-SNAPSHOT/deployer-3.0.8-SNAPSHOT.pom>
[INFO] Installing /home/jenkins/jenkins-slave/workspace/karaf-3.0.x/deployer/blueprint/pom.xml
to <https://builds.apache.org/job/karaf-3.0.x/org.apache.karaf.tooling$karaf-maven-plugin/ws/target/system/org/apache/karaf/deployer/org.apache.karaf.deployer.blueprint/3.0.8-SNAPSHOT/org.apache.karaf.deployer.blueprint-3.0.8-SNAPSHOT.pom>
[INFO] Installing /home/jenkins/jenkins-slave/workspace/karaf-3.0.x/deployer/blueprint/target/org.apache.karaf.deployer.blueprint-3.0.8-SNAPSHOT.jar
to <https://builds.apache.org/job/karaf-3.0.x/org.apache.karaf.tooling$karaf-maven-plugin/ws/target/system/org/apache/karaf/deployer/org.apache.karaf.deployer.blueprint/3.0.8-SNAPSHOT/org.apache.karaf.deployer.blueprint-3.0.8-SNAPSHOT.jar>
[INFO] Installing /home/jenkins/jenkins-slave/workspace/karaf-3.0.x/deployer/blueprint/pom.xml
to <https://builds.apache.org/job/karaf-3.0.x/org.apache.karaf.tooling$karaf-maven-plugin/ws/target/system/org/apache/karaf/deployer/org.apache.karaf.deployer.blueprint/3.0.8-SNAPSHOT/org.apache.karaf.deployer.blueprint-3.0.8-SNAPSHOT.pom>
[INFO] Installing /home/jenkins/jenkins-slave/workspace/karaf-3.0.x/deployer/features/pom.xml
to <https://builds.apache.org/job/karaf-3.0.x/org.apache.karaf.tooling$karaf-maven-plugin/ws/target/system/org/apache/karaf/deployer/org.apache.karaf.deployer.features/3.0.8-SNAPSHOT/org.apache.karaf.deployer.features-3.0.8-SNAPSHOT.pom>
[INFO] Installing /home/jenkins/jenkins-slave/workspace/karaf-3.0.x/deployer/features/target/org.apache.karaf.deployer.features-3.0.8-SNAPSHOT.jar
to <https://builds.apache.org/job/karaf-3.0.x/org.apache.karaf.tooling$karaf-maven-plugin/ws/target/system/org/apache/karaf/deployer/org.apache.karaf.deployer.features/3.0.8-SNAPSHOT/org.apache.karaf.deployer.features-3.0.8-SNAPSHOT.jar>
[INFO] Installing /home/jenkins/jenkins-slave/workspace/karaf-3.0.x/deployer/features/pom.xml
to <https://builds.apache.org/job/karaf-3.0.x/org.apache.karaf.tooling$karaf-maven-plugin/ws/target/system/org/apache/karaf/deployer/org.apache.karaf.deployer.features/3.0.8-SNAPSHOT/org.apache.karaf.deployer.features-3.0.8-SNAPSHOT.pom>
[INFO] Installing /home/jenkins/jenkins-slave/workspace/karaf-3.0.x/deployer/kar/pom.xml to
<https://builds.apache.org/job/karaf-3.0.x/org.apache.karaf.tooling$karaf-maven-plugin/ws/target/system/org/apache/karaf/deployer/org.apache.karaf.deployer.kar/3.0.8-SNAPSHOT/org.apache.karaf.deployer.kar-3.0.8-SNAPSHOT.pom>
[INFO] Installing /home/jenkins/jenkins-slave/workspace/karaf-3.0.x/deployer/kar/target/org.apache.karaf.deployer.kar-3.0.8-SNAPSHOT.jar
to <https://builds.apache.org/job/karaf-3.0.x/org.apache.karaf.tooling$karaf-maven-plugin/ws/target/system/org/apache/karaf/deployer/org.apache.karaf.deployer.kar/3.0.8-SNAPSHOT/org.apache.karaf.deployer.kar-3.0.8-SNAPSHOT.jar>
[INFO] Installing /home/jenkins/jenkins-slave/workspace/karaf-3.0.x/deployer/kar/pom.xml to
<https://builds.apache.org/job/karaf-3.0.x/org.apache.karaf.tooling$karaf-maven-plugin/ws/target/system/org/apache/karaf/deployer/org.apache.karaf.deployer.kar/3.0.8-SNAPSHOT/org.apache.karaf.deployer.kar-3.0.8-SNAPSHOT.pom>
[INFO] Installing /home/jenkins/jenkins-slave/workspace/karaf-3.0.x/kar/core/pom.xml to <https://builds.apache.org/job/karaf-3.0.x/org.apache.karaf.tooling$karaf-maven-plugin/ws/target/system/org/apache/karaf/kar/org.apache.karaf.kar.core/3.0.8-SNAPSHOT/org.apache.karaf.kar.core-3.0.8-SNAPSHOT.pom>
[INFO] Installing /home/jenkins/jenkins-slave/workspace/karaf-3.0.x/kar/core/target/org.apache.karaf.kar.core-3.0.8-SNAPSHOT.jar
to <https://builds.apache.org/job/karaf-3.0.x/org.apache.karaf.tooling$karaf-maven-plugin/ws/target/system/org/apache/karaf/kar/org.apache.karaf.kar.core/3.0.8-SNAPSHOT/org.apache.karaf.kar.core-3.0.8-SNAPSHOT.jar>
[INFO] Installing /home/jenkins/jenkins-slave/workspace/karaf-3.0.x/kar/core/pom.xml to <https://builds.apache.org/job/karaf-3.0.x/org.apache.karaf.tooling$karaf-maven-plugin/ws/target/system/org/apache/karaf/kar/org.apache.karaf.kar.core/3.0.8-SNAPSHOT/org.apache.karaf.kar.core-3.0.8-SNAPSHOT.pom>
[INFO] Installing /home/jenkins/jenkins-slave/workspace/karaf-3.0.x/kar/pom.xml to <https://builds.apache.org/job/karaf-3.0.x/org.apache.karaf.tooling$karaf-maven-plugin/ws/target/system/org/apache/karaf/kar/kar/3.0.8-SNAPSHOT/kar-3.0.8-SNAPSHOT.pom>
[INFO] Installing /home/jenkins/jenkins-slave/workspace/karaf-3.0.x/util/pom.xml to <https://builds.apache.org/job/karaf-3.0.x/org.apache.karaf.tooling$karaf-maven-plugin/ws/target/system/org/apache/karaf/org.apache.karaf.util/3.0.8-SNAPSHOT/org.apache.karaf.util-3.0.8-SNAPSHOT.pom>
[INFO] Installing /home/jenkins/jenkins-slave/workspace/karaf-3.0.x/util/target/org.apache.karaf.util-3.0.8-SNAPSHOT.jar
to <https://builds.apache.org/job/karaf-3.0.x/org.apache.karaf.tooling$karaf-maven-plugin/ws/target/system/org/apache/karaf/org.apache.karaf.util/3.0.8-SNAPSHOT/org.apache.karaf.util-3.0.8-SNAPSHOT.jar>
[INFO] Installing /home/jenkins/jenkins-slave/workspace/karaf-3.0.x/util/pom.xml to <https://builds.apache.org/job/karaf-3.0.x/org.apache.karaf.tooling$karaf-maven-plugin/ws/target/system/org/apache/karaf/org.apache.karaf.util/3.0.8-SNAPSHOT/org.apache.karaf.util-3.0.8-SNAPSHOT.pom>
[INFO] Installing /home/jenkins/jenkins-slave/workspace/karaf-3.0.x/shell/console/pom.xml
to <https://builds.apache.org/job/karaf-3.0.x/org.apache.karaf.tooling$karaf-maven-plugin/ws/target/system/org/apache/karaf/shell/org.apache.karaf.shell.console/3.0.8-SNAPSHOT/org.apache.karaf.shell.console-3.0.8-SNAPSHOT.pom>
[INFO] Installing /home/jenkins/jenkins-slave/workspace/karaf-3.0.x/shell/console/target/org.apache.karaf.shell.console-3.0.8-SNAPSHOT.jar
to <https://builds.apache.org/job/karaf-3.0.x/org.apache.karaf.tooling$karaf-maven-plugin/ws/target/system/org/apache/karaf/shell/org.apache.karaf.shell.console/3.0.8-SNAPSHOT/org.apache.karaf.shell.console-3.0.8-SNAPSHOT.jar>
[INFO] Installing /home/jenkins/jenkins-slave/workspace/karaf-3.0.x/shell/console/pom.xml
to <https://builds.apache.org/job/karaf-3.0.x/org.apache.karaf.tooling$karaf-maven-plugin/ws/target/system/org/apache/karaf/shell/org.apache.karaf.shell.console/3.0.8-SNAPSHOT/org.apache.karaf.shell.console-3.0.8-SNAPSHOT.pom>
[INFO] Installing /home/jenkins/jenkins-slave/workspace/karaf-3.0.x/shell/pom.xml to <https://builds.apache.org/job/karaf-3.0.x/org.apache.karaf.tooling$karaf-maven-plugin/ws/target/system/org/apache/karaf/shell/shell/3.0.8-SNAPSHOT/shell-3.0.8-SNAPSHOT.pom>
[INFO] Installing /home/jenkins/jenkins-slave/workspace/karaf-3.0.x/jaas/modules/pom.xml to
<https://builds.apache.org/job/karaf-3.0.x/org.apache.karaf.tooling$karaf-maven-plugin/ws/target/system/org/apache/karaf/jaas/org.apache.karaf.jaas.modules/3.0.8-SNAPSHOT/org.apache.karaf.jaas.modules-3.0.8-SNAPSHOT.pom>
[INFO] Installing /home/jenkins/jenkins-slave/workspace/karaf-3.0.x/jaas/modules/target/org.apache.karaf.jaas.modules-3.0.8-SNAPSHOT.jar
to <https://builds.apache.org/job/karaf-3.0.x/org.apache.karaf.tooling$karaf-maven-plugin/ws/target/system/org/apache/karaf/jaas/org.apache.karaf.jaas.modules/3.0.8-SNAPSHOT/org.apache.karaf.jaas.modules-3.0.8-SNAPSHOT.jar>
[INFO] Installing /home/jenkins/jenkins-slave/workspace/karaf-3.0.x/jaas/modules/pom.xml to
<https://builds.apache.org/job/karaf-3.0.x/org.apache.karaf.tooling$karaf-maven-plugin/ws/target/system/org/apache/karaf/jaas/org.apache.karaf.jaas.modules/3.0.8-SNAPSHOT/org.apache.karaf.jaas.modules-3.0.8-SNAPSHOT.pom>
[INFO] Installing /home/jenkins/jenkins-slave/workspace/karaf-3.0.x/jaas/pom.xml to <https://builds.apache.org/job/karaf-3.0.x/org.apache.karaf.tooling$karaf-maven-plugin/ws/target/system/org/apache/karaf/jaas/jaas/3.0.8-SNAPSHOT/jaas-3.0.8-SNAPSHOT.pom>
[INFO] Installing /home/jenkins/jenkins-slave/workspace/karaf-3.0.x/jaas/config/pom.xml to
<https://builds.apache.org/job/karaf-3.0.x/org.apache.karaf.tooling$karaf-maven-plugin/ws/target/system/org/apache/karaf/jaas/org.apache.karaf.jaas.config/3.0.8-SNAPSHOT/org.apache.karaf.jaas.config-3.0.8-SNAPSHOT.pom>
[INFO] Installing /home/jenkins/jenkins-slave/workspace/karaf-3.0.x/jaas/config/target/org.apache.karaf.jaas.config-3.0.8-SNAPSHOT.jar
to <https://builds.apache.org/job/karaf-3.0.x/org.apache.karaf.tooling$karaf-maven-plugin/ws/target/system/org/apache/karaf/jaas/org.apache.karaf.jaas.config/3.0.8-SNAPSHOT/org.apache.karaf.jaas.config-3.0.8-SNAPSHOT.jar>
[INFO] Installing /home/jenkins/jenkins-slave/workspace/karaf-3.0.x/jaas/config/pom.xml to
<https://builds.apache.org/job/karaf-3.0.x/org.apache.karaf.tooling$karaf-maven-plugin/ws/target/system/org/apache/karaf/jaas/org.apache.karaf.jaas.config/3.0.8-SNAPSHOT/org.apache.karaf.jaas.config-3.0.8-SNAPSHOT.pom>
[INFO] Installing /home/jenkins/jenkins-slave/workspace/karaf-3.0.x/tooling/pom.xml to <https://builds.apache.org/job/karaf-3.0.x/org.apache.karaf.tooling$karaf-maven-plugin/ws/target/system/org/apache/karaf/tooling/tooling/3.0.8-SNAPSHOT/tooling-3.0.8-SNAPSHOT.pom>
[INFO] Installing <https://builds.apache.org/job/karaf-3.0.x/org.apache.karaf.tooling$karaf-maven-plugin/ws/pom.xml>
to <https://builds.apache.org/job/karaf-3.0.x/org.apache.karaf.tooling$karaf-maven-plugin/ws/target/system/org/apache/karaf/tooling/karaf-maven-plugin/3.0.8-SNAPSHOT/karaf-maven-plugin-3.0.8-SNAPSHOT.pom>
[INFO] Installing <https://builds.apache.org/job/karaf-3.0.x/org.apache.karaf.tooling$karaf-maven-plugin/ws/target/karaf-maven-plugin-3.0.8-SNAPSHOT.jar>
to <https://builds.apache.org/job/karaf-3.0.x/org.apache.karaf.tooling$karaf-maven-plugin/ws/target/system/org/apache/karaf/tooling/karaf-maven-plugin/3.0.8-SNAPSHOT/karaf-maven-plugin-3.0.8-SNAPSHOT.jar>
[INFO] 
[INFO] --- maven-invoker-plugin:1.6:run (integration-test) @ karaf-maven-plugin ---
[INFO] Building: test-kar-multiple-kars/pom.xml
[INFO] run script <https://builds.apache.org/job/karaf-3.0.x/org.apache.karaf.tooling$karaf-maven-plugin/ws/target/it/test-kar-multiple-kars/verify.bsh>
[INFO] ..SUCCESS (13.6 s)
[INFO] Building: test-check-dependencies/pom.xml
[INFO] run script <https://builds.apache.org/job/karaf-3.0.x/org.apache.karaf.tooling$karaf-maven-plugin/ws/target/it/test-check-dependencies/verify.bsh>
[INFO] ..SUCCESS (27.8 s)
[INFO] Building: test-kar-packaging/pom.xml
[INFO] run script <https://builds.apache.org/job/karaf-3.0.x/org.apache.karaf.tooling$karaf-maven-plugin/ws/target/it/test-kar-packaging/verify.bsh>
[INFO] ..SUCCESS (7.8 s)
[INFO] Building: test-aggregate-features/pom.xml
[INFO] run script <https://builds.apache.org/job/karaf-3.0.x/org.apache.karaf.tooling$karaf-maven-plugin/ws/target/it/test-aggregate-features/verify.bsh>
[INFO] ..SUCCESS (12.8 s)
[INFO] Building: test-input-file/pom.xml
[INFO] run script <https://builds.apache.org/job/karaf-3.0.x/org.apache.karaf.tooling$karaf-maven-plugin/ws/target/it/test-input-file/verify.bsh>
[INFO] ..SUCCESS (10.7 s)
[INFO] Building: test-kar-classifier/pom.xml
[INFO] run script <https://builds.apache.org/job/karaf-3.0.x/org.apache.karaf.tooling$karaf-maven-plugin/ws/target/it/test-kar-classifier/verify.bsh>
[INFO] ..SUCCESS (7.9 s)
[INFO] Building: test-kar-with-pom-packaging/pom.xml
[INFO] run script <https://builds.apache.org/job/karaf-3.0.x/org.apache.karaf.tooling$karaf-maven-plugin/ws/target/it/test-kar-with-pom-packaging/verify.bsh>
[INFO] ..SUCCESS (7.4 s)
[INFO] Building: test-include-project-artifact/pom.xml
[INFO] run script <https://builds.apache.org/job/karaf-3.0.x/org.apache.karaf.tooling$karaf-maven-plugin/ws/target/it/test-include-project-artifact/verify.bsh>
[INFO] ..SUCCESS (11.2 s)
[INFO] Building: test-type-classifier/pom.xml
[INFO] run script <https://builds.apache.org/job/karaf-3.0.x/org.apache.karaf.tooling$karaf-maven-plugin/ws/target/it/test-type-classifier/verify.bsh>
[INFO] ..SUCCESS (11.5 s)
[INFO] Building: test-recursive/pom.xml
[INFO] run script <https://builds.apache.org/job/karaf-3.0.x/org.apache.karaf.tooling$karaf-maven-plugin/ws/target/it/test-recursive/verify.bsh>
[INFO] ..SUCCESS (14.1 s)
[INFO] Building: test-feature-dependencies/pom.xml
[INFO] ..FAILED (12.9 s)
[INFO]   The build exited with code 1. See <https://builds.apache.org/job/karaf-3.0.x/org.apache.karaf.tooling$karaf-maven-plugin/ws/target/it/test-feature-dependencies/build.log>
for details.
[INFO] Building: test-basic-generation/pom.xml
[INFO] run script <https://builds.apache.org/job/karaf-3.0.x/org.apache.karaf.tooling$karaf-maven-plugin/ws/target/it/test-basic-generation/verify.bsh>
[INFO] ..SUCCESS (10.3 s)
[INFO] -------------------------------------------------
[INFO] Build Summary:
[INFO]   Passed: 11, Failed: 1, Errors: 0, Skipped: 0
[INFO] -------------------------------------------------
[ERROR] The following builds failed:
[ERROR] *  test-feature-dependencies/pom.xml
[INFO] -------------------------------------------------

Mime
View raw message