karaf-commits mailing list archives

Site index · List index
Message view « Date » · « Thread »
Top « Date » · « Thread »
From Apache Jenkins Server <jenk...@builds.apache.org>
Subject Build failed in Jenkins: karaf-4.0.x » Apache Karaf :: Features :: Core #215
Date Tue, 23 Aug 2016 13:14:48 GMT
See <https://builds.apache.org/job/karaf-4.0.x/org.apache.karaf.features$org.apache.karaf.features.core/215/>

------------------------------------------
[INFO]                                                                         
[INFO] ------------------------------------------------------------------------
[INFO] Building Apache Karaf :: Features :: Core 4.0.6-SNAPSHOT
[INFO] ------------------------------------------------------------------------
[INFO] 
[INFO] --- maven-clean-plugin:2.5:clean (default-clean) @ org.apache.karaf.features.core ---
[INFO] Deleting <https://builds.apache.org/job/karaf-4.0.x/org.apache.karaf.features$org.apache.karaf.features.core/ws/target>
[INFO] 
[INFO] --- maven-enforcer-plugin:1.4.1:enforce (enforce-maven) @ org.apache.karaf.features.core
---
[INFO] 
[INFO] --- maven-bundle-plugin:3.0.1:cleanVersions (cleanVersions) @ org.apache.karaf.features.core
---
[INFO] 
[INFO] --- maven-remote-resources-plugin:1.5:process (default) @ org.apache.karaf.features.core
---
[INFO] 
[INFO] --- maven-resources-plugin:2.7:resources (default-resources) @ org.apache.karaf.features.core
---
[INFO] Using 'UTF-8' encoding to copy filtered resources.
[INFO] Copying 7 resources
[INFO] Copying 1 resource
[INFO] Copying 3 resources
[INFO] 
[INFO] --- maven-compiler-plugin:3.5.1:compile (default-compile) @ org.apache.karaf.features.core
---
[INFO] Changes detected - recompiling the module!
[INFO] Compiling 103 source files to <https://builds.apache.org/job/karaf-4.0.x/org.apache.karaf.features$org.apache.karaf.features.core/ws/target/classes>
[INFO] <https://builds.apache.org/job/karaf-4.0.x/org.apache.karaf.features$org.apache.karaf.features.core/ws/src/main/java/org/apache/karaf/features/internal/resolver/ResourceBuilder.java>:
Some input files use or override a deprecated API.
[INFO] <https://builds.apache.org/job/karaf-4.0.x/org.apache.karaf.features$org.apache.karaf.features.core/ws/src/main/java/org/apache/karaf/features/internal/resolver/ResourceBuilder.java>:
Recompile with -Xlint:deprecation for details.
[INFO] <https://builds.apache.org/job/karaf-4.0.x/org.apache.karaf.features$org.apache.karaf.features.core/ws/src/main/java/org/apache/karaf/features/internal/util/MapUtils.java>:
Some input files use unchecked or unsafe operations.
[INFO] <https://builds.apache.org/job/karaf-4.0.x/org.apache.karaf.features$org.apache.karaf.features.core/ws/src/main/java/org/apache/karaf/features/internal/util/MapUtils.java>:
Recompile with -Xlint:unchecked for details.
[INFO] -------------------------------------------------------------
[ERROR] COMPILATION ERROR : 
[INFO] -------------------------------------------------------------
[ERROR] <https://builds.apache.org/job/karaf-4.0.x/org.apache.karaf.features$org.apache.karaf.features.core/ws/src/main/java/org/apache/karaf/features/internal/service/FeaturesServiceImpl.java>:[206,13]
cannot find symbol
  symbol: variable bundleContext
[ERROR] <https://builds.apache.org/job/karaf-4.0.x/org.apache.karaf.features$org.apache.karaf.features.core/ws/src/main/java/org/apache/karaf/features/internal/service/FeaturesServiceImpl.java>:[252,13]
cannot find symbol
  symbol: variable bundleContext
[ERROR] <https://builds.apache.org/job/karaf-4.0.x/org.apache.karaf.features$org.apache.karaf.features.core/ws/src/main/java/org/apache/karaf/features/internal/service/FeaturesServiceImpl.java>:[286,13]
cannot find symbol
  symbol:   variable bundleContext
  location: class org.apache.karaf.features.internal.service.FeaturesServiceImpl
[ERROR] <https://builds.apache.org/job/karaf-4.0.x/org.apache.karaf.features$org.apache.karaf.features.core/ws/src/main/java/org/apache/karaf/features/internal/service/FeaturesServiceImpl.java>:[289,28]
cannot find symbol
  symbol:   variable bundleContext
  location: class org.apache.karaf.features.internal.service.FeaturesServiceImpl
[ERROR] <https://builds.apache.org/job/karaf-4.0.x/org.apache.karaf.features$org.apache.karaf.features.core/ws/src/main/java/org/apache/karaf/features/internal/service/FeaturesServiceImpl.java>:[318,28]
cannot find symbol
  symbol:   variable bundleContext
  location: class org.apache.karaf.features.internal.service.FeaturesServiceImpl
[ERROR] <https://builds.apache.org/job/karaf-4.0.x/org.apache.karaf.features$org.apache.karaf.features.core/ws/src/main/java/org/apache/karaf/features/internal/service/FeaturesServiceImpl.java>:[357,21]
cannot find symbol
  symbol:   variable bundleContext
  location: class org.apache.karaf.features.internal.service.FeaturesServiceImpl
[ERROR] <https://builds.apache.org/job/karaf-4.0.x/org.apache.karaf.features$org.apache.karaf.features.core/ws/src/main/java/org/apache/karaf/features/internal/service/FeaturesServiceImpl.java>:[358,47]
cannot find symbol
  symbol:   variable bundleContext
  location: class org.apache.karaf.features.internal.service.FeaturesServiceImpl
[INFO] 7 errors 
[INFO] -------------------------------------------------------------

Mime
View raw message