karaf-commits mailing list archives

Site index · List index
Message view « Date » · « Thread »
Top « Date » · « Thread »
From Apache Jenkins Server <jenk...@builds.apache.org>
Subject Build failed in Jenkins: karaf-4.0.x #177
Date Tue, 26 Jul 2016 13:40:06 GMT
See <https://builds.apache.org/job/karaf-4.0.x/177/>

------------------------------------------
[...truncated 594 lines...]
[INFO] Apache Karaf :: Demos .............................. SKIPPED
[INFO] Apache Karaf :: Demos :: Web ....................... SKIPPED
[INFO] Apache Karaf :: Demos :: Branding :: Shell ......... SKIPPED
[INFO] Apache Karaf :: Demos :: Command :: Extend Console . SKIPPED
[INFO] Apache Karaf :: Demos :: Demo Dump provider ........ SKIPPED
[INFO] Apache Karaf :: Demos :: Deployer .................. SKIPPED
[INFO] Apache Karaf :: Demos :: Deployer :: Kar ........... SKIPPED
[INFO] Apache Karaf :: Demos :: Deployer :: Bundle ........ SKIPPED
[INFO] Apache Karaf :: Demos :: Profiles :: Dynamic Assembly SKIPPED
[INFO] Apache Karaf :: Demos :: Profiles :: Static Assembly SKIPPED
[INFO] Apache Karaf :: Demos :: Profiles .................. SKIPPED
[INFO] Apache Karaf :: Archetypes ......................... SKIPPED
[INFO] Apache Karaf :: Archetypes :: Assembly Archetype ... SKIPPED
[INFO] Apache Karaf :: Archetypes :: Command Archetype .... SKIPPED
[INFO] Apache Karaf :: Archetypes :: Feature Archetype .... SKIPPED
[INFO] Apache Karaf :: Archetypes :: Kar Archetype ........ SKIPPED
[INFO] Apache Karaf :: Archetypes :: Bundle Archetype ..... SKIPPED
[INFO] Apache Karaf :: Archetypes :: Blueprint Archetype .. SKIPPED
[INFO] Apache Karaf :: Integration Tests .................. SKIPPED
[INFO] ------------------------------------------------------------------------
[INFO] BUILD FAILURE
[INFO] ------------------------------------------------------------------------
[INFO] Total time: 03:29 min
[INFO] Finished at: 2016-07-26T13:40:02+00:00
[INFO] Final Memory: 105M/756M
[INFO] ------------------------------------------------------------------------
Waiting for Jenkins to finish collecting data
[ERROR] Failed to execute goal org.apache.maven.plugins:maven-deploy-plugin:2.8.2:deploy (default-deploy)
on project org.apache.karaf.main: Failed to retrieve remote metadata org.apache.karaf:org.apache.karaf.main:4.0.6-SNAPSHOT/maven-metadata.xml:
Could not transfer metadata org.apache.karaf:org.apache.karaf.main:4.0.6-SNAPSHOT/maven-metadata.xml
from/to apache.snapshots.https (https://repository.apache.org/content/repositories/snapshots):
Connect to repository.apache.org:443 [repository.apache.org/207.244.88.143] failed: Connection
refused -> [Help 1]
org.apache.maven.lifecycle.LifecycleExecutionException: Failed to execute goal org.apache.maven.plugins:maven-deploy-plugin:2.8.2:deploy
(default-deploy) on project org.apache.karaf.main: Failed to retrieve remote metadata org.apache.karaf:org.apache.karaf.main:4.0.6-SNAPSHOT/maven-metadata.xml:
Could not transfer metadata org.apache.karaf:org.apache.karaf.main:4.0.6-SNAPSHOT/maven-metadata.xml
from/to apache.snapshots.https (https://repository.apache.org/content/repositories/snapshots):
Connect to repository.apache.org:443 [repository.apache.org/207.244.88.143] failed: Connection
refused
	at org.apache.maven.lifecycle.internal.MojoExecutor.execute(MojoExecutor.java:216)
	at org.apache.maven.lifecycle.internal.MojoExecutor.execute(MojoExecutor.java:153)
	at org.apache.maven.lifecycle.internal.MojoExecutor.execute(MojoExecutor.java:145)
	at org.apache.maven.lifecycle.internal.LifecycleModuleBuilder.buildProject(LifecycleModuleBuilder.java:116)
	at org.apache.maven.lifecycle.internal.LifecycleModuleBuilder.buildProject(LifecycleModuleBuilder.java:80)
	at org.apache.maven.lifecycle.internal.builder.singlethreaded.SingleThreadedBuilder.build(SingleThreadedBuilder.java:51)
	at org.apache.maven.lifecycle.internal.LifecycleStarter.execute(LifecycleStarter.java:128)
	at org.apache.maven.DefaultMaven.doExecute(DefaultMaven.java:307)
	at org.apache.maven.DefaultMaven.doExecute(DefaultMaven.java:193)
	at org.apache.maven.DefaultMaven.execute(DefaultMaven.java:106)
	at org.jvnet.hudson.maven3.launcher.Maven32Launcher.main(Maven32Launcher.java:132)
	at sun.reflect.NativeMethodAccessorImpl.invoke0(Native Method)
	at sun.reflect.NativeMethodAccessorImpl.invoke(NativeMethodAccessorImpl.java:62)
	at sun.reflect.DelegatingMethodAccessorImpl.invoke(DelegatingMethodAccessorImpl.java:43)
	at java.lang.reflect.Method.invoke(Method.java:497)
	at org.codehaus.plexus.classworlds.launcher.Launcher.launchStandard(Launcher.java:330)
	at org.codehaus.plexus.classworlds.launcher.Launcher.launch(Launcher.java:238)
	at jenkins.maven3.agent.Maven32Main.launch(Maven32Main.java:186)
	at sun.reflect.NativeMethodAccessorImpl.invoke0(Native Method)
	at sun.reflect.NativeMethodAccessorImpl.invoke(NativeMethodAccessorImpl.java:62)
	at sun.reflect.DelegatingMethodAccessorImpl.invoke(DelegatingMethodAccessorImpl.java:43)
	at java.lang.reflect.Method.invoke(Method.java:497)
	at hudson.maven.Maven3Builder.call(Maven3Builder.java:136)
	at hudson.maven.Maven3Builder.call(Maven3Builder.java:71)
	at hudson.remoting.UserRequest.perform(UserRequest.java:120)
	at hudson.remoting.UserRequest.perform(UserRequest.java:48)
	at hudson.remoting.Request$2.run(Request.java:326)
	at hudson.remoting.InterceptingExecutorService$1.call(InterceptingExecutorService.java:68)
	at java.util.concurrent.FutureTask.run(FutureTask.java:266)
	at java.util.concurrent.ThreadPoolExecutor.runWorker(ThreadPoolExecutor.java:1142)
	at java.util.concurrent.ThreadPoolExecutor$Worker.run(ThreadPoolExecutor.java:617)
	at java.lang.Thread.run(Thread.java:745)
Caused by: org.apache.maven.plugin.MojoExecutionException: Failed to retrieve remote metadata
org.apache.karaf:org.apache.karaf.main:4.0.6-SNAPSHOT/maven-metadata.xml: Could not transfer
metadata org.apache.karaf:org.apache.karaf.main:4.0.6-SNAPSHOT/maven-metadata.xml from/to
apache.snapshots.https (https://repository.apache.org/content/repositories/snapshots): Connect
to repository.apache.org:443 [repository.apache.org/207.244.88.143] failed: Connection refused
	at org.apache.maven.plugin.deploy.DeployMojo.deployProject(DeployMojo.java:284)
	at org.apache.maven.plugin.deploy.DeployMojo.execute(DeployMojo.java:169)
	at org.apache.maven.plugin.DefaultBuildPluginManager.executeMojo(DefaultBuildPluginManager.java:134)
	at org.apache.maven.lifecycle.internal.MojoExecutor.execute(MojoExecutor.java:208)
	... 31 more
Caused by: org.apache.maven.artifact.deployer.ArtifactDeploymentException: Failed to retrieve
remote metadata org.apache.karaf:org.apache.karaf.main:4.0.6-SNAPSHOT/maven-metadata.xml:
Could not transfer metadata org.apache.karaf:org.apache.karaf.main:4.0.6-SNAPSHOT/maven-metadata.xml
from/to apache.snapshots.https (https://repository.apache.org/content/repositories/snapshots):
Connect to repository.apache.org:443 [repository.apache.org/207.244.88.143] failed: Connection
refused
	at org.apache.maven.artifact.deployer.DefaultArtifactDeployer.deploy(DefaultArtifactDeployer.java:143)
	at org.apache.maven.plugin.deploy.AbstractDeployMojo.deploy(AbstractDeployMojo.java:171)
	at org.apache.maven.plugin.deploy.DeployMojo.deployProject(DeployMojo.java:250)
	... 34 more
Caused by: org.eclipse.aether.deployment.DeploymentException: Failed to retrieve remote metadata
org.apache.karaf:org.apache.karaf.main:4.0.6-SNAPSHOT/maven-metadata.xml: Could not transfer
metadata org.apache.karaf:org.apache.karaf.main:4.0.6-SNAPSHOT/maven-metadata.xml from/to
apache.snapshots.https (https://repository.apache.org/content/repositories/snapshots): Connect
to repository.apache.org:443 [repository.apache.org/207.244.88.143] failed: Connection refused
	at org.eclipse.aether.internal.impl.DefaultDeployer.upload(DefaultDeployer.java:447)
	at org.eclipse.aether.internal.impl.DefaultDeployer.deploy(DefaultDeployer.java:290)
	at org.eclipse.aether.internal.impl.DefaultDeployer.deploy(DefaultDeployer.java:245)
	at org.eclipse.aether.internal.impl.DefaultRepositorySystem.deploy(DefaultRepositorySystem.java:413)
	at org.apache.maven.artifact.deployer.DefaultArtifactDeployer.deploy(DefaultArtifactDeployer.java:139)
	... 36 more
Caused by: org.eclipse.aether.transfer.MetadataTransferException: Could not transfer metadata
org.apache.karaf:org.apache.karaf.main:4.0.6-SNAPSHOT/maven-metadata.xml from/to apache.snapshots.https
(https://repository.apache.org/content/repositories/snapshots): Connect to repository.apache.org:443
[repository.apache.org/207.244.88.143] failed: Connection refused
	at org.eclipse.aether.connector.basic.MetadataTransportListener.transferFailed(MetadataTransportListener.java:43)
	at org.eclipse.aether.connector.basic.BasicRepositoryConnector$TaskRunner.run(BasicRepositoryConnector.java:355)
	at org.eclipse.aether.util.concurrency.RunnableErrorForwarder$1.run(RunnableErrorForwarder.java:67)
	at org.eclipse.aether.connector.basic.BasicRepositoryConnector$DirectExecutor.execute(BasicRepositoryConnector.java:581)
	at org.eclipse.aether.connector.basic.BasicRepositoryConnector.get(BasicRepositoryConnector.java:222)
	at org.eclipse.aether.internal.impl.DefaultDeployer.upload(DefaultDeployer.java:417)
	... 40 more
Caused by: org.apache.maven.wagon.TransferFailedException: Connect to repository.apache.org:443
[repository.apache.org/207.244.88.143] failed: Connection refused
	at org.apache.maven.wagon.providers.http.AbstractHttpClientWagon.fillInputData(AbstractHttpClientWagon.java:1066)
	at org.apache.maven.wagon.providers.http.AbstractHttpClientWagon.fillInputData(AbstractHttpClientWagon.java:960)
	at org.apache.maven.wagon.StreamWagon.getInputStream(StreamWagon.java:116)
	at org.apache.maven.wagon.StreamWagon.getIfNewer(StreamWagon.java:88)
	at org.apache.maven.wagon.StreamWagon.get(StreamWagon.java:61)
	at org.eclipse.aether.transport.wagon.WagonTransporter$GetTaskRunner.run(WagonTransporter.java:560)
	at org.eclipse.aether.transport.wagon.WagonTransporter.execute(WagonTransporter.java:427)
	at org.eclipse.aether.transport.wagon.WagonTransporter.get(WagonTransporter.java:404)
	at org.eclipse.aether.connector.basic.BasicRepositoryConnector$GetTaskRunner.runTask(BasicRepositoryConnector.java:447)
	at org.eclipse.aether.connector.basic.BasicRepositoryConnector$TaskRunner.run(BasicRepositoryConnector.java:350)
	... 44 more
Caused by: org.apache.maven.wagon.providers.http.httpclient.conn.HttpHostConnectException:
Connect to repository.apache.org:443 [repository.apache.org/207.244.88.143] failed: Connection
refused
	at org.apache.maven.wagon.providers.http.httpclient.impl.conn.HttpClientConnectionOperator.connect(HttpClientConnectionOperator.java:140)
	at org.apache.maven.wagon.providers.http.httpclient.impl.conn.PoolingHttpClientConnectionManager.connect(PoolingHttpClientConnectionManager.java:318)
	at org.apache.maven.wagon.providers.http.httpclient.impl.execchain.MainClientExec.establishRoute(MainClientExec.java:363)
	at org.apache.maven.wagon.providers.http.httpclient.impl.execchain.MainClientExec.execute(MainClientExec.java:219)
	at org.apache.maven.wagon.providers.http.httpclient.impl.execchain.ProtocolExec.execute(ProtocolExec.java:195)
	at org.apache.maven.wagon.providers.http.httpclient.impl.execchain.RetryExec.execute(RetryExec.java:86)
	at org.apache.maven.wagon.providers.http.httpclient.impl.execchain.RedirectExec.execute(RedirectExec.java:108)
	at org.apache.maven.wagon.providers.http.httpclient.impl.client.InternalHttpClient.doExecute(InternalHttpClient.java:184)
	at org.apache.maven.wagon.providers.http.httpclient.impl.client.CloseableHttpClient.execute(CloseableHttpClient.java:82)
	at org.apache.maven.wagon.providers.http.AbstractHttpClientWagon.execute(AbstractHttpClientWagon.java:832)
	at org.apache.maven.wagon.providers.http.AbstractHttpClientWagon.fillInputData(AbstractHttpClientWagon.java:983)
	... 53 more
Caused by: java.net.ConnectException: Connection refused
	at java.net.PlainSocketImpl.socketConnect(Native Method)
	at java.net.AbstractPlainSocketImpl.doConnect(AbstractPlainSocketImpl.java:350)
	at java.net.AbstractPlainSocketImpl.connectToAddress(AbstractPlainSocketImpl.java:206)
	at java.net.AbstractPlainSocketImpl.connect(AbstractPlainSocketImpl.java:188)
	at java.net.SocksSocketImpl.connect(SocksSocketImpl.java:392)
	at java.net.Socket.connect(Socket.java:589)
	at org.apache.maven.wagon.providers.http.httpclient.conn.ssl.SSLConnectionSocketFactory.connectSocket(SSLConnectionSocketFactory.java:239)
	at org.apache.maven.wagon.providers.http.httpclient.impl.conn.HttpClientConnectionOperator.connect(HttpClientConnectionOperator.java:123)
	... 63 more
[ERROR] 
[ERROR] Re-run Maven using the -X switch to enable full debug logging.
[ERROR] 
[ERROR] For more information about the errors and possible solutions, please read the following
articles:
[ERROR] [Help 1] http://cwiki.apache.org/confluence/display/MAVEN/MojoExecutionException
[ERROR] 
[ERROR] After correcting the problems, you can resume the build with the command
[ERROR]   mvn <goals> -rf :org.apache.karaf.main
[JENKINS] Archiving <https://builds.apache.org/job/karaf-4.0.x/ws/deployer/wrap/pom.xml>
to org.apache.karaf.deployer/org.apache.karaf.deployer.wrap/4.0.6-SNAPSHOT/org.apache.karaf.deployer.wrap-4.0.6-SNAPSHOT.pom
[JENKINS] Archiving <https://builds.apache.org/job/karaf-4.0.x/ws/jaas/config/pom.xml>
to org.apache.karaf.jaas/org.apache.karaf.jaas.config/4.0.6-SNAPSHOT/org.apache.karaf.jaas.config-4.0.6-SNAPSHOT.pom
[JENKINS] Archiving <https://builds.apache.org/job/karaf-4.0.x/ws/webconsole/pom.xml>
to org.apache.karaf.webconsole/webconsole/4.0.6-SNAPSHOT/webconsole-4.0.6-SNAPSHOT.pom
[JENKINS] Archiving <https://builds.apache.org/job/karaf-4.0.x/ws/archetypes/pom.xml>
to org.apache.karaf/archetypes/4.0.6-SNAPSHOT/archetypes-4.0.6-SNAPSHOT.pom
[JENKINS] Archiving <https://builds.apache.org/job/karaf-4.0.x/ws/archetypes/command/pom.xml>
to org.apache.karaf.archetypes/karaf-command-archetype/4.0.6-SNAPSHOT/karaf-command-archetype-4.0.6-SNAPSHOT.pom
[JENKINS] Archiving <https://builds.apache.org/job/karaf-4.0.x/ws/scr/command/pom.xml>
to org.apache.karaf.scr/org.apache.karaf.scr.command/4.0.6-SNAPSHOT/org.apache.karaf.scr.command-4.0.6-SNAPSHOT.pom
[JENKINS] Archiving <https://builds.apache.org/job/karaf-4.0.x/ws/service/guard/pom.xml>
to org.apache.karaf.service/org.apache.karaf.service.guard/4.0.6-SNAPSHOT/org.apache.karaf.service.guard-4.0.6-SNAPSHOT.pom
[JENKINS] Archiving <https://builds.apache.org/job/karaf-4.0.x/ws/features/core/pom.xml>
to org.apache.karaf.features/org.apache.karaf.features.core/4.0.6-SNAPSHOT/org.apache.karaf.features.core-4.0.6-SNAPSHOT.pom
[JENKINS] Archiving <https://builds.apache.org/job/karaf-4.0.x/ws/main/pom.xml> to org.apache.karaf/org.apache.karaf.main/4.0.6-SNAPSHOT/org.apache.karaf.main-4.0.6-SNAPSHOT.pom
[JENKINS] Archiving <https://builds.apache.org/job/karaf-4.0.x/ws/main/target/org.apache.karaf.main-4.0.6-SNAPSHOT.jar>
to org.apache.karaf/org.apache.karaf.main/4.0.6-SNAPSHOT/org.apache.karaf.main-4.0.6-SNAPSHOT.jar
[JENKINS] Archiving <https://builds.apache.org/job/karaf-4.0.x/ws/assemblies/features/base/pom.xml>
to org.apache.karaf.features/base/4.0.6-SNAPSHOT/base-4.0.6-SNAPSHOT.pom
[JENKINS] Archiving <https://builds.apache.org/job/karaf-4.0.x/ws/deployer/blueprint/pom.xml>
to org.apache.karaf.deployer/org.apache.karaf.deployer.blueprint/4.0.6-SNAPSHOT/org.apache.karaf.deployer.blueprint-4.0.6-SNAPSHOT.pom
[JENKINS] Archiving <https://builds.apache.org/job/karaf-4.0.x/ws/scr/pom.xml> to org.apache.karaf.scr/scr/4.0.6-SNAPSHOT/scr-4.0.6-SNAPSHOT.pom
[JENKINS] Archiving <https://builds.apache.org/job/karaf-4.0.x/ws/demos/deployer/bundle/pom.xml>
to org.apache.karaf.demos.deployer.bundle/my-bundle/4.0.6-SNAPSHOT/my-bundle-4.0.6-SNAPSHOT.pom
[JENKINS] Archiving <https://builds.apache.org/job/karaf-4.0.x/ws/features/pom.xml>
to org.apache.karaf.features/features/4.0.6-SNAPSHOT/features-4.0.6-SNAPSHOT.pom
[JENKINS] Archiving <https://builds.apache.org/job/karaf-4.0.x/ws/services/eventadmin/pom.xml>
to org.apache.karaf.services/org.apache.karaf.services.eventadmin/4.0.6-SNAPSHOT/org.apache.karaf.services.eventadmin-4.0.6-SNAPSHOT.pom
[JENKINS] Archiving <https://builds.apache.org/job/karaf-4.0.x/ws/assemblies/features/static/pom.xml>
to org.apache.karaf.features/static/4.0.6-SNAPSHOT/static-4.0.6-SNAPSHOT.pom
[JENKINS] Archiving <https://builds.apache.org/job/karaf-4.0.x/ws/subsystem/pom.xml>
to org.apache.karaf.subsystem/org.apache.karaf.subsystem.core/4.0.6-SNAPSHOT/org.apache.karaf.subsystem.core-4.0.6-SNAPSHOT.pom
[JENKINS] Archiving <https://builds.apache.org/job/karaf-4.0.x/ws/bundle/pom.xml> to
org.apache.karaf.bundle/bundle/4.0.6-SNAPSHOT/bundle-4.0.6-SNAPSHOT.pom
[JENKINS] Archiving <https://builds.apache.org/job/karaf-4.0.x/ws/assemblies/features/standard/pom.xml>
to org.apache.karaf.features/standard/4.0.6-SNAPSHOT/standard-4.0.6-SNAPSHOT.pom
[JENKINS] Archiving <https://builds.apache.org/job/karaf-4.0.x/ws/assemblies/demos/pom.xml>
to org.apache.karaf/demos/4.0.6-SNAPSHOT/demos-4.0.6-SNAPSHOT.pom
[JENKINS] Archiving <https://builds.apache.org/job/karaf-4.0.x/ws/jaas/modules/pom.xml>
to org.apache.karaf.jaas/org.apache.karaf.jaas.modules/4.0.6-SNAPSHOT/org.apache.karaf.jaas.modules-4.0.6-SNAPSHOT.pom
[JENKINS] Archiving <https://builds.apache.org/job/karaf-4.0.x/ws/webconsole/features/pom.xml>
to org.apache.karaf.webconsole/org.apache.karaf.webconsole.features/4.0.6-SNAPSHOT/org.apache.karaf.webconsole.features-4.0.6-SNAPSHOT.pom
[JENKINS] Archiving <https://builds.apache.org/job/karaf-4.0.x/ws/tooling/karaf-services-maven-plugin/pom.xml>
to org.apache.karaf.tooling/karaf-services-maven-plugin/4.0.6-SNAPSHOT/karaf-services-maven-plugin-4.0.6-SNAPSHOT.pom
[JENKINS] Archiving <https://builds.apache.org/job/karaf-4.0.x/ws/bundle/core/pom.xml>
to org.apache.karaf.bundle/org.apache.karaf.bundle.core/4.0.6-SNAPSHOT/org.apache.karaf.bundle.core-4.0.6-SNAPSHOT.pom
[JENKINS] Archiving <https://builds.apache.org/job/karaf-4.0.x/ws/tooling/pom.xml> to
org.apache.karaf.tooling/tooling/4.0.6-SNAPSHOT/tooling-4.0.6-SNAPSHOT.pom
[JENKINS] Archiving <https://builds.apache.org/job/karaf-4.0.x/ws/features/command/pom.xml>
to org.apache.karaf.features/org.apache.karaf.features.command/4.0.6-SNAPSHOT/org.apache.karaf.features.command-4.0.6-SNAPSHOT.pom
[JENKINS] Archiving <https://builds.apache.org/job/karaf-4.0.x/ws/jaas/blueprint/jasypt/pom.xml>
to org.apache.karaf.jaas.blueprint/org.apache.karaf.jaas.blueprint.jasypt/4.0.6-SNAPSHOT/org.apache.karaf.jaas.blueprint.jasypt-4.0.6-SNAPSHOT.pom
[JENKINS] Archiving <https://builds.apache.org/job/karaf-4.0.x/ws/diagnostic/boot/pom.xml>
to org.apache.karaf.diagnostic/org.apache.karaf.diagnostic.boot/4.0.6-SNAPSHOT/org.apache.karaf.diagnostic.boot-4.0.6-SNAPSHOT.pom
[JENKINS] Archiving <https://builds.apache.org/job/karaf-4.0.x/ws/deployer/kar/pom.xml>
to org.apache.karaf.deployer/org.apache.karaf.deployer.kar/4.0.6-SNAPSHOT/org.apache.karaf.deployer.kar-4.0.6-SNAPSHOT.pom
[JENKINS] Archiving <https://builds.apache.org/job/karaf-4.0.x/ws/itests/pom.xml> to
org.apache.karaf.itests/itests/4.0.6-SNAPSHOT/itests-4.0.6-SNAPSHOT.pom
[JENKINS] Archiving <https://builds.apache.org/job/karaf-4.0.x/ws/demos/profiles/dynamic/pom.xml>
to org.apache.karaf.demos.profiles/dynamic/4.0.6-SNAPSHOT/dynamic-4.0.6-SNAPSHOT.pom
[JENKINS] Archiving <https://builds.apache.org/job/karaf-4.0.x/ws/kar/pom.xml> to org.apache.karaf.kar/org.apache.karaf.kar.core/4.0.6-SNAPSHOT/org.apache.karaf.kar.core-4.0.6-SNAPSHOT.pom
[JENKINS] Archiving <https://builds.apache.org/job/karaf-4.0.x/ws/management/server/pom.xml>
to org.apache.karaf.management/org.apache.karaf.management.server/4.0.6-SNAPSHOT/org.apache.karaf.management.server-4.0.6-SNAPSHOT.pom
[JENKINS] Archiving <https://builds.apache.org/job/karaf-4.0.x/ws/jaas/blueprint/config/pom.xml>
to org.apache.karaf.jaas.blueprint/org.apache.karaf.jaas.blueprint.config/4.0.6-SNAPSHOT/org.apache.karaf.jaas.blueprint.config-4.0.6-SNAPSHOT.pom
[JENKINS] Archiving <https://builds.apache.org/job/karaf-4.0.x/ws/scr/examples/pom.xml>
to org.apache.karaf.scr/org.apache.karaf.scr.examples/4.0.6-SNAPSHOT/org.apache.karaf.scr.examples-4.0.6-SNAPSHOT.pom
[JENKINS] Archiving <https://builds.apache.org/job/karaf-4.0.x/ws/scr/examples/managed-service/pom.xml>
to org.apache.karaf.scr.examples/org.apache.karaf.scr.examples.managed.service/4.0.6-SNAPSHOT/org.apache.karaf.scr.examples.managed.service-4.0.6-SNAPSHOT.pom
[JENKINS] Archiving <https://builds.apache.org/job/karaf-4.0.x/ws/jpa/hibernate/pom.xml>
to org.apache.karaf.jpa/hibernate/4.0.6-SNAPSHOT/hibernate-4.0.6-SNAPSHOT.pom
[JENKINS] Archiving <https://builds.apache.org/job/karaf-4.0.x/ws/scr/examples/service/pom.xml>
to org.apache.karaf.scr.examples/org.apache.karaf.scr.examples.service/4.0.6-SNAPSHOT/org.apache.karaf.scr.examples.service-4.0.6-SNAPSHOT.pom
[JENKINS] Archiving <https://builds.apache.org/job/karaf-4.0.x/ws/bundle/blueprintstate/pom.xml>
to org.apache.karaf.bundle/org.apache.karaf.bundle.blueprintstate/4.0.6-SNAPSHOT/org.apache.karaf.bundle.blueprintstate-4.0.6-SNAPSHOT.pom
[JENKINS] Archiving <https://builds.apache.org/job/karaf-4.0.x/ws/jms/pom.xml> to org.apache.karaf.jms/parent/4.0.6-SNAPSHOT/parent-4.0.6-SNAPSHOT.pom
[JENKINS] Archiving <https://builds.apache.org/job/karaf-4.0.x/ws/assemblies/features/spring/pom.xml>
to org.apache.karaf.features/spring/4.0.6-SNAPSHOT/spring-4.0.6-SNAPSHOT.pom
[JENKINS] Archiving <https://builds.apache.org/job/karaf-4.0.x/ws/jndi/pom.xml> to org.apache.karaf.jndi/org.apache.karaf.jndi.core/4.0.6-SNAPSHOT/org.apache.karaf.jndi.core-4.0.6-SNAPSHOT.pom
[JENKINS] Archiving <https://builds.apache.org/job/karaf-4.0.x/ws/assemblies/features/pom.xml>
to org.apache.karaf.assemblies.features/features/4.0.6-SNAPSHOT/features-4.0.6-SNAPSHOT.pom
[JENKINS] Archiving <https://builds.apache.org/job/karaf-4.0.x/ws/demos/profiles/pom.xml>
to org.apache.karaf.demos.profiles/profiles/4.0.6-SNAPSHOT/profiles-4.0.6-SNAPSHOT.pom
[JENKINS] Archiving <https://builds.apache.org/job/karaf-4.0.x/ws/config/pom.xml> to
org.apache.karaf.config/org.apache.karaf.config.core/4.0.6-SNAPSHOT/org.apache.karaf.config.core-4.0.6-SNAPSHOT.pom
[JENKINS] Archiving <https://builds.apache.org/job/karaf-4.0.x/ws/shell/core/pom.xml>
to org.apache.karaf.shell/org.apache.karaf.shell.core/4.0.6-SNAPSHOT/org.apache.karaf.shell.core-4.0.6-SNAPSHOT.pom
[JENKINS] Archiving <https://builds.apache.org/job/karaf-4.0.x/ws/package/pom.xml> to
org.apache.karaf.package/org.apache.karaf.package.core/4.0.6-SNAPSHOT/org.apache.karaf.package.core-4.0.6-SNAPSHOT.pom
[JENKINS] Archiving <https://builds.apache.org/job/karaf-4.0.x/ws/system/pom.xml> to
org.apache.karaf.system/org.apache.karaf.system.core/4.0.6-SNAPSHOT/org.apache.karaf.system.core-4.0.6-SNAPSHOT.pom
[JENKINS] Archiving <https://builds.apache.org/job/karaf-4.0.x/ws/jaas/blueprint/pom.xml>
to org.apache.karaf.jaas.blueprint/blueprint/4.0.6-SNAPSHOT/blueprint-4.0.6-SNAPSHOT.pom
[JENKINS] Archiving <https://builds.apache.org/job/karaf-4.0.x/ws/jaas/pom.xml> to org.apache.karaf.jaas/jaas/4.0.6-SNAPSHOT/jaas-4.0.6-SNAPSHOT.pom
[JENKINS] Archiving <https://builds.apache.org/job/karaf-4.0.x/ws/demos/command/pom.xml>
to org.apache.karaf.demos/org.apache.karaf.demos.command/4.0.6-SNAPSHOT/org.apache.karaf.demos.command-4.0.6-SNAPSHOT.pom
[JENKINS] Archiving <https://builds.apache.org/job/karaf-4.0.x/ws/webconsole/console/pom.xml>
to org.apache.karaf.webconsole/org.apache.karaf.webconsole.console/4.0.6-SNAPSHOT/org.apache.karaf.webconsole.console-4.0.6-SNAPSHOT.pom
[JENKINS] Archiving <https://builds.apache.org/job/karaf-4.0.x/ws/services/coordinator/pom.xml>
to org.apache.karaf.services/org.apache.karaf.services.coordinator/4.0.6-SNAPSHOT/org.apache.karaf.services.coordinator-4.0.6-SNAPSHOT.pom
[JENKINS] Archiving <https://builds.apache.org/job/karaf-4.0.x/ws/util/pom.xml> to org.apache.karaf/org.apache.karaf.util/4.0.6-SNAPSHOT/org.apache.karaf.util-4.0.6-SNAPSHOT.pom
[JENKINS] Archiving <https://builds.apache.org/job/karaf-4.0.x/ws/util/target/org.apache.karaf.util-4.0.6-SNAPSHOT.jar>
to org.apache.karaf/org.apache.karaf.util/4.0.6-20160726.133918-66/org.apache.karaf.util-4.0.6-20160726.133918-66.jar
[JENKINS] Archiving <https://builds.apache.org/job/karaf-4.0.x/ws/web/pom.xml> to org.apache.karaf.web/org.apache.karaf.web.core/4.0.6-SNAPSHOT/org.apache.karaf.web.core-4.0.6-SNAPSHOT.pom
[JENKINS] Archiving <https://builds.apache.org/job/karaf-4.0.x/ws/shell/console/pom.xml>
to org.apache.karaf.shell/org.apache.karaf.shell.console/4.0.6-SNAPSHOT/org.apache.karaf.shell.console-4.0.6-SNAPSHOT.pom
[JENKINS] Archiving <https://builds.apache.org/job/karaf-4.0.x/ws/service/core/pom.xml>
to org.apache.karaf.service/org.apache.karaf.service.core/4.0.6-SNAPSHOT/org.apache.karaf.service.core-4.0.6-SNAPSHOT.pom
[JENKINS] Archiving <https://builds.apache.org/job/karaf-4.0.x/ws/instance/pom.xml>
to org.apache.karaf.instance/org.apache.karaf.instance.core/4.0.6-SNAPSHOT/org.apache.karaf.instance.core-4.0.6-SNAPSHOT.pom
[JENKINS] Archiving <https://builds.apache.org/job/karaf-4.0.x/ws/diagnostic/pom.xml>
to org.apache.karaf.diagnostic/diagnostic/4.0.6-SNAPSHOT/diagnostic-4.0.6-SNAPSHOT.pom
[JENKINS] Archiving <https://builds.apache.org/job/karaf-4.0.x/ws/obr/pom.xml> to org.apache.karaf.obr/org.apache.karaf.obr.core/4.0.6-SNAPSHOT/org.apache.karaf.obr.core-4.0.6-SNAPSHOT.pom
[JENKINS] Archiving <https://builds.apache.org/job/karaf-4.0.x/ws/archetypes/feature/pom.xml>
to org.apache.karaf.archetypes/karaf-feature-archetype/4.0.6-SNAPSHOT/karaf-feature-archetype-4.0.6-SNAPSHOT.pom
[JENKINS] Archiving <https://builds.apache.org/job/karaf-4.0.x/ws/demos/pom.xml> to
org.apache.karaf.demos/demos/4.0.6-SNAPSHOT/demos-4.0.6-SNAPSHOT.pom
[JENKINS] Archiving <https://builds.apache.org/job/karaf-4.0.x/ws/http/pom.xml> to org.apache.karaf.http/org.apache.karaf.http.core/4.0.6-SNAPSHOT/org.apache.karaf.http.core-4.0.6-SNAPSHOT.pom
[JENKINS] Archiving <https://builds.apache.org/job/karaf-4.0.x/ws/demos/branding/pom.xml>
to org.apache.karaf.demos/org.apache.karaf.demos.branding.shell/4.0.6-SNAPSHOT/org.apache.karaf.demos.branding.shell-4.0.6-SNAPSHOT.pom
[JENKINS] Archiving <https://builds.apache.org/job/karaf-4.0.x/ws/tooling/utils/pom.xml>
to org.apache.karaf.tooling/org.apache.karaf.tools.utils/4.0.6-SNAPSHOT/org.apache.karaf.tools.utils-4.0.6-SNAPSHOT.pom
[JENKINS] Archiving <https://builds.apache.org/job/karaf-4.0.x/ws/services/staticcm/pom.xml>
to org.apache.karaf.services/org.apache.karaf.services.staticcm/4.0.6-SNAPSHOT/org.apache.karaf.services.staticcm-4.0.6-SNAPSHOT.pom
[JENKINS] Archiving <https://builds.apache.org/job/karaf-4.0.x/ws/jaas/command/pom.xml>
to org.apache.karaf.jaas/org.apache.karaf.jaas.command/4.0.6-SNAPSHOT/org.apache.karaf.jaas.command-4.0.6-SNAPSHOT.pom
[JENKINS] Archiving <https://builds.apache.org/job/karaf-4.0.x/ws/demos/profiles/static/pom.xml>
to org.apache.karaf.demos.profiles/static/4.0.6-SNAPSHOT/static-4.0.6-SNAPSHOT.pom
[JENKINS] Archiving <https://builds.apache.org/job/karaf-4.0.x/ws/service/pom.xml> to
org.apache.karaf.service/service/4.0.6-SNAPSHOT/service-4.0.6-SNAPSHOT.pom
[JENKINS] Archiving <https://builds.apache.org/job/karaf-4.0.x/ws/wrapper/pom.xml> to
org.apache.karaf.wrapper/org.apache.karaf.wrapper.core/4.0.6-SNAPSHOT/org.apache.karaf.wrapper.core-4.0.6-SNAPSHOT.pom
[JENKINS] Archiving <https://builds.apache.org/job/karaf-4.0.x/ws/demos/deployer/pom.xml>
to org.apache.karaf.demos/org.apache.karaf.demos.deployer/4.0.6-SNAPSHOT/org.apache.karaf.demos.deployer-4.0.6-SNAPSHOT.pom
[JENKINS] Archiving <https://builds.apache.org/job/karaf-4.0.x/ws/assemblies/pom.xml>
to org.apache.karaf.assemblies/assemblies/4.0.6-SNAPSHOT/assemblies-4.0.6-SNAPSHOT.pom
[JENKINS] Archiving <https://builds.apache.org/job/karaf-4.0.x/ws/jaas/boot/pom.xml>
to org.apache.karaf.jaas/org.apache.karaf.jaas.boot/4.0.6-SNAPSHOT/org.apache.karaf.jaas.boot-4.0.6-SNAPSHOT.pom
[JENKINS] Archiving <https://builds.apache.org/job/karaf-4.0.x/ws/jaas/boot/target/org.apache.karaf.jaas.boot-4.0.6-SNAPSHOT.jar>
to org.apache.karaf.jaas/org.apache.karaf.jaas.boot/4.0.6-20160726.133904-66/org.apache.karaf.jaas.boot-4.0.6-20160726.133904-66.jar
[JENKINS] Archiving <https://builds.apache.org/job/karaf-4.0.x/ws/demos/profiles/registry/pom.xml>
to org.apache.karaf.demos.profiles/registry/4.0.6-SNAPSHOT/registry-4.0.6-SNAPSHOT.pom
[JENKINS] Archiving <https://builds.apache.org/job/karaf-4.0.x/ws/assemblies/features/enterprise/pom.xml>
to org.apache.karaf.features/enterprise/4.0.6-SNAPSHOT/enterprise-4.0.6-SNAPSHOT.pom
[JENKINS] Archiving <https://builds.apache.org/job/karaf-4.0.x/ws/webconsole/gogo/pom.xml>
to org.apache.karaf.webconsole/org.apache.karaf.webconsole.gogo/4.0.6-SNAPSHOT/org.apache.karaf.webconsole.gogo-4.0.6-SNAPSHOT.pom
[JENKINS] Archiving <https://builds.apache.org/job/karaf-4.0.x/ws/bundle/springstate/pom.xml>
to org.apache.karaf.bundle/org.apache.karaf.bundle.springstate/4.0.6-SNAPSHOT/org.apache.karaf.bundle.springstate-4.0.6-SNAPSHOT.pom
[JENKINS] Archiving <https://builds.apache.org/job/karaf-4.0.x/ws/log/pom.xml> to org.apache.karaf.log/org.apache.karaf.log.core/4.0.6-SNAPSHOT/org.apache.karaf.log.core-4.0.6-SNAPSHOT.pom
[JENKINS] Archiving <https://builds.apache.org/job/karaf-4.0.x/ws/demos/deployer/kar/pom.xml>
to org.apache.karaf.demos/my-kar/4.0.6-SNAPSHOT/my-kar-4.0.6-SNAPSHOT.pom
[JENKINS] Archiving <https://builds.apache.org/job/karaf-4.0.x/ws/shell/table/pom.xml>
to org.apache.karaf.shell/org.apache.karaf.shell.table/4.0.6-SNAPSHOT/org.apache.karaf.shell.table-4.0.6-SNAPSHOT.pom
[JENKINS] Archiving <https://builds.apache.org/job/karaf-4.0.x/ws/shell/commands/pom.xml>
to org.apache.karaf.shell/org.apache.karaf.shell.commands/4.0.6-SNAPSHOT/org.apache.karaf.shell.commands-4.0.6-SNAPSHOT.pom
[JENKINS] Archiving <https://builds.apache.org/job/karaf-4.0.x/ws/tooling/karaf-maven-plugin/pom.xml>
to org.apache.karaf.tooling/karaf-maven-plugin/4.0.6-SNAPSHOT/karaf-maven-plugin-4.0.6-SNAPSHOT.pom
[JENKINS] Archiving <https://builds.apache.org/job/karaf-4.0.x/ws/demos/web/pom.xml>
to org.apache.karaf.demos/web/4.0.6-SNAPSHOT/web-4.0.6-SNAPSHOT.pom
[JENKINS] Archiving <https://builds.apache.org/job/karaf-4.0.x/ws/jms/core/pom.xml>
to org.apache.karaf.jms/org.apache.karaf.jms.core/4.0.6-SNAPSHOT/org.apache.karaf.jms.core-4.0.6-SNAPSHOT.pom
[JENKINS] Archiving <https://builds.apache.org/job/karaf-4.0.x/ws/demos/dump/pom.xml>
to org.apache.karaf.demos/dump/4.0.6-SNAPSHOT/dump-4.0.6-SNAPSHOT.pom
[JENKINS] Archiving <https://builds.apache.org/job/karaf-4.0.x/ws/jpa/pom.xml> to org.apache.karaf.jpa/jpa-parent/4.0.6-SNAPSHOT/jpa-parent-4.0.6-SNAPSHOT.pom
[JENKINS] Archiving <https://builds.apache.org/job/karaf-4.0.x/ws/webconsole/instance/pom.xml>
to org.apache.karaf.webconsole/org.apache.karaf.webconsole.instance/4.0.6-SNAPSHOT/org.apache.karaf.webconsole.instance-4.0.6-SNAPSHOT.pom
[JENKINS] Archiving <https://builds.apache.org/job/karaf-4.0.x/ws/assemblies/apache-karaf-minimal/pom.xml>
to org.apache.karaf/apache-karaf-minimal/4.0.6-SNAPSHOT/apache-karaf-minimal-4.0.6-SNAPSHOT.pom
[JENKINS] Archiving <https://builds.apache.org/job/karaf-4.0.x/ws/exception/pom.xml>
to org.apache.karaf/org.apache.karaf.exception/4.0.6-SNAPSHOT/org.apache.karaf.exception-4.0.6-SNAPSHOT.pom
[JENKINS] Archiving <https://builds.apache.org/job/karaf-4.0.x/ws/shell/pom.xml> to
org.apache.karaf.shell/shell/4.0.6-SNAPSHOT/shell-4.0.6-SNAPSHOT.pom
[JENKINS] Archiving <https://builds.apache.org/job/karaf-4.0.x/ws/archetypes/bundle/pom.xml>
to org.apache.karaf.archetypes/karaf-bundle-archetype/4.0.6-SNAPSHOT/karaf-bundle-archetype-4.0.6-SNAPSHOT.pom
[JENKINS] Archiving <https://builds.apache.org/job/karaf-4.0.x/ws/profile/pom.xml> to
org.apache.karaf.profile/org.apache.karaf.profile.core/4.0.6-SNAPSHOT/org.apache.karaf.profile.core-4.0.6-SNAPSHOT.pom
[JENKINS] Archiving <https://builds.apache.org/job/karaf-4.0.x/ws/pom.xml> to org.apache.karaf/karaf/4.0.6-SNAPSHOT/karaf-4.0.6-SNAPSHOT.pom
Compressed 102.13 KB of artifacts by 94.0% relative to #176
[JENKINS] Archiving <https://builds.apache.org/job/karaf-4.0.x/ws/archetypes/assembly/pom.xml>
to org.apache.karaf.archetypes/karaf-assembly-archetype/4.0.6-SNAPSHOT/karaf-assembly-archetype-4.0.6-SNAPSHOT.pom
[JENKINS] Archiving <https://builds.apache.org/job/karaf-4.0.x/ws/jms/activemq-cf/pom.xml>
to org.apache.karaf.jms/org.apache.karaf.jms.activemq-cf/4.0.6-SNAPSHOT/org.apache.karaf.jms.activemq-cf-4.0.6-SNAPSHOT.pom
[JENKINS] Archiving <https://builds.apache.org/job/karaf-4.0.x/ws/management/pom.xml>
to org.apache.karaf.management/management/4.0.6-SNAPSHOT/management-4.0.6-SNAPSHOT.pom
[JENKINS] Archiving <https://builds.apache.org/job/karaf-4.0.x/ws/assemblies/features/framework/pom.xml>
to org.apache.karaf.features/framework/4.0.6-SNAPSHOT/framework-4.0.6-SNAPSHOT.pom
[JENKINS] Archiving <https://builds.apache.org/job/karaf-4.0.x/ws/archetypes/blueprint/pom.xml>
to org.apache.karaf.archetypes/karaf-blueprint-archetype/4.0.6-SNAPSHOT/karaf-blueprint-archetype-4.0.6-SNAPSHOT.pom
[JENKINS] Archiving <https://builds.apache.org/job/karaf-4.0.x/ws/scheduler/pom.xml>
to org.apache.karaf.scheduler/org.apache.karaf.scheduler.core/4.0.6-SNAPSHOT/org.apache.karaf.scheduler.core-4.0.6-SNAPSHOT.pom
[JENKINS] Archiving <https://builds.apache.org/job/karaf-4.0.x/ws/deployer/spring/pom.xml>
to org.apache.karaf.deployer/org.apache.karaf.deployer.spring/4.0.6-SNAPSHOT/org.apache.karaf.deployer.spring-4.0.6-SNAPSHOT.pom
[JENKINS] Archiving <https://builds.apache.org/job/karaf-4.0.x/ws/jaas/jasypt/pom.xml>
to org.apache.karaf.jaas/org.apache.karaf.jaas.jasypt/4.0.6-SNAPSHOT/org.apache.karaf.jaas.jasypt-4.0.6-SNAPSHOT.pom
[JENKINS] Archiving <https://builds.apache.org/job/karaf-4.0.x/ws/scr/examples/component-factory/pom.xml>
to org.apache.karaf.scr.examples/org.apache.karaf.scr.examples.component.factories/4.0.6-SNAPSHOT/org.apache.karaf.scr.examples.component.factories-4.0.6-SNAPSHOT.pom
[JENKINS] Archiving <https://builds.apache.org/job/karaf-4.0.x/ws/diagnostic/core/pom.xml>
to org.apache.karaf.diagnostic/org.apache.karaf.diagnostic.core/4.0.6-SNAPSHOT/org.apache.karaf.diagnostic.core-4.0.6-SNAPSHOT.pom
[JENKINS] Archiving <https://builds.apache.org/job/karaf-4.0.x/ws/deployer/pom.xml>
to org.apache.karaf.deployer/deployer/4.0.6-SNAPSHOT/deployer-4.0.6-SNAPSHOT.pom
[JENKINS] Archiving <https://builds.apache.org/job/karaf-4.0.x/ws/shell/ssh/pom.xml>
to org.apache.karaf.shell/org.apache.karaf.shell.ssh/4.0.6-SNAPSHOT/org.apache.karaf.shell.ssh-4.0.6-SNAPSHOT.pom
[JENKINS] Archiving <https://builds.apache.org/job/karaf-4.0.x/ws/webconsole/http/pom.xml>
to org.apache.karaf.webconsole/org.apache.karaf.webconsole.http/4.0.6-SNAPSHOT/org.apache.karaf.webconsole.http-4.0.6-SNAPSHOT.pom
[JENKINS] Archiving <https://builds.apache.org/job/karaf-4.0.x/ws/deployer/features/pom.xml>
to org.apache.karaf.deployer/org.apache.karaf.deployer.features/4.0.6-SNAPSHOT/org.apache.karaf.deployer.features-4.0.6-SNAPSHOT.pom
[JENKINS] Archiving <https://builds.apache.org/job/karaf-4.0.x/ws/client/pom.xml> to
org.apache.karaf/org.apache.karaf.client/4.0.6-SNAPSHOT/org.apache.karaf.client-4.0.6-SNAPSHOT.pom
[JENKINS] Archiving <https://builds.apache.org/job/karaf-4.0.x/ws/services/pom.xml>
to org.apache.karaf.services/services/4.0.6-SNAPSHOT/services-4.0.6-SNAPSHOT.pom
[JENKINS] Archiving <https://builds.apache.org/job/karaf-4.0.x/ws/assemblies/apache-karaf/pom.xml>
to org.apache.karaf/apache-karaf/4.0.6-SNAPSHOT/apache-karaf-4.0.6-SNAPSHOT.pom
[JENKINS] Archiving <https://builds.apache.org/job/karaf-4.0.x/ws/archetypes/kar/pom.xml>
to org.apache.karaf.archetypes/karaf-kar-archetype/4.0.6-SNAPSHOT/karaf-kar-archetype-4.0.6-SNAPSHOT.pom
[JENKINS] Archiving <https://builds.apache.org/job/karaf-4.0.x/ws/scr/management/pom.xml>
to org.apache.karaf.scr/org.apache.karaf.scr.management/4.0.6-SNAPSHOT/org.apache.karaf.scr.management-4.0.6-SNAPSHOT.pom
[JENKINS] Archiving <https://builds.apache.org/job/karaf-4.0.x/ws/jdbc/pom.xml> to org.apache.karaf.jdbc/org.apache.karaf.jdbc.core/4.0.6-SNAPSHOT/org.apache.karaf.jdbc.core-4.0.6-SNAPSHOT.pom
Sending e-mails to: commits@karaf.apache.org
channel stopped

Mime
View raw message