karaf-commits mailing list archives

Site index · List index
Message view « Date » · « Thread »
Top « Date » · « Thread »
From Apache Jenkins Server <jenk...@builds.apache.org>
Subject Build failed in Jenkins: karaf-2.3.x #1745
Date Thu, 07 Jan 2016 15:33:50 GMT
See <https://builds.apache.org/job/karaf-2.3.x/1745/changes>

Changes:

[jbonofre] [KARAF-3767] Use the actual value for WHEN_EXHAUSTED_BLOCK in the JDBC

[jbonofre] [KARAF-3790] Add comment describing karaf.lock.dir property in

[freeman.fang] [KARAF-3860]Log lower level root cause exception in

[jbonofre] [KARAF-3996] Update karaf script to be able to use custom MAX_FD

------------------------------------------
[...truncated 1459 lines...]
[INFO] Apache Karaf :: Diagnostic :: Common .............. SKIPPED
[INFO] Apache Karaf :: Diagnostic :: Command ............. SKIPPED
[INFO] Apache Karaf :: Diagnostic :: Management .......... SKIPPED
[INFO] Apache Karaf :: Tooling ........................... SKIPPED
[INFO] Apache Karaf :: Tooling :: Maven2 Features plugin . SKIPPED
[INFO] Apache Karaf :: Assembly .......................... SKIPPED
[INFO] Apache Karaf :: Demos ............................. SKIPPED
[INFO] Apache Karaf :: Demos :: Web ...................... SKIPPED
[INFO] Apache Karaf :: Demos :: Branding ................. SKIPPED
[INFO] Apache Karaf :: Demos :: Branding :: Shell ........ SKIPPED
[INFO] Apache Karaf :: Demos :: Demo Dump provider ....... SKIPPED
[INFO] Apache Karaf :: Demos :: Extend Console Command ... SKIPPED
[INFO] Apache Karaf :: Demos :: Deployer ................. SKIPPED
[INFO] Apache Karaf :: Demos :: Deployer :: Kar .......... SKIPPED
[INFO] Apache Karaf :: Demos :: Deployer :: Wrap Bundle osgi.commons-lang  SKIPPED
[INFO] Apache Karaf :: Demos :: Deployer :: Bundle ....... SKIPPED
[INFO] Apache Karaf :: Demos :: Deployer :: Feature ...... SKIPPED
[INFO] Apache Karaf :: Tooling :: Maven2 Command Help plugin  SKIPPED
[INFO] Apache Karaf :: Tooling :: Exam Testing Framework . SKIPPED
[INFO] Apache Karaf :: Tooling :: Exam Testing Framework :: Options  SKIPPED
[INFO] Apache Karaf :: Tooling :: Exam Testing Framework :: Container  SKIPPED
[INFO] Apache Karaf :: Archetypes ........................ SKIPPED
[INFO] Apache Karaf :: Archetypes :: Assembly Archetype .. SKIPPED
[INFO] Apache Karaf :: Archetypes :: Blueprint Archetype . SKIPPED
[INFO] Apache Karaf :: Archetypes :: Bundle Archetype .... SKIPPED
[INFO] Apache Karaf :: Archetypes :: Command Archetype ... SKIPPED
[INFO] Apache Karaf :: Archetypes :: Feature Archetype ... SKIPPED
[INFO] Apache Karaf :: Archetypes :: Kar Archetype ....... SKIPPED
[INFO] Apache Karaf :: Integration Tests ................. SKIPPED
[INFO] ------------------------------------------------------------------------
[INFO] BUILD FAILURE
[INFO] ------------------------------------------------------------------------
[INFO] Total time: 46.771s
[INFO] Finished at: Thu Jan 07 15:33:31 UTC 2016
[INFO] Final Memory: 46M/681M
[INFO] ------------------------------------------------------------------------
Waiting for Jenkins to finish collecting data[ERROR] Failed to execute goal org.apache.maven.plugins:maven-deploy-plugin:2.8.1:deploy
(default-deploy) on project karaf: Failed to retrieve remote metadata org.apache.karaf:karaf:2.3.12-SNAPSHOT/maven-metadata.xml:
Could not transfer metadata org.apache.karaf:karaf:2.3.12-SNAPSHOT/maven-metadata.xml from/to
apache.snapshots.https (https://repository.apache.org/content/repositories/snapshots): java.lang.RuntimeException:
Could not generate DH keypair: Prime size must be multiple of 64, and can only range from
512 to 1024 (inclusive) -> [Help 1]
org.apache.maven.lifecycle.LifecycleExecutionException: Failed to execute goal org.apache.maven.plugins:maven-deploy-plugin:2.8.1:deploy
(default-deploy) on project karaf: Failed to retrieve remote metadata org.apache.karaf:karaf:2.3.12-SNAPSHOT/maven-metadata.xml:
Could not transfer metadata org.apache.karaf:karaf:2.3.12-SNAPSHOT/maven-metadata.xml from/to
apache.snapshots.https (https://repository.apache.org/content/repositories/snapshots): java.lang.RuntimeException:
Could not generate DH keypair
	at org.apache.maven.lifecycle.internal.MojoExecutor.execute(MojoExecutor.java:217)
	at org.apache.maven.lifecycle.internal.MojoExecutor.execute(MojoExecutor.java:153)
	at org.apache.maven.lifecycle.internal.MojoExecutor.execute(MojoExecutor.java:145)
	at org.apache.maven.lifecycle.internal.LifecycleModuleBuilder.buildProject(LifecycleModuleBuilder.java:84)
	at org.apache.maven.lifecycle.internal.LifecycleModuleBuilder.buildProject(LifecycleModuleBuilder.java:59)
	at org.apache.maven.lifecycle.internal.LifecycleStarter.singleThreadedBuild(LifecycleStarter.java:183)
	at org.apache.maven.lifecycle.internal.LifecycleStarter.execute(LifecycleStarter.java:161)
	at org.apache.maven.DefaultMaven.doExecute(DefaultMaven.java:320)
	at org.apache.maven.DefaultMaven.execute(DefaultMaven.java:156)
	at org.jvnet.hudson.maven3.launcher.Maven3Launcher.main(Maven3Launcher.java:117)
	at sun.reflect.NativeMethodAccessorImpl.invoke0(Native Method)
	at sun.reflect.NativeMethodAccessorImpl.invoke(NativeMethodAccessorImpl.java:39)
	at sun.reflect.DelegatingMethodAccessorImpl.invoke(DelegatingMethodAccessorImpl.java:25)
	at java.lang.reflect.Method.invoke(Method.java:597)
	at org.codehaus.plexus.classworlds.launcher.Launcher.launchStandard(Launcher.java:329)
	at org.codehaus.plexus.classworlds.launcher.Launcher.launch(Launcher.java:239)
	at org.jvnet.hudson.maven3.agent.Maven3Main.launch(Maven3Main.java:181)
	at sun.reflect.NativeMethodAccessorImpl.invoke0(Native Method)
	at sun.reflect.NativeMethodAccessorImpl.invoke(NativeMethodAccessorImpl.java:39)
	at sun.reflect.DelegatingMethodAccessorImpl.invoke(DelegatingMethodAccessorImpl.java:25)
	at java.lang.reflect.Method.invoke(Method.java:597)
	at hudson.maven.Maven3Builder.call(Maven3Builder.java:136)
	at hudson.maven.Maven3Builder.call(Maven3Builder.java:71)
	at hudson.remoting.UserRequest.perform(UserRequest.java:121)
	at hudson.remoting.UserRequest.perform(UserRequest.java:49)
	at hudson.remoting.Request$2.run(Request.java:326)
	at hudson.remoting.InterceptingExecutorService$1.call(InterceptingExecutorService.java:68)
	at java.util.concurrent.FutureTask$Sync.innerRun(FutureTask.java:303)
	at java.util.concurrent.FutureTask.run(FutureTask.java:138)
	at java.util.concurrent.ThreadPoolExecutor$Worker.runTask(ThreadPoolExecutor.java:895)
	at java.util.concurrent.ThreadPoolExecutor$Worker.run(ThreadPoolExecutor.java:918)
	at java.lang.Thread.run(Thread.java:662)
Caused by: org.apache.maven.plugin.MojoExecutionException: Failed to retrieve remote metadata
org.apache.karaf:karaf:2.3.12-SNAPSHOT/maven-metadata.xml: Could not transfer metadata org.apache.karaf:karaf:2.3.12-SNAPSHOT/maven-metadata.xml
from/to apache.snapshots.https (https://repository.apache.org/content/repositories/snapshots):
java.lang.RuntimeException: Could not generate DH keypair
	at org.apache.maven.plugin.deploy.DeployMojo.deployProject(DeployMojo.java:282)
	at org.apache.maven.plugin.deploy.DeployMojo.execute(DeployMojo.java:169)
	at org.apache.maven.plugin.DefaultBuildPluginManager.executeMojo(DefaultBuildPluginManager.java:101)
	at org.apache.maven.lifecycle.internal.MojoExecutor.execute(MojoExecutor.java:209)
	... 31 more
Caused by: org.apache.maven.artifact.deployer.ArtifactDeploymentException: Failed to retrieve
remote metadata org.apache.karaf:karaf:2.3.12-SNAPSHOT/maven-metadata.xml: Could not transfer
metadata org.apache.karaf:karaf:2.3.12-SNAPSHOT/maven-metadata.xml from/to apache.snapshots.https
(https://repository.apache.org/content/repositories/snapshots): java.lang.RuntimeException:
Could not generate DH keypair
	at org.apache.maven.artifact.deployer.DefaultArtifactDeployer.deploy(DefaultArtifactDeployer.java:141)
	at org.apache.maven.plugin.deploy.AbstractDeployMojo.deploy(AbstractDeployMojo.java:171)
	at org.apache.maven.plugin.deploy.DeployMojo.deployProject(DeployMojo.java:240)
	... 34 more
Caused by: org.sonatype.aether.deployment.DeploymentException: Failed to retrieve remote metadata
org.apache.karaf:karaf:2.3.12-SNAPSHOT/maven-metadata.xml: Could not transfer metadata org.apache.karaf:karaf:2.3.12-SNAPSHOT/maven-metadata.xml
from/to apache.snapshots.https (https://repository.apache.org/content/repositories/snapshots):
java.lang.RuntimeException: Could not generate DH keypair
	at org.sonatype.aether.impl.internal.DefaultDeployer.upload(DefaultDeployer.java:403)
	at org.sonatype.aether.impl.internal.DefaultDeployer.deploy(DefaultDeployer.java:256)
	at org.sonatype.aether.impl.internal.DefaultDeployer.deploy(DefaultDeployer.java:211)
	at org.sonatype.aether.impl.internal.DefaultRepositorySystem.deploy(DefaultRepositorySystem.java:443)
	at org.apache.maven.artifact.deployer.DefaultArtifactDeployer.deploy(DefaultArtifactDeployer.java:137)
	... 36 more
Caused by: org.sonatype.aether.transfer.MetadataTransferException: Could not transfer metadata
org.apache.karaf:karaf:2.3.12-SNAPSHOT/maven-metadata.xml from/to apache.snapshots.https (https://repository.apache.org/content/repositories/snapshots):
java.lang.RuntimeException: Could not generate DH keypair
	at org.sonatype.aether.connector.wagon.WagonRepositoryConnector$3.wrap(WagonRepositoryConnector.java:930)
	at org.sonatype.aether.connector.wagon.WagonRepositoryConnector$3.wrap(WagonRepositoryConnector.java:920)
	at org.sonatype.aether.connector.wagon.WagonRepositoryConnector$GetTask.run(WagonRepositoryConnector.java:669)
	at org.sonatype.aether.util.concurrency.RunnableErrorForwarder$1.run(RunnableErrorForwarder.java:60)
	... 3 more
Caused by: org.apache.maven.wagon.TransferFailedException: java.lang.RuntimeException: Could
not generate DH keypair
	at org.apache.maven.wagon.shared.http4.AbstractHttpClientWagon.fillInputData(AbstractHttpClientWagon.java:799)
	at org.apache.maven.wagon.StreamWagon.getInputStream(StreamWagon.java:116)
	at org.apache.maven.wagon.StreamWagon.getIfNewer(StreamWagon.java:88)
	at org.apache.maven.wagon.StreamWagon.get(StreamWagon.java:61)
	at org.sonatype.aether.connector.wagon.WagonRepositoryConnector$GetTask.run(WagonRepositoryConnector.java:601)
	... 4 more
Caused by: javax.net.ssl.SSLException: java.lang.RuntimeException: Could not generate DH keypair
	at com.sun.net.ssl.internal.ssl.Alerts.getSSLException(Alerts.java:190)
	at com.sun.net.ssl.internal.ssl.SSLSocketImpl.fatal(SSLSocketImpl.java:1747)
	at com.sun.net.ssl.internal.ssl.SSLSocketImpl.fatal(SSLSocketImpl.java:1708)
	at com.sun.net.ssl.internal.ssl.SSLSocketImpl.handleException(SSLSocketImpl.java:1691)
	at com.sun.net.ssl.internal.ssl.SSLSocketImpl.handleException(SSLSocketImpl.java:1617)
	at com.sun.net.ssl.internal.ssl.AppOutputStream.write(AppOutputStream.java:105)
	at org.apache.maven.wagon.providers.http.httpclient.impl.io.AbstractSessionOutputBuffer.flushBuffer(AbstractSessionOutputBuffer.java:131)
	at org.apache.maven.wagon.providers.http.httpclient.impl.io.AbstractSessionOutputBuffer.flush(AbstractSessionOutputBuffer.java:138)
	at org.apache.maven.wagon.providers.http.httpclient.impl.AbstractHttpClientConnection.doFlush(AbstractHttpClientConnection.java:270)
	at org.apache.maven.wagon.providers.http.httpclient.impl.AbstractHttpClientConnection.flush(AbstractHttpClientConnection.java:275)
	at org.apache.maven.wagon.providers.http.httpclient.impl.conn.AbstractClientConnAdapter.flush(AbstractClientConnAdapter.java:197)
	at org.apache.maven.wagon.providers.http.httpclient.protocol.HttpRequestExecutor.doSendRequest(HttpRequestExecutor.java:258)
	at org.apache.maven.wagon.providers.http.httpclient.protocol.HttpRequestExecutor.execute(HttpRequestExecutor.java:123)
	at org.apache.maven.wagon.providers.http.httpclient.impl.client.DefaultRequestDirector.tryExecute(DefaultRequestDirector.java:645)
	at org.apache.maven.wagon.providers.http.httpclient.impl.client.DefaultRequestDirector.execute(DefaultRequestDirector.java:464)
	at org.apache.maven.wagon.providers.http.httpclient.impl.client.AbstractHttpClient.execute(AbstractHttpClient.java:820)
	at org.apache.maven.wagon.providers.http.httpclient.impl.client.AbstractHttpClient.execute(AbstractHttpClient.java:754)
	at org.apache.maven.wagon.shared.http4.AbstractHttpClientWagon.execute(AbstractHttpClientWagon.java:674)
	at org.apache.maven.wagon.shared.http4.AbstractHttpClientWagon.fillInputData(AbstractHttpClientWagon.java:793)
	... 8 more
Caused by: java.lang.RuntimeException: Could not generate DH keypair
	at com.sun.net.ssl.internal.ssl.DHCrypt.<init>(DHCrypt.java:114)
	at com.sun.net.ssl.internal.ssl.ClientHandshaker.serverKeyExchange(ClientHandshaker.java:559)
	at com.sun.net.ssl.internal.ssl.ClientHandshaker.processMessage(ClientHandshaker.java:186)
	at com.sun.net.ssl.internal.ssl.Handshaker.processLoop(Handshaker.java:593)
	at com.sun.net.ssl.internal.ssl.Handshaker.process_record(Handshaker.java:529)
	at com.sun.net.ssl.internal.ssl.SSLSocketImpl.readRecord(SSLSocketImpl.java:943)
	at com.sun.net.ssl.internal.ssl.SSLSocketImpl.performInitialHandshake(SSLSocketImpl.java:1188)
	at com.sun.net.ssl.internal.ssl.SSLSocketImpl.writeRecord(SSLSocketImpl.java:654)
	at com.sun.net.ssl.internal.ssl.AppOutputStream.write(AppOutputStream.java:100)
	... 21 more
Caused by: java.security.InvalidAlgorithmParameterException: Prime size must be multiple of
64, and can only range from 512 to 1024 (inclusive)
	at com.sun.crypto.provider.DHKeyPairGenerator.initialize(DashoA13*..)
	at java.security.KeyPairGenerator$Delegate.initialize(KeyPairGenerator.java:627)
	at com.sun.net.ssl.internal.ssl.DHCrypt.<init>(DHCrypt.java:107)
	... 29 more
[ERROR] 
[ERROR] Re-run Maven using the -X switch to enable full debug logging.
[ERROR] 
[ERROR] For more information about the errors and possible solutions, please read the following
articles:
[ERROR] [Help 1] http://cwiki.apache.org/confluence/display/MAVEN/MojoExecutionException

[JENKINS] Archiving <https://builds.apache.org/job/karaf-2.3.x/ws/deployer/wrap/pom.xml>
to org.apache.karaf.deployer/org.apache.karaf.deployer.wrap/2.3.12-SNAPSHOT/org.apache.karaf.deployer.wrap-2.3.12-SNAPSHOT.pom
[JENKINS] Archiving <https://builds.apache.org/job/karaf-2.3.x/ws/jaas/config/pom.xml>
to org.apache.karaf.jaas/org.apache.karaf.jaas.config/2.3.12-SNAPSHOT/org.apache.karaf.jaas.config-2.3.12-SNAPSHOT.pom
[JENKINS] Archiving <https://builds.apache.org/job/karaf-2.3.x/ws/webconsole/pom.xml>
to org.apache.karaf.webconsole/webconsole/2.3.12-SNAPSHOT/webconsole-2.3.12-SNAPSHOT.pom
[JENKINS] Archiving <https://builds.apache.org/job/karaf-2.3.x/ws/archetypes/pom.xml>
to org.apache.karaf/archetypes/2.3.12-SNAPSHOT/archetypes-2.3.12-SNAPSHOT.pom
[JENKINS] Archiving <https://builds.apache.org/job/karaf-2.3.x/ws/archetypes/command/pom.xml>
to org.apache.karaf.archetypes/karaf-command-archetype/2.3.12-SNAPSHOT/karaf-command-archetype-2.3.12-SNAPSHOT.pom
[JENKINS] Archiving <https://builds.apache.org/job/karaf-2.3.x/ws/management/mbeans/log/pom.xml>
to org.apache.karaf.management.mbeans/org.apache.karaf.management.mbeans.log/2.3.12-SNAPSHOT/org.apache.karaf.management.mbeans.log-2.3.12-SNAPSHOT.pom
[JENKINS] Archiving <https://builds.apache.org/job/karaf-2.3.x/ws/jms/pom.xml> to org.apache.karaf.jms/jms/2.3.12-SNAPSHOT/jms-2.3.12-SNAPSHOT.pom
[JENKINS] Archiving <https://builds.apache.org/job/karaf-2.3.x/ws/features/core/pom.xml>
to org.apache.karaf.features/org.apache.karaf.features.core/2.3.12-SNAPSHOT/org.apache.karaf.features.core-2.3.12-SNAPSHOT.pom
[JENKINS] Archiving <https://builds.apache.org/job/karaf-2.3.x/ws/main/pom.xml> to org.apache.karaf/org.apache.karaf.main/2.3.12-SNAPSHOT/org.apache.karaf.main-2.3.12-SNAPSHOT.pom
[JENKINS] Archiving <https://builds.apache.org/job/karaf-2.3.x/ws/deployer/blueprint/pom.xml>
to org.apache.karaf.deployer/org.apache.karaf.deployer.blueprint/2.3.12-SNAPSHOT/org.apache.karaf.deployer.blueprint-2.3.12-SNAPSHOT.pom
[JENKINS] Archiving <https://builds.apache.org/job/karaf-2.3.x/ws/demos/deployer/kar/pom.xml>
to org.apache.karaf.demos.deployer.kar/my-kar/2.3.12-SNAPSHOT/my-kar-2.3.12-SNAPSHOT.pom
[JENKINS] Archiving <https://builds.apache.org/job/karaf-2.3.x/ws/admin/command/pom.xml>
to org.apache.karaf.admin/org.apache.karaf.admin.command/2.3.12-SNAPSHOT/org.apache.karaf.admin.command-2.3.12-SNAPSHOT.pom
[JENKINS] Archiving <https://builds.apache.org/job/karaf-2.3.x/ws/demos/branding/pom.xml>
to org.apache.karaf.demos/org.apache.karaf.demos.branding/2.3.12-SNAPSHOT/org.apache.karaf.demos.branding-2.3.12-SNAPSHOT.pom
[JENKINS] Archiving <https://builds.apache.org/job/karaf-2.3.x/ws/features/pom.xml>
to org.apache.karaf.features/features/2.3.12-SNAPSHOT/features-2.3.12-SNAPSHOT.pom
[JENKINS] Archiving <https://builds.apache.org/job/karaf-2.3.x/ws/demos/deployer/bundle/pom.xml>
to org.apache.karaf.demos.deployer.bundle/my-bundle/2.3.12-SNAPSHOT/my-bundle-2.3.12-SNAPSHOT.pom
[JENKINS] Archiving <https://builds.apache.org/job/karaf-2.3.x/ws/tooling/exam/pom.xml>
to org.apache.karaf.tooling.exam/exam/2.3.12-SNAPSHOT/exam-2.3.12-SNAPSHOT.pom
[JENKINS] Archiving <https://builds.apache.org/job/karaf-2.3.x/ws/jaas/modules/pom.xml>
to org.apache.karaf.jaas/org.apache.karaf.jaas.modules/2.3.12-SNAPSHOT/org.apache.karaf.jaas.modules-2.3.12-SNAPSHOT.pom
[JENKINS] Archiving <https://builds.apache.org/job/karaf-2.3.x/ws/diagnostic/management/pom.xml>
to org.apache.karaf.diagnostic/org.apache.karaf.diagnostic.management/2.3.12-SNAPSHOT/org.apache.karaf.diagnostic.management-2.3.12-SNAPSHOT.pom
[JENKINS] Archiving <https://builds.apache.org/job/karaf-2.3.x/ws/webconsole/features/pom.xml>
to org.apache.karaf.webconsole/org.apache.karaf.webconsole.features/2.3.12-SNAPSHOT/org.apache.karaf.webconsole.features-2.3.12-SNAPSHOT.pom
[JENKINS] Archiving <https://builds.apache.org/job/karaf-2.3.x/ws/tooling/pom.xml> to
org.apache.karaf.tooling/tooling/2.3.12-SNAPSHOT/tooling-2.3.12-SNAPSHOT.pom
[JENKINS] Archiving <https://builds.apache.org/job/karaf-2.3.x/ws/features/command/pom.xml>
to org.apache.karaf.features/org.apache.karaf.features.command/2.3.12-SNAPSHOT/org.apache.karaf.features.command-2.3.12-SNAPSHOT.pom
[JENKINS] Archiving <https://builds.apache.org/job/karaf-2.3.x/ws/features/management/pom.xml>
to org.apache.karaf.features/org.apache.karaf.features.management/2.3.12-SNAPSHOT/org.apache.karaf.features.management-2.3.12-SNAPSHOT.pom
[JENKINS] Archiving <https://builds.apache.org/job/karaf-2.3.x/ws/deployer/kar/pom.xml>
to org.apache.karaf.deployer/org.apache.karaf.deployer.kar/2.3.12-SNAPSHOT/org.apache.karaf.deployer.kar-2.3.12-SNAPSHOT.pom
[JENKINS] Archiving <https://builds.apache.org/job/karaf-2.3.x/ws/itests/pom.xml> to
org.apache.karaf.itests/itests/2.3.12-SNAPSHOT/itests-2.3.12-SNAPSHOT.pom
[JENKINS] Archiving <https://builds.apache.org/job/karaf-2.3.x/ws/diagnostic/common/pom.xml>
to org.apache.karaf.diagnostic/org.apache.karaf.diagnostic.common/2.3.12-SNAPSHOT/org.apache.karaf.diagnostic.common-2.3.12-SNAPSHOT.pom
[JENKINS] Archiving <https://builds.apache.org/job/karaf-2.3.x/ws/management/server/pom.xml>
to org.apache.karaf.management/org.apache.karaf.management.server/2.3.12-SNAPSHOT/org.apache.karaf.management.server-2.3.12-SNAPSHOT.pom
[JENKINS] Archiving <https://builds.apache.org/job/karaf-2.3.x/ws/management/mbeans/packages/pom.xml>
to org.apache.karaf.management.mbeans/org.apache.karaf.management.mbeans.packages/2.3.12-SNAPSHOT/org.apache.karaf.management.mbeans.packages-2.3.12-SNAPSHOT.pom
[JENKINS] Archiving <https://builds.apache.org/job/karaf-2.3.x/ws/management/mbeans/obr/pom.xml>
to org.apache.karaf.management.mbeans/org.apache.karaf.management.mbeans.obr/2.3.12-SNAPSHOT/org.apache.karaf.management.mbeans.obr-2.3.12-SNAPSHOT.pom
[JENKINS] Archiving <https://builds.apache.org/job/karaf-2.3.x/ws/management/mbeans/pom.xml>
to org.apache.karaf.management.mbeans/mbeans/2.3.12-SNAPSHOT/mbeans-2.3.12-SNAPSHOT.pom
[JENKINS] Archiving <https://builds.apache.org/job/karaf-2.3.x/ws/management/mbeans/services/pom.xml>
to org.apache.karaf.management.mbeans/org.apache.karaf.management.mbeans.services/2.3.12-SNAPSHOT/org.apache.karaf.management.mbeans.services-2.3.12-SNAPSHOT.pom
[JENKINS] Archiving <https://builds.apache.org/job/karaf-2.3.x/ws/jndi/command/pom.xml>
to org.apache.karaf.jndi/org.apache.karaf.jndi.command/2.3.12-SNAPSHOT/org.apache.karaf.jndi.command-2.3.12-SNAPSHOT.pom
[JENKINS] Archiving <https://builds.apache.org/job/karaf-2.3.x/ws/management/mbeans/web/pom.xml>
to org.apache.karaf.management.mbeans/org.apache.karaf.management.mbeans.web/2.3.12-SNAPSHOT/org.apache.karaf.management.mbeans.web-2.3.12-SNAPSHOT.pom
[JENKINS] Archiving <https://builds.apache.org/job/karaf-2.3.x/ws/shell/log/pom.xml>
to org.apache.karaf.shell/org.apache.karaf.shell.log/2.3.12-SNAPSHOT/org.apache.karaf.shell.log-2.3.12-SNAPSHOT.pom
[JENKINS] Archiving <https://builds.apache.org/job/karaf-2.3.x/ws/jndi/core/pom.xml>
to org.apache.karaf.jndi/org.apache.karaf.jndi.core/2.3.12-SNAPSHOT/org.apache.karaf.jndi.core-2.3.12-SNAPSHOT.pom
[JENKINS] Archiving <https://builds.apache.org/job/karaf-2.3.x/ws/assemblies/features/pom.xml>
to org.apache.karaf.assemblies.features/features/2.3.12-SNAPSHOT/features-2.3.12-SNAPSHOT.pom
[JENKINS] Archiving <https://builds.apache.org/job/karaf-2.3.x/ws/management/mbeans/config/pom.xml>
to org.apache.karaf.management.mbeans/org.apache.karaf.management.mbeans.config/2.3.12-SNAPSHOT/org.apache.karaf.management.mbeans.config-2.3.12-SNAPSHOT.pom
[JENKINS] Archiving <https://builds.apache.org/job/karaf-2.3.x/ws/admin/management/pom.xml>
to org.apache.karaf.admin/org.apache.karaf.admin.management/2.3.12-SNAPSHOT/org.apache.karaf.admin.management-2.3.12-SNAPSHOT.pom
[JENKINS] Archiving <https://builds.apache.org/job/karaf-2.3.x/ws/shell/dev/pom.xml>
to org.apache.karaf.shell/org.apache.karaf.shell.dev/2.3.12-SNAPSHOT/org.apache.karaf.shell.dev-2.3.12-SNAPSHOT.pom
[JENKINS] Archiving <https://builds.apache.org/job/karaf-2.3.x/ws/jaas/pom.xml> to org.apache.karaf.jaas/jaas/2.3.12-SNAPSHOT/jaas-2.3.12-SNAPSHOT.pom
[JENKINS] Archiving <https://builds.apache.org/job/karaf-2.3.x/ws/demos/command/pom.xml>
to org.apache.karaf.demos/org.apache.karaf.demos.command/2.3.12-SNAPSHOT/org.apache.karaf.demos.command-2.3.12-SNAPSHOT.pom
[JENKINS] Archiving <https://builds.apache.org/job/karaf-2.3.x/ws/webconsole/console/pom.xml>
to org.apache.karaf.webconsole/org.apache.karaf.webconsole.console/2.3.12-SNAPSHOT/org.apache.karaf.webconsole.console-2.3.12-SNAPSHOT.pom
[JENKINS] Archiving <https://builds.apache.org/job/karaf-2.3.x/ws/util/pom.xml> to org.apache.karaf/org.apache.karaf.util/2.3.12-SNAPSHOT/org.apache.karaf.util-2.3.12-SNAPSHOT.pom
[JENKINS] Archiving <https://builds.apache.org/job/karaf-2.3.x/ws/shell/console/pom.xml>
to org.apache.karaf.shell/org.apache.karaf.shell.console/2.3.12-SNAPSHOT/org.apache.karaf.shell.console-2.3.12-SNAPSHOT.pom
[JENKINS] Archiving <https://builds.apache.org/job/karaf-2.3.x/ws/webconsole/branding/pom.xml>
to org.apache.karaf.webconsole/org.apache.karaf.webconsole.branding/2.3.12-SNAPSHOT/org.apache.karaf.webconsole.branding-2.3.12-SNAPSHOT.pom
[JENKINS] Archiving <https://builds.apache.org/job/karaf-2.3.x/ws/features/obr/pom.xml>
to org.apache.karaf.features/org.apache.karaf.features.obr/2.3.12-SNAPSHOT/org.apache.karaf.features.obr-2.3.12-SNAPSHOT.pom
[JENKINS] Archiving <https://builds.apache.org/job/karaf-2.3.x/ws/tooling/exam/options/pom.xml>
to org.apache.karaf.tooling.exam/org.apache.karaf.tooling.exam.options/2.3.12-SNAPSHOT/org.apache.karaf.tooling.exam.options-2.3.12-SNAPSHOT.pom
[JENKINS] Archiving <https://builds.apache.org/job/karaf-2.3.x/ws/diagnostic/pom.xml>
to org.apache.karaf.diagnostic/diagnostic/2.3.12-SNAPSHOT/diagnostic-2.3.12-SNAPSHOT.pom
[JENKINS] Archiving <https://builds.apache.org/job/karaf-2.3.x/ws/jdbc/pom.xml> to org.apache.karaf.jdbc/jdbc/2.3.12-SNAPSHOT/jdbc-2.3.12-SNAPSHOT.pom
[JENKINS] Archiving <https://builds.apache.org/job/karaf-2.3.x/ws/tooling/exam/container/pom.xml>
to org.apache.karaf.tooling.exam/org.apache.karaf.tooling.exam.container/2.3.12-SNAPSHOT/org.apache.karaf.tooling.exam.container-2.3.12-SNAPSHOT.pom
[JENKINS] Archiving <https://builds.apache.org/job/karaf-2.3.x/ws/archetypes/feature/pom.xml>
to org.apache.karaf.archetypes/karaf-feature-archetype/2.3.12-SNAPSHOT/karaf-feature-archetype-2.3.12-SNAPSHOT.pom
[JENKINS] Archiving <https://builds.apache.org/job/karaf-2.3.x/ws/demos/pom.xml> to
org.apache.karaf.demos/demos/2.3.12-SNAPSHOT/demos-2.3.12-SNAPSHOT.pom
[JENKINS] Archiving <https://builds.apache.org/job/karaf-2.3.x/ws/jms/command/pom.xml>
to org.apache.karaf.jms/org.apache.karaf.jms.command/2.3.12-SNAPSHOT/org.apache.karaf.jms.command-2.3.12-SNAPSHOT.pom
[JENKINS] Archiving <https://builds.apache.org/job/karaf-2.3.x/ws/demos/branding/shell/pom.xml>
to org.apache.karaf.demos/org.apache.karaf.demos.branding.shell/2.3.12-SNAPSHOT/org.apache.karaf.demos.branding.shell-2.3.12-SNAPSHOT.pom
[JENKINS] Archiving <https://builds.apache.org/job/karaf-2.3.x/ws/tooling/cmdhelp-maven-plugin/pom.xml>
to org.apache.karaf.tooling/cmdhelp-maven-plugin/2.3.12-SNAPSHOT/cmdhelp-maven-plugin-2.3.12-SNAPSHOT.pom
[JENKINS] Archiving <https://builds.apache.org/job/karaf-2.3.x/ws/assemblies/features/enterprise/pom.xml>
to org.apache.karaf.assemblies.features/enterprise/2.3.12-SNAPSHOT/enterprise-2.3.12-SNAPSHOT.pom
[JENKINS] Archiving <https://builds.apache.org/job/karaf-2.3.x/ws/jaas/command/pom.xml>
to org.apache.karaf.jaas/org.apache.karaf.jaas.command/2.3.12-SNAPSHOT/org.apache.karaf.jaas.command-2.3.12-SNAPSHOT.pom
[JENKINS] Archiving <https://builds.apache.org/job/karaf-2.3.x/ws/demos/deployer/pom.xml>
to org.apache.karaf.demos/org.apache.karaf.demos.deployer/2.3.12-SNAPSHOT/org.apache.karaf.demos.deployer-2.3.12-SNAPSHOT.pom
[JENKINS] Archiving <https://builds.apache.org/job/karaf-2.3.x/ws/assemblies/pom.xml>
to org.apache.karaf.assemblies/assemblies/2.3.12-SNAPSHOT/assemblies-2.3.12-SNAPSHOT.pom
[JENKINS] Archiving <https://builds.apache.org/job/karaf-2.3.x/ws/jaas/boot/pom.xml>
to org.apache.karaf.jaas/org.apache.karaf.jaas.boot/2.3.12-SNAPSHOT/org.apache.karaf.jaas.boot-2.3.12-SNAPSHOT.pom
[JENKINS] Archiving <https://builds.apache.org/job/karaf-2.3.x/ws/diagnostic/command/pom.xml>
to org.apache.karaf.diagnostic/org.apache.karaf.diagnostic.command/2.3.12-SNAPSHOT/org.apache.karaf.diagnostic.command-2.3.12-SNAPSHOT.pom
[JENKINS] Archiving <https://builds.apache.org/job/karaf-2.3.x/ws/webconsole/gogo/pom.xml>
to org.apache.karaf.webconsole/org.apache.karaf.webconsole.gogo/2.3.12-SNAPSHOT/org.apache.karaf.webconsole.gogo-2.3.12-SNAPSHOT.pom
[JENKINS] Archiving <https://builds.apache.org/job/karaf-2.3.x/ws/management/mbeans/bundles/pom.xml>
to org.apache.karaf.management.mbeans/org.apache.karaf.management.mbeans.bundles/2.3.12-SNAPSHOT/org.apache.karaf.management.mbeans.bundles-2.3.12-SNAPSHOT.pom
[JENKINS] Archiving <https://builds.apache.org/job/karaf-2.3.x/ws/management/mbeans/scr/pom.xml>
to org.apache.karaf.management.mbeans/org.apache.karaf.management.mbeans.scr/2.3.12-SNAPSHOT/org.apache.karaf.management.mbeans.scr-2.3.12-SNAPSHOT.pom
[JENKINS] Archiving <https://builds.apache.org/job/karaf-2.3.x/ws/shell/commands/pom.xml>
to org.apache.karaf.shell/org.apache.karaf.shell.commands/2.3.12-SNAPSHOT/org.apache.karaf.shell.commands-2.3.12-SNAPSHOT.pom
[JENKINS] Archiving <https://builds.apache.org/job/karaf-2.3.x/ws/demos/web/pom.xml>
to org.apache.karaf.demos/web/2.3.12-SNAPSHOT/web-2.3.12-SNAPSHOT.pom
[JENKINS] Archiving <https://builds.apache.org/job/karaf-2.3.x/ws/jms/core/pom.xml>
to org.apache.karaf.jms/org.apache.karaf.jms.core/2.3.12-SNAPSHOT/org.apache.karaf.jms.core-2.3.12-SNAPSHOT.pom
[JENKINS] Archiving <https://builds.apache.org/job/karaf-2.3.x/ws/management/mbeans/dev/pom.xml>
to org.apache.karaf.management.mbeans/org.apache.karaf.management.mbeans.dev/2.3.12-SNAPSHOT/org.apache.karaf.management.mbeans.dev-2.3.12-SNAPSHOT.pom
[JENKINS] Archiving <https://builds.apache.org/job/karaf-2.3.x/ws/demos/dump/pom.xml>
to org.apache.karaf.demos/dump/2.3.12-SNAPSHOT/dump-2.3.12-SNAPSHOT.pom
[JENKINS] Archiving <https://builds.apache.org/job/karaf-2.3.x/ws/shell/scr/pom.xml>
to org.apache.karaf.shell/org.apache.karaf.shell.scr/2.3.12-SNAPSHOT/org.apache.karaf.shell.scr-2.3.12-SNAPSHOT.pom
[JENKINS] Archiving <https://builds.apache.org/job/karaf-2.3.x/ws/demos/deployer/feature/pom.xml>
to org.apache.karaf.demos.deployer.feature/my-feature/2.3.12-SNAPSHOT/my-feature-2.3.12-SNAPSHOT.pom
[JENKINS] Archiving <https://builds.apache.org/job/karaf-2.3.x/ws/exception/pom.xml>
to org.apache.karaf/org.apache.karaf.exception/2.3.12-SNAPSHOT/org.apache.karaf.exception-2.3.12-SNAPSHOT.pom
[JENKINS] Archiving <https://builds.apache.org/job/karaf-2.3.x/ws/shell/pom.xml> to
org.apache.karaf.shell/shell/2.3.12-SNAPSHOT/shell-2.3.12-SNAPSHOT.pom
[JENKINS] Archiving <https://builds.apache.org/job/karaf-2.3.x/ws/archetypes/bundle/pom.xml>
to org.apache.karaf.archetypes/karaf-bundle-archetype/2.3.12-SNAPSHOT/karaf-bundle-archetype-2.3.12-SNAPSHOT.pom
[JENKINS] Archiving <https://builds.apache.org/job/karaf-2.3.x/ws/admin/core/pom.xml>
to org.apache.karaf.admin/org.apache.karaf.admin.core/2.3.12-SNAPSHOT/org.apache.karaf.admin.core-2.3.12-SNAPSHOT.pom
[JENKINS] Archiving <https://builds.apache.org/job/karaf-2.3.x/ws/shell/config/pom.xml>
to org.apache.karaf.shell/org.apache.karaf.shell.config/2.3.12-SNAPSHOT/org.apache.karaf.shell.config-2.3.12-SNAPSHOT.pom
[JENKINS] Archiving <https://builds.apache.org/job/karaf-2.3.x/ws/pom.xml> to org.apache.karaf/karaf/2.3.12-SNAPSHOT/karaf-2.3.12-SNAPSHOT.pom
Compressed 80.00 KB of artifacts by 80.0% relative to #1672
[JENKINS] Archiving <https://builds.apache.org/job/karaf-2.3.x/ws/shell/packages/pom.xml>
to org.apache.karaf.shell/org.apache.karaf.shell.packages/2.3.12-SNAPSHOT/org.apache.karaf.shell.packages-2.3.12-SNAPSHOT.pom
[JENKINS] Archiving <https://builds.apache.org/job/karaf-2.3.x/ws/demos/deployer/wrap/pom.xml>
to org.apache.karaf.demos.deployer.wrap/osgi.commons-lang/2.3.12-SNAPSHOT/osgi.commons-lang-2.3.12-SNAPSHOT.pom
[JENKINS] Archiving <https://builds.apache.org/job/karaf-2.3.x/ws/archetypes/assembly/pom.xml>
to org.apache.karaf.archetypes/karaf-assembly-archetype/2.3.12-SNAPSHOT/karaf-assembly-archetype-2.3.12-SNAPSHOT.pom
[JENKINS] Archiving <https://builds.apache.org/job/karaf-2.3.x/ws/management/mbeans/system/pom.xml>
to org.apache.karaf.management.mbeans/org.apache.karaf.management.mbeans.system/2.3.12-SNAPSHOT/org.apache.karaf.management.mbeans.system-2.3.12-SNAPSHOT.pom
[JENKINS] Archiving <https://builds.apache.org/job/karaf-2.3.x/ws/management/pom.xml>
to org.apache.karaf.management/management/2.3.12-SNAPSHOT/management-2.3.12-SNAPSHOT.pom
[JENKINS] Archiving <https://builds.apache.org/job/karaf-2.3.x/ws/shell/wrapper/pom.xml>
to org.apache.karaf.shell/org.apache.karaf.shell.wrapper/2.3.12-SNAPSHOT/org.apache.karaf.shell.wrapper-2.3.12-SNAPSHOT.pom
[JENKINS] Archiving <https://builds.apache.org/job/karaf-2.3.x/ws/jndi/pom.xml> to org.apache.karaf.jndi/jndi/2.3.12-SNAPSHOT/jndi-2.3.12-SNAPSHOT.pom
[JENKINS] Archiving <https://builds.apache.org/job/karaf-2.3.x/ws/tooling/features-maven-plugin/pom.xml>
to org.apache.karaf.tooling/features-maven-plugin/2.3.12-SNAPSHOT/features-maven-plugin-2.3.12-SNAPSHOT.pom
[JENKINS] Archiving <https://builds.apache.org/job/karaf-2.3.x/ws/shell/web/pom.xml>
to org.apache.karaf.shell/org.apache.karaf.shell.web/2.3.12-SNAPSHOT/org.apache.karaf.shell.web-2.3.12-SNAPSHOT.pom
[JENKINS] Archiving <https://builds.apache.org/job/karaf-2.3.x/ws/archetypes/blueprint/pom.xml>
to org.apache.karaf.archetypes/karaf-blueprint-archetype/2.3.12-SNAPSHOT/karaf-blueprint-archetype-2.3.12-SNAPSHOT.pom
[JENKINS] Archiving <https://builds.apache.org/job/karaf-2.3.x/ws/admin/pom.xml> to
org.apache.karaf.admin/admin/2.3.12-SNAPSHOT/admin-2.3.12-SNAPSHOT.pom
[JENKINS] Archiving <https://builds.apache.org/job/karaf-2.3.x/ws/deployer/spring/pom.xml>
to org.apache.karaf.deployer/org.apache.karaf.deployer.spring/2.3.12-SNAPSHOT/org.apache.karaf.deployer.spring-2.3.12-SNAPSHOT.pom
[JENKINS] Archiving <https://builds.apache.org/job/karaf-2.3.x/ws/jdbc/command/pom.xml>
to org.apache.karaf.jdbc/org.apache.karaf.jdbc.command/2.3.12-SNAPSHOT/org.apache.karaf.jdbc.command-2.3.12-SNAPSHOT.pom
[JENKINS] Archiving <https://builds.apache.org/job/karaf-2.3.x/ws/assemblies/features/standard/pom.xml>
to org.apache.karaf.assemblies.features/standard/2.3.12-SNAPSHOT/standard-2.3.12-SNAPSHOT.pom
[JENKINS] Archiving <https://builds.apache.org/job/karaf-2.3.x/ws/jaas/jasypt/pom.xml>
to org.apache.karaf.jaas/org.apache.karaf.jaas.jasypt/2.3.12-SNAPSHOT/org.apache.karaf.jaas.jasypt-2.3.12-SNAPSHOT.pom
[JENKINS] Archiving <https://builds.apache.org/job/karaf-2.3.x/ws/diagnostic/core/pom.xml>
to org.apache.karaf.diagnostic/org.apache.karaf.diagnostic.core/2.3.12-SNAPSHOT/org.apache.karaf.diagnostic.core-2.3.12-SNAPSHOT.pom
[JENKINS] Archiving <https://builds.apache.org/job/karaf-2.3.x/ws/deployer/pom.xml>
to org.apache.karaf.deployer/deployer/2.3.12-SNAPSHOT/deployer-2.3.12-SNAPSHOT.pom
[JENKINS] Archiving <https://builds.apache.org/job/karaf-2.3.x/ws/shell/obr/pom.xml>
to org.apache.karaf.shell/org.apache.karaf.shell.obr/2.3.12-SNAPSHOT/org.apache.karaf.shell.obr-2.3.12-SNAPSHOT.pom
[JENKINS] Archiving <https://builds.apache.org/job/karaf-2.3.x/ws/shell/ssh/pom.xml>
to org.apache.karaf.shell/org.apache.karaf.shell.ssh/2.3.12-SNAPSHOT/org.apache.karaf.shell.ssh-2.3.12-SNAPSHOT.pom
[JENKINS] Archiving <https://builds.apache.org/job/karaf-2.3.x/ws/webconsole/admin/pom.xml>
to org.apache.karaf.webconsole/org.apache.karaf.webconsole.admin/2.3.12-SNAPSHOT/org.apache.karaf.webconsole.admin-2.3.12-SNAPSHOT.pom
[JENKINS] Archiving <https://builds.apache.org/job/karaf-2.3.x/ws/shell/osgi/pom.xml>
to org.apache.karaf.shell/org.apache.karaf.shell.osgi/2.3.12-SNAPSHOT/org.apache.karaf.shell.osgi-2.3.12-SNAPSHOT.pom
[JENKINS] Archiving <https://builds.apache.org/job/karaf-2.3.x/ws/deployer/features/pom.xml>
to org.apache.karaf.deployer/org.apache.karaf.deployer.features/2.3.12-SNAPSHOT/org.apache.karaf.deployer.features-2.3.12-SNAPSHOT.pom
[JENKINS] Archiving <https://builds.apache.org/job/karaf-2.3.x/ws/client/pom.xml> to
org.apache.karaf/org.apache.karaf.client/2.3.12-SNAPSHOT/org.apache.karaf.client-2.3.12-SNAPSHOT.pom
[JENKINS] Archiving <https://builds.apache.org/job/karaf-2.3.x/ws/assemblies/apache-karaf/pom.xml>
to org.apache.karaf/apache-karaf/2.3.12-SNAPSHOT/apache-karaf-2.3.12-SNAPSHOT.pom
[JENKINS] Archiving <https://builds.apache.org/job/karaf-2.3.x/ws/jdbc/core/pom.xml>
to org.apache.karaf.jdbc/org.apache.karaf.jdbc.core/2.3.12-SNAPSHOT/org.apache.karaf.jdbc.core-2.3.12-SNAPSHOT.pom
[JENKINS] Archiving <https://builds.apache.org/job/karaf-2.3.x/ws/archetypes/kar/pom.xml>
to org.apache.karaf.archetypes/karaf-kar-archetype/2.3.12-SNAPSHOT/karaf-kar-archetype-2.3.12-SNAPSHOT.pom
Sending e-mails to: commits@karaf.apache.org
channel stopped

Mime
View raw message