karaf-commits mailing list archives

Site index · List index
Message view « Date » · « Thread »
Top « Date » · « Thread »
From Apache Jenkins Server <jenk...@builds.apache.org>
Subject Build failed in Jenkins: karaf-master #3264
Date Fri, 03 Apr 2015 00:22:30 GMT
See <https://builds.apache.org/job/karaf-master/3264/>

------------------------------------------
Started by timer
Building remotely on H10 (Ubuntu ubuntu) in workspace <https://builds.apache.org/job/karaf-master/ws/>
 > git rev-parse --is-inside-work-tree # timeout=10
Fetching changes from the remote Git repository
 > git config remote.origin.url https://git-wip-us.apache.org/repos/asf/karaf.git # timeout=10
Fetching upstream changes from https://git-wip-us.apache.org/repos/asf/karaf.git
 > git --version # timeout=10
 > git fetch --tags --progress https://git-wip-us.apache.org/repos/asf/karaf.git +refs/heads/*:refs/remotes/origin/*
 > git rev-parse refs/remotes/origin/master^{commit} # timeout=10
 > git rev-parse refs/remotes/origin/origin/master^{commit} # timeout=10
Checking out Revision 33ef5db6a594cf4c3a3b8edda73a4b9f2d56343e (refs/remotes/origin/master)
 > git config core.sparsecheckout # timeout=10
 > git checkout -f 33ef5db6a594cf4c3a3b8edda73a4b9f2d56343e
 > git rev-list 33ef5db6a594cf4c3a3b8edda73a4b9f2d56343e # timeout=10
Parsing POMs
Failed to transfer Could not find artifact org.apache:apache:pom:15 in servicemix (http://svn.apache.org/repos/asf/servicemix/m2-repo)
Failed to transfer Could not find artifact org.apache:apache:pom:15 in zodiac-repository (http://repository.springsource.com/maven/bundles/release)
Failed to transfer Could not find artifact org.apache:apache:pom:15 in spring-ebr-repository
(http://repository.springsource.com/maven/bundles/external)
Downloaded artifact http://repo.maven.apache.org/maven2/org/apache/apache/15/apache-15.pom
maven3-agent.jar already up to date
maven3-interceptor.jar already up to date
maven3-interceptor-commons.jar already up to date
[karaf-master] $ /home/jenkins/tools/java/latest1.7/bin/java -XX:MaxPermSize=256m -cp /home/jenkins/jenkins-slave/maven3-agent.jar:/home/jenkins/tools/maven/apache-maven-3.0.4/boot/plexus-classworlds-2.4.jar
org.jvnet.hudson.maven3.agent.Maven3Main /home/jenkins/tools/maven/apache-maven-3.0.4 /home/jenkins/jenkins-slave/slave.jar
/home/jenkins/jenkins-slave/maven3-interceptor.jar /home/jenkins/jenkins-slave/maven3-interceptor-commons.jar
40740
<===[JENKINS REMOTING CAPACITY]===>   channel started
Executing Maven:  -B -f <https://builds.apache.org/job/karaf-master/ws/pom.xml> -Dmaven.repo.local=<https://builds.apache.org/job/karaf-master/ws/.repository>
-B -e clean deploy
[INFO] Error stacktraces are turned on.
[INFO] Scanning for projects...
Downloading: http://repository.apache.org/content/groups/snapshots-group/org/apache/felix/maven-bundle-plugin/2.5.4-SNAPSHOT/maven-metadata.xml
[WARNING] Could not transfer metadata org.apache.felix:maven-bundle-plugin:2.5.4-SNAPSHOT/maven-metadata.xml
from/to apache-snapshots (http://repository.apache.org/content/groups/snapshots-group): Failed
to transfer file: http://repository.apache.org/content/groups/snapshots-group/org/apache/felix/maven-bundle-plugin/2.5.4-SNAPSHOT/maven-metadata.xml.
Return code is: 502, ReasonPhrase:Proxy Error.
[WARNING] Failure to transfer org.apache.felix:maven-bundle-plugin:2.5.4-SNAPSHOT/maven-metadata.xml
from http://repository.apache.org/content/groups/snapshots-group was cached in the local repository,
resolution will not be reattempted until the update interval of apache-snapshots has elapsed
or updates are forced. Original error: Could not transfer metadata org.apache.felix:maven-bundle-plugin:2.5.4-SNAPSHOT/maven-metadata.xml
from/to apache-snapshots (http://repository.apache.org/content/groups/snapshots-group): Failed
to transfer file: http://repository.apache.org/content/groups/snapshots-group/org/apache/felix/maven-bundle-plugin/2.5.4-SNAPSHOT/maven-metadata.xml.
Return code is: 502, ReasonPhrase:Proxy Error.
Downloading: http://repository.apache.org/content/groups/snapshots-group/org/apache/felix/maven-bundle-plugin/2.5.4-SNAPSHOT/maven-bundle-plugin-2.5.4-SNAPSHOT.pom
[WARNING] The POM for org.apache.felix:maven-bundle-plugin:jar:2.5.4-SNAPSHOT is missing,
no dependency information available
Downloading: http://repository.apache.org/content/groups/snapshots-group/org/apache/felix/maven-bundle-plugin/2.5.4-SNAPSHOT/maven-bundle-plugin-2.5.4-SNAPSHOT.jar
Downloading: http://repo.maven.apache.org/maven2/org/codehaus/plexus/plexus-utils/1.1/plexus-utils-1.1.jar
Downloaded: http://repo.maven.apache.org/maven2/org/codehaus/plexus/plexus-utils/1.1/plexus-utils-1.1.jar
(165 KB at 539.7 KB/sec)
[ERROR] The build could not read 1 project -> [Help 1]
org.apache.maven.project.ProjectBuildingException: Some problems were encountered while processing
the POMs:
[ERROR] Unresolveable build extension: Plugin org.apache.felix:maven-bundle-plugin:2.5.4-SNAPSHOT
or one of its dependencies could not be resolved: Could not find artifact org.apache.felix:maven-bundle-plugin:jar:2.5.4-SNAPSHOT
in apache-snapshots (http://repository.apache.org/content/groups/snapshots-group) @ 

	at org.apache.maven.project.DefaultProjectBuilder.build(DefaultProjectBuilder.java:363)
	at org.apache.maven.DefaultMaven.collectProjects(DefaultMaven.java:636)
	at org.apache.maven.DefaultMaven.getProjectsForMavenReactor(DefaultMaven.java:585)
	at org.apache.maven.DefaultMaven.doExecute(DefaultMaven.java:234)
	at org.apache.maven.DefaultMaven.execute(DefaultMaven.java:156)
	at org.jvnet.hudson.maven3.launcher.Maven3Launcher.main(Maven3Launcher.java:117)
	at sun.reflect.NativeMethodAccessorImpl.invoke0(Native Method)
	at sun.reflect.NativeMethodAccessorImpl.invoke(NativeMethodAccessorImpl.java:57)
	at sun.reflect.DelegatingMethodAccessorImpl.invoke(DelegatingMethodAccessorImpl.java:43)
	at java.lang.reflect.Method.invoke(Method.java:606)
	at org.codehaus.plexus.classworlds.launcher.Launcher.launchStandard(Launcher.java:329)
	at org.codehaus.plexus.classworlds.launcher.Launcher.launch(Launcher.java:239)
	at org.jvnet.hudson.maven3.agent.Maven3Main.launch(Maven3Main.java:178)
	at sun.reflect.NativeMethodAccessorImpl.invoke0(Native Method)
	at sun.reflect.NativeMethodAccessorImpl.invoke(NativeMethodAccessorImpl.java:57)
	at sun.reflect.DelegatingMethodAccessorImpl.invoke(DelegatingMethodAccessorImpl.java:43)
	at java.lang.reflect.Method.invoke(Method.java:606)
	at hudson.maven.Maven3Builder.call(Maven3Builder.java:136)
	at hudson.maven.Maven3Builder.call(Maven3Builder.java:71)
	at hudson.remoting.UserRequest.perform(UserRequest.java:118)
	at hudson.remoting.UserRequest.perform(UserRequest.java:48)
	at hudson.remoting.Request$2.run(Request.java:328)
	at hudson.remoting.InterceptingExecutorService$1.call(InterceptingExecutorService.java:72)
	at java.util.concurrent.FutureTask$Sync.innerRun(FutureTask.java:334)
	at java.util.concurrent.FutureTask.run(FutureTask.java:166)
	at java.util.concurrent.ThreadPoolExecutor.runWorker(ThreadPoolExecutor.java:1145)
	at java.util.concurrent.ThreadPoolExecutor$Worker.run(ThreadPoolExecutor.java:615)
	at java.lang.Thread.run(Thread.java:724)
[ERROR]   
[ERROR]   The project org.apache.karaf:karaf:4.0.0-SNAPSHOT (<https://builds.apache.org/job/karaf-master/ws/pom.xml)>
has 1 error
[ERROR]     Unresolveable build extension: Plugin org.apache.felix:maven-bundle-plugin:2.5.4-SNAPSHOT
or one of its dependencies could not be resolved: Could not find artifact org.apache.felix:maven-bundle-plugin:jar:2.5.4-SNAPSHOT
in apache-snapshots (http://repository.apache.org/content/groups/snapshots-group) -> [Help
2]
org.apache.maven.plugin.PluginResolutionException: Plugin org.apache.felix:maven-bundle-plugin:2.5.4-SNAPSHOT
or one of its dependencies could not be resolved: Could not find artifact org.apache.felix:maven-bundle-plugin:jar:2.5.4-SNAPSHOT
in apache-snapshots (http://repository.apache.org/content/groups/snapshots-group)
	at org.apache.maven.plugin.internal.DefaultPluginDependenciesResolver.resolve(DefaultPluginDependenciesResolver.java:215)
	at org.apache.maven.project.DefaultProjectBuildingHelper.resolveExtensionArtifacts(DefaultProjectBuildingHelper.java:377)
	at org.apache.maven.project.DefaultProjectBuildingHelper.createProjectRealm(DefaultProjectBuildingHelper.java:237)
	at org.apache.maven.project.DefaultModelBuildingListener.buildExtensionsAssembled(DefaultModelBuildingListener.java:106)
	at org.apache.maven.model.building.ModelBuildingEventCatapult$1.fire(ModelBuildingEventCatapult.java:43)
	at org.apache.maven.model.building.DefaultModelBuilder.fireEvent(DefaultModelBuilder.java:1053)
	at org.apache.maven.model.building.DefaultModelBuilder.build(DefaultModelBuilder.java:388)
	at org.apache.maven.model.building.DefaultModelBuilder.build(DefaultModelBuilder.java:371)
	at org.apache.maven.project.DefaultProjectBuilder.build(DefaultProjectBuilder.java:560)
	at org.apache.maven.project.DefaultProjectBuilder.build(DefaultProjectBuilder.java:352)
	at org.apache.maven.DefaultMaven.collectProjects(DefaultMaven.java:636)
	at org.apache.maven.DefaultMaven.getProjectsForMavenReactor(DefaultMaven.java:585)
	at org.apache.maven.DefaultMaven.doExecute(DefaultMaven.java:234)
	at org.apache.maven.DefaultMaven.execute(DefaultMaven.java:156)
	at org.jvnet.hudson.maven3.launcher.Maven3Launcher.main(Maven3Launcher.java:117)
	at sun.reflect.NativeMethodAccessorImpl.invoke0(Native Method)
	at sun.reflect.NativeMethodAccessorImpl.invoke(NativeMethodAccessorImpl.java:57)
	at sun.reflect.DelegatingMethodAccessorImpl.invoke(DelegatingMethodAccessorImpl.java:43)
	at java.lang.reflect.Method.invoke(Method.java:606)
	at org.codehaus.plexus.classworlds.launcher.Launcher.launchStandard(Launcher.java:329)
	at org.codehaus.plexus.classworlds.launcher.Launcher.launch(Launcher.java:239)
	at org.jvnet.hudson.maven3.agent.Maven3Main.launch(Maven3Main.java:178)
	at sun.reflect.NativeMethodAccessorImpl.invoke0(Native Method)
	at sun.reflect.NativeMethodAccessorImpl.invoke(NativeMethodAccessorImpl.java:57)
	at sun.reflect.DelegatingMethodAccessorImpl.invoke(DelegatingMethodAccessorImpl.java:43)
	at java.lang.reflect.Method.invoke(Method.java:606)
	at hudson.maven.Maven3Builder.call(Maven3Builder.java:136)
	at hudson.maven.Maven3Builder.call(Maven3Builder.java:71)
	at hudson.remoting.UserRequest.perform(UserRequest.java:118)
	at hudson.remoting.UserRequest.perform(UserRequest.java:48)
	at hudson.remoting.Request$2.run(Request.java:328)
	at hudson.remoting.InterceptingExecutorService$1.call(InterceptingExecutorService.java:72)
	at java.util.concurrent.FutureTask$Sync.innerRun(FutureTask.java:334)
	at java.util.concurrent.FutureTask.run(FutureTask.java:166)
	at java.util.concurrent.ThreadPoolExecutor.runWorker(ThreadPoolExecutor.java:1145)
	at java.util.concurrent.ThreadPoolExecutor$Worker.run(ThreadPoolExecutor.java:615)
	at java.lang.Thread.run(Thread.java:724)
Caused by: org.sonatype.aether.resolution.ArtifactResolutionException: Could not find artifact
org.apache.felix:maven-bundle-plugin:jar:2.5.4-SNAPSHOT in apache-snapshots (http://repository.apache.org/content/groups/snapshots-group)
	at org.sonatype.aether.impl.internal.DefaultArtifactResolver.resolve(DefaultArtifactResolver.java:538)
	at org.sonatype.aether.impl.internal.DefaultArtifactResolver.resolveArtifacts(DefaultArtifactResolver.java:216)
	at org.sonatype.aether.impl.internal.DefaultRepositorySystem.resolveDependencies(DefaultRepositorySystem.java:358)
	at org.apache.maven.plugin.internal.DefaultPluginDependenciesResolver.resolve(DefaultPluginDependenciesResolver.java:207)
	... 36 more
Caused by: org.sonatype.aether.transfer.ArtifactNotFoundException: Could not find artifact
org.apache.felix:maven-bundle-plugin:jar:2.5.4-SNAPSHOT in apache-snapshots (http://repository.apache.org/content/groups/snapshots-group)
	at org.sonatype.aether.connector.wagon.WagonRepositoryConnector$4.wrap(WagonRepositoryConnector.java:947)
	at org.sonatype.aether.connector.wagon.WagonRepositoryConnector$4.wrap(WagonRepositoryConnector.java:941)
	at org.sonatype.aether.connector.wagon.WagonRepositoryConnector$GetTask.run(WagonRepositoryConnector.java:669)
	at org.sonatype.aether.util.concurrency.RunnableErrorForwarder$1.run(RunnableErrorForwarder.java:60)
	... 3 more
[ERROR] 
[ERROR] Re-run Maven using the -X switch to enable full debug logging.
[ERROR] 
[ERROR] For more information about the errors and possible solutions, please read the following
articles:
[ERROR] [Help 1] http://cwiki.apache.org/confluence/display/MAVEN/ProjectBuildingException
[ERROR] [Help 2] http://cwiki.apache.org/confluence/display/MAVEN/PluginResolutionException
channel stopped

Mime
View raw message