karaf-commits mailing list archives

Site index · List index
Message view « Date » · « Thread »
Top « Date » · « Thread »
From Apache Jenkins Server <jenk...@builds.apache.org>
Subject Build failed in Jenkins: karaf-3.0.x » Apache Karaf :: Integration Tests #603
Date Fri, 06 Feb 2015 18:26:30 GMT
See <https://builds.apache.org/job/karaf-3.0.x/org.apache.karaf.itests$itests/603/>

------------------------------------------
[...truncated 5732 lines...]
18:25:22,788 | INFO  | hell.security.impl.SecuredCommandConfigTransformer | Generating command
ACL config org.apache.karaf.command.acl.shell into service ACL configs [org.apache.karaf.service.acl.command.shell.java,
org.apache.karaf.service.acl.command.shell.edit, org.apache.karaf.service.acl.command.shell.exec,
org.apache.karaf.service.acl.command.shell.new]
18:25:22,793 | INFO  | hell.security.impl.SecuredCommandConfigTransformer | Generating command
ACL config org.apache.karaf.command.acl.system into service ACL configs [org.apache.karaf.service.acl.command.system.start-level,
org.apache.karaf.service.acl.command.system.shutdown, org.apache.karaf.service.acl.command.system.property]
18:25:22,798 | INFO  | hell.security.impl.SecuredCommandConfigTransformer | Generating command
ACL config org.apache.karaf.command.acl.scope_bundle into service ACL configs [org.apache.karaf.service.acl.command.scope_bundle.admin,
org.apache.karaf.service.acl.command.scope_bundle.shell, org.apache.karaf.service.acl.command.scope_bundle.packages,
org.apache.karaf.service.acl.command.scope_bundle.ssh, org.apache.karaf.service.acl.command.scope_bundle.jaas,
org.apache.karaf.service.acl.command.scope_bundle.log, org.apache.karaf.service.acl.command.scope_bundle.features,
org.apache.karaf.service.acl.command.scope_bundle.config, org.apache.karaf.service.acl.command.scope_bundle.osgi]
18:25:22,808 | INFO  | hell.security.impl.SecuredCommandConfigTransformer | Generating command
ACL config org.apache.karaf.command.acl.kar into service ACL configs [org.apache.karaf.service.acl.command.kar.install,
org.apache.karaf.service.acl.command.kar.uninstall]
18:25:22,813 | INFO  | hell.security.impl.SecuredCommandConfigTransformer | Generating command
ACL config org.apache.karaf.command.acl.bundle into service ACL configs [org.apache.karaf.service.acl.command.bundle.install,
org.apache.karaf.service.acl.command.bundle.uninstall, org.apache.karaf.service.acl.command.bundle.update,
org.apache.karaf.service.acl.command.bundle.restart, org.apache.karaf.service.acl.command.bundle.start,
org.apache.karaf.service.acl.command.bundle.stop, org.apache.karaf.service.acl.command.bundle.watch,
org.apache.karaf.service.acl.command.bundle.refresh]
        __ __                  ____      
       / //_/____ __________ _/ __/      
      / ,<  / __ `/ ___/ __ `/ /_        
     / /| |/ /_/ / /  / /_/ / __/        
    /_/ |_|\__,_/_/   \__,_/_/         

  Apache Karaf (3.0.4-SNAPSHOT)

Hit '<tab>' for a list of available commands
and '[cmd] --help' for help on a specific command.
Hit '<ctrl-d>' or type 'system:shutdown' or 'logout' to shutdown Karaf.

karaf@root()> 18:25:23,434 | INFO  | raf.region.persist.internal.RegionsPersistenceImpl
| Loading region digraph persistence
18:25:23,494 | INFO  | raf.region.persist.internal.RegionsPersistenceImpl | initializing region
digraph from etc/regions-config.xml
18:25:24,828 | INFO  | org.apache.karaf.itests.KarafTestWatcher           | >>>>>>
testMBean(org.apache.karaf.itests.JmsTest) <<<<<
18:25:26,500 | WARN  | ache.karaf.features.internal.FeatureValidationUtil | Old style feature
file without namespace found (URI: mvn:org.apache.activemq/activemq-karaf/5.10.0/xml/features).
This format is deprecated and support for it will soon be removed
18:25:26,509 | WARN  | ache.karaf.features.internal.FeatureValidationUtil | Old style feature
file without namespace found (URI: mvn:org.apache.activemq/activemq-karaf/5.10.0/xml/features-core).
This format is deprecated and support for it will soon be removed
18:25:27,596 | WARN  | org.ops4j.pax.url.mvn.internal.AetherBasedResolver | Error resolving
artifactorg.apache.xbean:xbean-spring:jar:3.16:Could not transfer artifact org.apache.xbean:xbean-spring:jar:3.16
from/to central (http://repo1.maven.org/maven2/): /home/jenkins/.m2/repository/org/apache/xbean/xbean-spring/3.16/xbean-spring-3.16.jar.part.lock
(No such file or directory)
shaded.org.eclipse.aether.resolution.ArtifactResolutionException: Could not transfer artifact
org.apache.xbean:xbean-spring:jar:3.16 from/to central (http://repo1.maven.org/maven2/): /home/jenkins/.m2/repository/org/apache/xbean/xbean-spring/3.16/xbean-spring-3.16.jar.part.lock
(No such file or directory)
	at shaded.org.eclipse.aether.internal.impl.DefaultArtifactResolver.resolve(DefaultArtifactResolver.java:444)
	at shaded.org.eclipse.aether.internal.impl.DefaultArtifactResolver.resolveArtifacts(DefaultArtifactResolver.java:246)
	at shaded.org.eclipse.aether.internal.impl.DefaultArtifactResolver.resolveArtifact(DefaultArtifactResolver.java:223)
	at shaded.org.eclipse.aether.internal.impl.DefaultRepositorySystem.resolveArtifact(DefaultRepositorySystem.java:294)
	at org.ops4j.pax.url.mvn.internal.AetherBasedResolver.resolve(AetherBasedResolver.java:476)
	at org.ops4j.pax.url.mvn.internal.AetherBasedResolver.resolve(AetherBasedResolver.java:433)
	at org.ops4j.pax.url.mvn.internal.AetherBasedResolver.resolve(AetherBasedResolver.java:411)
	at org.ops4j.pax.url.mvn.internal.AetherBasedResolver.resolve(AetherBasedResolver.java:386)
	at org.ops4j.pax.url.mvn.internal.Connection.getInputStream(Connection.java:124)
	at java.net.URL.openStream(URL.java:1037)[:1.7.0_25]
	at org.apache.karaf.features.internal.BundleManager.getInputStreamForBundle(BundleManager.java:185)
	at org.apache.karaf.features.internal.BundleManager.doInstallBundleIfNeeded(BundleManager.java:95)
	at org.apache.karaf.features.internal.BundleManager.installBundleIfNeeded(BundleManager.java:89)
	at org.apache.karaf.features.internal.FeaturesServiceImpl.doInstallFeature(FeaturesServiceImpl.java:556)
	at org.apache.karaf.features.internal.FeaturesServiceImpl.installFeatureDependency(FeaturesServiceImpl.java:613)
	at org.apache.karaf.features.internal.FeaturesServiceImpl.doInstallFeature(FeaturesServiceImpl.java:547)
	at org.apache.karaf.features.internal.FeaturesServiceImpl.installFeatureDependency(FeaturesServiceImpl.java:613)
	at org.apache.karaf.features.internal.FeaturesServiceImpl.doInstallFeature(FeaturesServiceImpl.java:547)
	at org.apache.karaf.features.internal.FeaturesServiceImpl.installFeatures(FeaturesServiceImpl.java:419)
	at org.apache.karaf.features.internal.FeaturesServiceImpl.installFeature(FeaturesServiceImpl.java:400)
	at org.apache.karaf.features.internal.FeaturesServiceImpl.installFeature(FeaturesServiceImpl.java:378)
	at org.apache.karaf.features.internal.FeaturesServiceImpl.installFeature(FeaturesServiceImpl.java:359)
	at org.apache.karaf.features.internal.FeaturesServiceImpl.installFeature(FeaturesServiceImpl.java:337)
	at Proxy2d7b5a93_36b5_464e_a5e7_5c781d6990a1.installFeature(Unknown Source)
	at org.apache.karaf.itests.KarafTestSupport.installAndAssertFeature(KarafTestSupport.java:414)
	at org.apache.karaf.itests.JmsTest.installJmsFeatureAndActiveMQBroker(JmsTest.java:42)
	at sun.reflect.NativeMethodAccessorImpl.invoke0(Native Method)[:1.7.0_25]
	at sun.reflect.NativeMethodAccessorImpl.invoke(NativeMethodAccessorImpl.java:57)[:1.7.0_25]
	at sun.reflect.DelegatingMethodAccessorImpl.invoke(DelegatingMethodAccessorImpl.java:43)[:1.7.0_25]
	at java.lang.reflect.Method.invoke(Method.java:606)[:1.7.0_25]
	at org.junit.runners.model.FrameworkMethod$1.runReflectiveCall(FrameworkMethod.java:50)
	at org.junit.internal.runners.model.ReflectiveCallable.run(ReflectiveCallable.java:12)
	at org.junit.runners.model.FrameworkMethod.invokeExplosively(FrameworkMethod.java:47)
	at org.junit.internal.runners.statements.RunBefores.evaluate(RunBefores.java:24)
	at org.junit.rules.TestWatcher$1.evaluate(TestWatcher.java:55)
	at org.junit.rules.RunRules.evaluate(RunRules.java:20)
	at org.junit.runners.ParentRunner.runLeaf(ParentRunner.java:325)[61:org.ops4j.pax.tipi.junit:4.12.0.1]
	at org.junit.runners.BlockJUnit4ClassRunner.runChild(BlockJUnit4ClassRunner.java:78)
	at org.ops4j.pax.exam.invoker.junit.internal.ContainerTestRunner.runChild(ContainerTestRunner.java:68)
	at org.ops4j.pax.exam.invoker.junit.internal.ContainerTestRunner.runChild(ContainerTestRunner.java:37)
	at org.junit.runners.ParentRunner$3.run(ParentRunner.java:290)[61:org.ops4j.pax.tipi.junit:4.12.0.1]
	at org.junit.runners.ParentRunner$1.schedule(ParentRunner.java:71)[61:org.ops4j.pax.tipi.junit:4.12.0.1]
	at org.junit.runners.ParentRunner.runChildren(ParentRunner.java:288)[61:org.ops4j.pax.tipi.junit:4.12.0.1]
	at org.junit.runners.ParentRunner.access$000(ParentRunner.java:58)[61:org.ops4j.pax.tipi.junit:4.12.0.1]
	at org.junit.runners.ParentRunner$2.evaluate(ParentRunner.java:268)[61:org.ops4j.pax.tipi.junit:4.12.0.1]
	at org.junit.runners.ParentRunner.run(ParentRunner.java:363)[61:org.ops4j.pax.tipi.junit:4.12.0.1]
	at org.junit.runner.JUnitCore.run(JUnitCore.java:137)
	at org.junit.runner.JUnitCore.run(JUnitCore.java:115)
	at org.ops4j.pax.exam.invoker.junit.internal.JUnitProbeInvoker.invokeViaJUnit(JUnitProbeInvoker.java:124)
	at org.ops4j.pax.exam.invoker.junit.internal.JUnitProbeInvoker.findAndInvoke(JUnitProbeInvoker.java:97)
	at org.ops4j.pax.exam.invoker.junit.internal.JUnitProbeInvoker.call(JUnitProbeInvoker.java:73)
	at sun.reflect.NativeMethodAccessorImpl.invoke0(Native Method)[:1.7.0_25]
	at sun.reflect.NativeMethodAccessorImpl.invoke(NativeMethodAccessorImpl.java:57)[:1.7.0_25]
	at sun.reflect.DelegatingMethodAccessorImpl.invoke(DelegatingMethodAccessorImpl.java:43)[:1.7.0_25]
	at java.lang.reflect.Method.invoke(Method.java:606)[:1.7.0_25]
	at org.ops4j.pax.exam.rbc.internal.RemoteBundleContextImpl.remoteCall(RemoteBundleContextImpl.java:80)
	at sun.reflect.NativeMethodAccessorImpl.invoke0(Native Method)[:1.7.0_25]
	at sun.reflect.NativeMethodAccessorImpl.invoke(NativeMethodAccessorImpl.java:57)[:1.7.0_25]
	at sun.reflect.DelegatingMethodAccessorImpl.invoke(DelegatingMethodAccessorImpl.java:43)[:1.7.0_25]
	at java.lang.reflect.Method.invoke(Method.java:606)[:1.7.0_25]
	at sun.rmi.server.UnicastServerRef.dispatch(UnicastServerRef.java:322)[:1.7.0_25]
	at sun.rmi.transport.Transport$1.run(Transport.java:177)[:1.7.0_25]
	at sun.rmi.transport.Transport$1.run(Transport.java:174)[:1.7.0_25]
	at java.security.AccessController.doPrivileged(Native Method)[:1.7.0_25]
	at sun.rmi.transport.Transport.serviceCall(Transport.java:173)[:1.7.0_25]
	at sun.rmi.transport.tcp.TCPTransport.handleMessages(TCPTransport.java:553)[:1.7.0_25]
	at sun.rmi.transport.tcp.TCPTransport$ConnectionHandler.run0(TCPTransport.java:808)[:1.7.0_25]
	at sun.rmi.transport.tcp.TCPTransport$ConnectionHandler.run(TCPTransport.java:667)[:1.7.0_25]
	at java.util.concurrent.ThreadPoolExecutor.runWorker(ThreadPoolExecutor.java:1145)[:1.7.0_25]
	at java.util.concurrent.ThreadPoolExecutor$Worker.run(ThreadPoolExecutor.java:615)[:1.7.0_25]
	at java.lang.Thread.run(Thread.java:724)[:1.7.0_25]
Caused by: shaded.org.eclipse.aether.transfer.ArtifactTransferException: Could not transfer
artifact org.apache.xbean:xbean-spring:jar:3.16 from/to central (http://repo1.maven.org/maven2/):
/home/jenkins/.m2/repository/org/apache/xbean/xbean-spring/3.16/xbean-spring-3.16.jar.part.lock
(No such file or directory)
	at shaded.org.eclipse.aether.connector.basic.ArtifactTransportListener.transferFailed(ArtifactTransportListener.java:43)
	at shaded.org.eclipse.aether.connector.basic.BasicRepositoryConnector$TaskRunner.run(BasicRepositoryConnector.java:355)
	at shaded.org.eclipse.aether.util.concurrency.RunnableErrorForwarder$1.run(RunnableErrorForwarder.java:67)
	at shaded.org.eclipse.aether.connector.basic.BasicRepositoryConnector$DirectExecutor.execute(BasicRepositoryConnector.java:581)
	at shaded.org.eclipse.aether.connector.basic.BasicRepositoryConnector.get(BasicRepositoryConnector.java:249)
	at shaded.org.eclipse.aether.internal.impl.DefaultArtifactResolver.performDownloads(DefaultArtifactResolver.java:520)
	at shaded.org.eclipse.aether.internal.impl.DefaultArtifactResolver.resolve(DefaultArtifactResolver.java:421)
	... 70 more
Caused by: java.io.FileNotFoundException: /home/jenkins/.m2/repository/org/apache/xbean/xbean-spring/3.16/xbean-spring-3.16.jar.part.lock
(No such file or directory)
	at java.io.RandomAccessFile.open(Native Method)[:1.7.0_25]
	at java.io.RandomAccessFile.<init>(RandomAccessFile.java:233)[:1.7.0_25]
	at shaded.org.eclipse.aether.connector.basic.PartialFile$LockFile.tryLock(PartialFile.java:123)
	at shaded.org.eclipse.aether.connector.basic.PartialFile$LockFile.lock(PartialFile.java:71)
	at shaded.org.eclipse.aether.connector.basic.PartialFile$LockFile.<init>(PartialFile.java:58)
	at shaded.org.eclipse.aether.connector.basic.PartialFile$Factory.newInstance(PartialFile.java:210)
	at shaded.org.eclipse.aether.connector.basic.BasicRepositoryConnector$GetTaskRunner.runTask(BasicRepositoryConnector.java:432)
	at shaded.org.eclipse.aether.connector.basic.BasicRepositoryConnector$TaskRunner.run(BasicRepositoryConnector.java:350)
	... 75 more
18:25:27,648 | ERROR | org.apache.karaf.itests.KarafTestWatcher           | >>>>>>
FAILED: testMBean(org.apache.karaf.itests.JmsTest) , cause: Can't install feature activemq-broker-noweb/0.0.0:
	
Error resolving artifact org.apache.xbean:xbean-spring:jar:3.16: Could not transfer artifact
org.apache.xbean:xbean-spring:jar:3.16 from/to central (http://repo1.maven.org/maven2/): /home/jenkins/.m2/repository/org/apache/xbean/xbean-spring/3.16/xbean-spring-3.16.jar.part.lock
(No such file or directory)
18:25:27,705 | INFO  | org.apache.karaf.itests.KarafTestWatcher           | >>>>>>
testCommands(org.apache.karaf.itests.JmsTest) <<<<<
18:25:28,394 | WARN  | ache.karaf.features.internal.FeatureValidationUtil | Old style feature
file without namespace found (URI: mvn:org.apache.activemq/activemq-karaf/5.10.0/xml/features).
This format is deprecated and support for it will soon be removed
18:25:29,230 | WARN  | org.ops4j.pax.url.mvn.internal.AetherBasedResolver | Error resolving
artifactorg.apache.xbean:xbean-spring:jar:3.16:Could not transfer artifact org.apache.xbean:xbean-spring:jar:3.16
from/to central (http://repo1.maven.org/maven2/): /home/jenkins/.m2/repository/org/apache/xbean/xbean-spring/3.16/xbean-spring-3.16.jar.part.lock
(No such file or directory)
shaded.org.eclipse.aether.resolution.ArtifactResolutionException: Could not transfer artifact
org.apache.xbean:xbean-spring:jar:3.16 from/to central (http://repo1.maven.org/maven2/): /home/jenkins/.m2/repository/org/apache/xbean/xbean-spring/3.16/xbean-spring-3.16.jar.part.lock
(No such file or directory)
	at shaded.org.eclipse.aether.internal.impl.DefaultArtifactResolver.resolve(DefaultArtifactResolver.java:444)
	at shaded.org.eclipse.aether.internal.impl.DefaultArtifactResolver.resolveArtifacts(DefaultArtifactResolver.java:246)
	at shaded.org.eclipse.aether.internal.impl.DefaultArtifactResolver.resolveArtifact(DefaultArtifactResolver.java:223)
	at shaded.org.eclipse.aether.internal.impl.DefaultRepositorySystem.resolveArtifact(DefaultRepositorySystem.java:294)
	at org.ops4j.pax.url.mvn.internal.AetherBasedResolver.resolve(AetherBasedResolver.java:476)
	at org.ops4j.pax.url.mvn.internal.AetherBasedResolver.resolve(AetherBasedResolver.java:433)
	at org.ops4j.pax.url.mvn.internal.AetherBasedResolver.resolve(AetherBasedResolver.java:411)
	at org.ops4j.pax.url.mvn.internal.AetherBasedResolver.resolve(AetherBasedResolver.java:386)
	at org.ops4j.pax.url.mvn.internal.Connection.getInputStream(Connection.java:124)
	at java.net.URL.openStream(URL.java:1037)[:1.7.0_25]
	at org.apache.karaf.features.internal.BundleManager.getInputStreamForBundle(BundleManager.java:185)
	at org.apache.karaf.features.internal.BundleManager.doInstallBundleIfNeeded(BundleManager.java:95)
	at org.apache.karaf.features.internal.BundleManager.installBundleIfNeeded(BundleManager.java:89)
	at org.apache.karaf.features.internal.FeaturesServiceImpl.doInstallFeature(FeaturesServiceImpl.java:556)
	at org.apache.karaf.features.internal.FeaturesServiceImpl.installFeatureDependency(FeaturesServiceImpl.java:613)
	at org.apache.karaf.features.internal.FeaturesServiceImpl.doInstallFeature(FeaturesServiceImpl.java:547)
	at org.apache.karaf.features.internal.FeaturesServiceImpl.installFeatureDependency(FeaturesServiceImpl.java:613)
	at org.apache.karaf.features.internal.FeaturesServiceImpl.doInstallFeature(FeaturesServiceImpl.java:547)
	at org.apache.karaf.features.internal.FeaturesServiceImpl.installFeatures(FeaturesServiceImpl.java:419)
	at org.apache.karaf.features.internal.FeaturesServiceImpl.installFeature(FeaturesServiceImpl.java:400)
	at org.apache.karaf.features.internal.FeaturesServiceImpl.installFeature(FeaturesServiceImpl.java:378)
	at org.apache.karaf.features.internal.FeaturesServiceImpl.installFeature(FeaturesServiceImpl.java:359)
	at org.apache.karaf.features.internal.FeaturesServiceImpl.installFeature(FeaturesServiceImpl.java:337)
	at Proxy2d7b5a93_36b5_464e_a5e7_5c781d6990a1.installFeature(Unknown Source)
	at org.apache.karaf.itests.KarafTestSupport.installAndAssertFeature(KarafTestSupport.java:414)
	at org.apache.karaf.itests.JmsTest.installJmsFeatureAndActiveMQBroker(JmsTest.java:42)
	at sun.reflect.NativeMethodAccessorImpl.invoke0(Native Method)[:1.7.0_25]
	at sun.reflect.NativeMethodAccessorImpl.invoke(NativeMethodAccessorImpl.java:57)[:1.7.0_25]
	at sun.reflect.DelegatingMethodAccessorImpl.invoke(DelegatingMethodAccessorImpl.java:43)[:1.7.0_25]
	at java.lang.reflect.Method.invoke(Method.java:606)[:1.7.0_25]
	at org.junit.runners.model.FrameworkMethod$1.runReflectiveCall(FrameworkMethod.java:50)
	at org.junit.internal.runners.model.ReflectiveCallable.run(ReflectiveCallable.java:12)
	at org.junit.runners.model.FrameworkMethod.invokeExplosively(FrameworkMethod.java:47)
	at org.junit.internal.runners.statements.RunBefores.evaluate(RunBefores.java:24)
	at org.junit.rules.TestWatcher$1.evaluate(TestWatcher.java:55)
	at org.junit.rules.RunRules.evaluate(RunRules.java:20)
	at org.junit.runners.ParentRunner.runLeaf(ParentRunner.java:325)[61:org.ops4j.pax.tipi.junit:4.12.0.1]
	at org.junit.runners.BlockJUnit4ClassRunner.runChild(BlockJUnit4ClassRunner.java:78)
	at org.ops4j.pax.exam.invoker.junit.internal.ContainerTestRunner.runChild(ContainerTestRunner.java:68)
	at org.ops4j.pax.exam.invoker.junit.internal.ContainerTestRunner.runChild(ContainerTestRunner.java:37)
	at org.junit.runners.ParentRunner$3.run(ParentRunner.java:290)[61:org.ops4j.pax.tipi.junit:4.12.0.1]
	at org.junit.runners.ParentRunner$1.schedule(ParentRunner.java:71)[61:org.ops4j.pax.tipi.junit:4.12.0.1]
	at org.junit.runners.ParentRunner.runChildren(ParentRunner.java:288)[61:org.ops4j.pax.tipi.junit:4.12.0.1]
	at org.junit.runners.ParentRunner.access$000(ParentRunner.java:58)[61:org.ops4j.pax.tipi.junit:4.12.0.1]
	at org.junit.runners.ParentRunner$2.evaluate(ParentRunner.java:268)[61:org.ops4j.pax.tipi.junit:4.12.0.1]
	at org.junit.runners.ParentRunner.run(ParentRunner.java:363)[61:org.ops4j.pax.tipi.junit:4.12.0.1]
	at org.junit.runner.JUnitCore.run(JUnitCore.java:137)
	at org.junit.runner.JUnitCore.run(JUnitCore.java:115)
	at org.ops4j.pax.exam.invoker.junit.internal.JUnitProbeInvoker.invokeViaJUnit(JUnitProbeInvoker.java:124)
	at org.ops4j.pax.exam.invoker.junit.internal.JUnitProbeInvoker.findAndInvoke(JUnitProbeInvoker.java:97)
	at org.ops4j.pax.exam.invoker.junit.internal.JUnitProbeInvoker.call(JUnitProbeInvoker.java:73)
	at sun.reflect.NativeMethodAccessorImpl.invoke0(Native Method)[:1.7.0_25]
	at sun.reflect.NativeMethodAccessorImpl.invoke(NativeMethodAccessorImpl.java:57)[:1.7.0_25]
	at sun.reflect.DelegatingMethodAccessorImpl.invoke(DelegatingMethodAccessorImpl.java:43)[:1.7.0_25]
	at java.lang.reflect.Method.invoke(Method.java:606)[:1.7.0_25]
	at org.ops4j.pax.exam.rbc.internal.RemoteBundleContextImpl.remoteCall(RemoteBundleContextImpl.java:80)
	at sun.reflect.NativeMethodAccessorImpl.invoke0(Native Method)[:1.7.0_25]
	at sun.reflect.NativeMethodAccessorImpl.invoke(NativeMethodAccessorImpl.java:57)[:1.7.0_25]
	at sun.reflect.DelegatingMethodAccessorImpl.invoke(DelegatingMethodAccessorImpl.java:43)[:1.7.0_25]
	at java.lang.reflect.Method.invoke(Method.java:606)[:1.7.0_25]
	at sun.rmi.server.UnicastServerRef.dispatch(UnicastServerRef.java:322)[:1.7.0_25]
	at sun.rmi.transport.Transport$1.run(Transport.java:177)[:1.7.0_25]
	at sun.rmi.transport.Transport$1.run(Transport.java:174)[:1.7.0_25]
	at java.security.AccessController.doPrivileged(Native Method)[:1.7.0_25]
	at sun.rmi.transport.Transport.serviceCall(Transport.java:173)[:1.7.0_25]
	at sun.rmi.transport.tcp.TCPTransport.handleMessages(TCPTransport.java:553)[:1.7.0_25]
	at sun.rmi.transport.tcp.TCPTransport$ConnectionHandler.run0(TCPTransport.java:808)[:1.7.0_25]
	at sun.rmi.transport.tcp.TCPTransport$ConnectionHandler.run(TCPTransport.java:667)[:1.7.0_25]
	at java.util.concurrent.ThreadPoolExecutor.runWorker(ThreadPoolExecutor.java:1145)[:1.7.0_25]
	at java.util.concurrent.ThreadPoolExecutor$Worker.run(ThreadPoolExecutor.java:615)[:1.7.0_25]
	at java.lang.Thread.run(Thread.java:724)[:1.7.0_25]
Caused by: shaded.org.eclipse.aether.transfer.ArtifactTransferException: Could not transfer
artifact org.apache.xbean:xbean-spring:jar:3.16 from/to central (http://repo1.maven.org/maven2/):
/home/jenkins/.m2/repository/org/apache/xbean/xbean-spring/3.16/xbean-spring-3.16.jar.part.lock
(No such file or directory)
	at shaded.org.eclipse.aether.connector.basic.ArtifactTransportListener.transferFailed(ArtifactTransportListener.java:43)
	at shaded.org.eclipse.aether.connector.basic.BasicRepositoryConnector$TaskRunner.run(BasicRepositoryConnector.java:355)
	at shaded.org.eclipse.aether.util.concurrency.RunnableErrorForwarder$1.run(RunnableErrorForwarder.java:67)
	at shaded.org.eclipse.aether.connector.basic.BasicRepositoryConnector$DirectExecutor.execute(BasicRepositoryConnector.java:581)
	at shaded.org.eclipse.aether.connector.basic.BasicRepositoryConnector.get(BasicRepositoryConnector.java:249)
	at shaded.org.eclipse.aether.internal.impl.DefaultArtifactResolver.performDownloads(DefaultArtifactResolver.java:520)
	at shaded.org.eclipse.aether.internal.impl.DefaultArtifactResolver.resolve(DefaultArtifactResolver.java:421)
	... 70 more
Caused by: java.io.FileNotFoundException: /home/jenkins/.m2/repository/org/apache/xbean/xbean-spring/3.16/xbean-spring-3.16.jar.part.lock
(No such file or directory)
	at java.io.RandomAccessFile.open(Native Method)[:1.7.0_25]
	at java.io.RandomAccessFile.<init>(RandomAccessFile.java:233)[:1.7.0_25]
	at shaded.org.eclipse.aether.connector.basic.PartialFile$LockFile.tryLock(PartialFile.java:123)
	at shaded.org.eclipse.aether.connector.basic.PartialFile$LockFile.lock(PartialFile.java:71)
	at shaded.org.eclipse.aether.connector.basic.PartialFile$LockFile.<init>(PartialFile.java:58)
	at shaded.org.eclipse.aether.connector.basic.PartialFile$Factory.newInstance(PartialFile.java:210)
	at shaded.org.eclipse.aether.connector.basic.BasicRepositoryConnector$GetTaskRunner.runTask(BasicRepositoryConnector.java:432)
	at shaded.org.eclipse.aether.connector.basic.BasicRepositoryConnector$TaskRunner.run(BasicRepositoryConnector.java:350)
	... 75 more
18:25:29,287 | ERROR | org.apache.karaf.itests.KarafTestWatcher           | >>>>>>
FAILED: testCommands(org.apache.karaf.itests.JmsTest) , cause: Can't install feature activemq-broker-noweb/0.0.0:
	
Error resolving artifact org.apache.xbean:xbean-spring:jar:3.16: Could not transfer artifact
org.apache.xbean:xbean-spring:jar:3.16 from/to central (http://repo1.maven.org/maven2/): /home/jenkins/.m2/repository/org/apache/xbean/xbean-spring/3.16/xbean-spring-3.16.jar.part.lock
(No such file or directory)

[org.ops4j.pax.exam.spi.reactors.ReactorManager] : suite finished
Tests run: 2, Failures: 0, Errors: 2, Skipped: 0, Time elapsed: 10.776 sec <<< FAILURE!
- in org.apache.karaf.itests.JmsTest
testMBean(org.apache.karaf.itests.JmsTest)  Time elapsed: 3.028 sec  <<< ERROR!
java.lang.IllegalStateException: Can't install feature activemq-broker-noweb/0.0.0: 	
Error resolving artifact org.apache.xbean:xbean-spring:jar:3.16: Could not transfer artifact
org.apache.xbean:xbean-spring:jar:3.16 from/to central (http://repo1.maven.org/maven2/): /home/jenkins/.m2/repository/org/apache/xbean/xbean-spring/3.16/xbean-spring-3.16.jar.part.lock
(No such file or directory)
	at org.apache.karaf.features.internal.FeaturesServiceImpl.installFeature(FeaturesServiceImpl.java:388)
	at org.apache.karaf.features.internal.FeaturesServiceImpl.installFeature(FeaturesServiceImpl.java:359)
	at org.apache.karaf.features.internal.FeaturesServiceImpl.installFeature(FeaturesServiceImpl.java:337)
	at Proxy2d7b5a93_36b5_464e_a5e7_5c781d6990a1.installFeature(Unknown Source)
	at org.apache.karaf.itests.KarafTestSupport.installAndAssertFeature(KarafTestSupport.java:414)
	at org.apache.karaf.itests.JmsTest.installJmsFeatureAndActiveMQBroker(JmsTest.java:42)

testCommands(org.apache.karaf.itests.JmsTest)  Time elapsed: 1.594 sec  <<< ERROR!
java.lang.IllegalStateException: Can't install feature activemq-broker-noweb/0.0.0: 	
Error resolving artifact org.apache.xbean:xbean-spring:jar:3.16: Could not transfer artifact
org.apache.xbean:xbean-spring:jar:3.16 from/to central (http://repo1.maven.org/maven2/): /home/jenkins/.m2/repository/org/apache/xbean/xbean-spring/3.16/xbean-spring-3.16.jar.part.lock
(No such file or directory)
	at org.apache.karaf.features.internal.FeaturesServiceImpl.installFeature(FeaturesServiceImpl.java:388)
	at org.apache.karaf.features.internal.FeaturesServiceImpl.installFeature(FeaturesServiceImpl.java:359)
	at org.apache.karaf.features.internal.FeaturesServiceImpl.installFeature(FeaturesServiceImpl.java:337)
	at Proxy2d7b5a93_36b5_464e_a5e7_5c781d6990a1.installFeature(Unknown Source)
	at org.apache.karaf.itests.KarafTestSupport.installAndAssertFeature(KarafTestSupport.java:414)
	at org.apache.karaf.itests.JmsTest.installJmsFeatureAndActiveMQBroker(JmsTest.java:42)

Running org.apache.karaf.itests.JaasSshCommandSecurityTest
[org.ops4j.pax.exam.junit.impl.ProbeRunner] : creating PaxExam runner for class org.apache.karaf.itests.JaasSshCommandSecurityTest
[org.ops4j.pax.exam.junit.impl.ProbeRunner] : running test class org.apache.karaf.itests.JaasSshCommandSecurityTest
Killed

Results :

Tests in error: 
  JmsTest.installJmsFeatureAndActiveMQBroker:42->KarafTestSupport.installAndAssertFeature:414
� IllegalState
  JmsTest.installJmsFeatureAndActiveMQBroker:42->KarafTestSupport.installAndAssertFeature:414
� IllegalState

Tests run: 154, Failures: 0, Errors: 2, Skipped: 0

[JENKINS] Recording test results

Mime
View raw message