karaf-commits mailing list archives

Site index · List index
Message view « Date » · « Thread »
Top « Date » · « Thread »
From Apache Jenkins Server <jenk...@builds.apache.org>
Subject Build failed in Jenkins: karaf-2.x #252
Date Wed, 06 Aug 2014 03:01:49 GMT
See <https://builds.apache.org/job/karaf-2.x/252/>

------------------------------------------
[...truncated 27222 lines...]
No artifacts from karaf-2.x ? Apache Karaf :: Demos :: Branding :: Shell #251 to compare,
so performing full copy of artifacts
[JENKINS] Archiving <https://builds.apache.org/job/karaf-2.x/ws/tooling/cmdhelp-maven-plugin/pom.xml>
to org.apache.karaf.tooling/cmdhelp-maven-plugin/2.4.0-SNAPSHOT/cmdhelp-maven-plugin-2.4.0-SNAPSHOT.pom
[JENKINS] Archiving <https://builds.apache.org/job/karaf-2.x/ws/tooling/cmdhelp-maven-plugin/target/cmdhelp-maven-plugin-2.4.0-SNAPSHOT.jar>
to org.apache.karaf.tooling/cmdhelp-maven-plugin/2.4.0-20140806.021119-204/cmdhelp-maven-plugin-2.4.0-20140806.021119-204.jar
No artifacts from karaf-2.x ? Apache Karaf :: Tooling :: Maven2 Command Help plugin #251 to
compare, so performing full copy of artifacts
[JENKINS] Archiving <https://builds.apache.org/job/karaf-2.x/ws/assemblies/features/enterprise/pom.xml>
to org.apache.karaf.assemblies.features/enterprise/2.4.0-SNAPSHOT/enterprise-2.4.0-SNAPSHOT.pom
[JENKINS] Archiving <https://builds.apache.org/job/karaf-2.x/ws/assemblies/features/enterprise/target/enterprise-2.4.0-SNAPSHOT.jar>
to org.apache.karaf.assemblies.features/enterprise/2.4.0-20140806.020705-207/enterprise-2.4.0-20140806.020705-207.jar
[JENKINS] Archiving <https://builds.apache.org/job/karaf-2.x/ws/assemblies/features/enterprise/target/classes/features.xml>
to org.apache.karaf.assemblies.features/enterprise/2.4.0-20140806.020705-207/enterprise-2.4.0-20140806.020705-207-features.xml
No artifacts from karaf-2.x ? Apache Karaf :: Assemblies :: Features :: Enterprise #251 to
compare, so performing full copy of artifacts
[JENKINS] Archiving <https://builds.apache.org/job/karaf-2.x/ws/jaas/command/pom.xml>
to org.apache.karaf.jaas/org.apache.karaf.jaas.command/2.4.0-SNAPSHOT/org.apache.karaf.jaas.command-2.4.0-SNAPSHOT.pom
[JENKINS] Archiving <https://builds.apache.org/job/karaf-2.x/ws/jaas/command/target/org.apache.karaf.jaas.command-2.4.0-SNAPSHOT.jar>
to org.apache.karaf.jaas/org.apache.karaf.jaas.command/2.4.0-20140806.020249-210/org.apache.karaf.jaas.command-2.4.0-20140806.020249-210.jar
No artifacts from karaf-2.x ? Apache Karaf :: JAAS :: Command #251 to compare, so performing
full copy of artifacts
[JENKINS] Archiving <https://builds.apache.org/job/karaf-2.x/ws/service/pom.xml> to
org.apache.karaf.service/service/2.4.0-SNAPSHOT/service-2.4.0-SNAPSHOT.pom
No artifacts from karaf-2.x ? Apache Karaf :: Service #251 to compare, so performing full
copy of artifacts
[JENKINS] Archiving <https://builds.apache.org/job/karaf-2.x/ws/demos/deployer/pom.xml>
to org.apache.karaf.demos/org.apache.karaf.demos.deployer/2.4.0-SNAPSHOT/org.apache.karaf.demos.deployer-2.4.0-SNAPSHOT.pom
No artifacts from karaf-2.x ? Apache Karaf :: Demos :: Deployer #251 to compare, so performing
full copy of artifacts
[JENKINS] Archiving <https://builds.apache.org/job/karaf-2.x/ws/assemblies/pom.xml>
to org.apache.karaf.assemblies/assemblies/2.4.0-SNAPSHOT/assemblies-2.4.0-SNAPSHOT.pom
No artifacts from karaf-2.x ? Apache Karaf :: Assemblies #251 to compare, so performing full
copy of artifacts
[JENKINS] Archiving <https://builds.apache.org/job/karaf-2.x/ws/jaas/boot/pom.xml> to
org.apache.karaf.jaas/org.apache.karaf.jaas.boot/2.4.0-SNAPSHOT/org.apache.karaf.jaas.boot-2.4.0-SNAPSHOT.pom
[JENKINS] Archiving <https://builds.apache.org/job/karaf-2.x/ws/jaas/boot/target/org.apache.karaf.jaas.boot-2.4.0-SNAPSHOT.jar>
to org.apache.karaf.jaas/org.apache.karaf.jaas.boot/2.4.0-20140806.015458-217/org.apache.karaf.jaas.boot-2.4.0-20140806.015458-217.jar
No artifacts from karaf-2.x ? Apache Karaf :: JAAS :: Boot #251 to compare, so performing
full copy of artifacts
[JENKINS] Archiving <https://builds.apache.org/job/karaf-2.x/ws/diagnostic/command/pom.xml>
to org.apache.karaf.diagnostic/org.apache.karaf.diagnostic.command/2.4.0-SNAPSHOT/org.apache.karaf.diagnostic.command-2.4.0-SNAPSHOT.pom
[JENKINS] Archiving <https://builds.apache.org/job/karaf-2.x/ws/diagnostic/command/target/org.apache.karaf.diagnostic.command-2.4.0-SNAPSHOT.jar>
to org.apache.karaf.diagnostic/org.apache.karaf.diagnostic.command/2.4.0-20140806.020743-206/org.apache.karaf.diagnostic.command-2.4.0-20140806.020743-206.jar
No artifacts from karaf-2.x ? Apache Karaf :: Diagnostic :: Command #251 to compare, so performing
full copy of artifacts
[JENKINS] Archiving <https://builds.apache.org/job/karaf-2.x/ws/webconsole/gogo/pom.xml>
to org.apache.karaf.webconsole/org.apache.karaf.webconsole.gogo/2.4.0-SNAPSHOT/org.apache.karaf.webconsole.gogo-2.4.0-SNAPSHOT.pom
[JENKINS] Archiving <https://builds.apache.org/job/karaf-2.x/ws/webconsole/gogo/target/org.apache.karaf.webconsole.gogo-2.4.0-SNAPSHOT.jar>
to org.apache.karaf.webconsole/org.apache.karaf.webconsole.gogo/2.4.0-20140806.020619-207/org.apache.karaf.webconsole.gogo-2.4.0-20140806.020619-207.jar
No artifacts from karaf-2.x ? Apache Karaf :: Web Console :: Gogo Plugin #251 to compare,
so performing full copy of artifacts
[JENKINS] Archiving <https://builds.apache.org/job/karaf-2.x/ws/management/mbeans/bundles/pom.xml>
to org.apache.karaf.management.mbeans/org.apache.karaf.management.mbeans.bundles/2.4.0-SNAPSHOT/org.apache.karaf.management.mbeans.bundles-2.4.0-SNAPSHOT.pom
[JENKINS] Archiving <https://builds.apache.org/job/karaf-2.x/ws/management/mbeans/bundles/target/org.apache.karaf.management.mbeans.bundles-2.4.0-SNAPSHOT.jar>
to org.apache.karaf.management.mbeans/org.apache.karaf.management.mbeans.bundles/2.4.0-20140806.020310-210/org.apache.karaf.management.mbeans.bundles-2.4.0-20140806.020310-210.jar
No artifacts from karaf-2.x ? Apache Karaf :: Management :: MBeans :: Bundles #251 to compare,
so performing full copy of artifacts
[JENKINS] Archiving <https://builds.apache.org/job/karaf-2.x/ws/management/mbeans/scr/pom.xml>
to org.apache.karaf.management.mbeans/org.apache.karaf.management.mbeans.scr/2.4.0-SNAPSHOT/org.apache.karaf.management.mbeans.scr-2.4.0-SNAPSHOT.pom
[JENKINS] Archiving <https://builds.apache.org/job/karaf-2.x/ws/management/mbeans/scr/target/org.apache.karaf.management.mbeans.scr-2.4.0-SNAPSHOT.jar>
to org.apache.karaf.management.mbeans/org.apache.karaf.management.mbeans.scr/2.4.0-20140806.020422-210/org.apache.karaf.management.mbeans.scr-2.4.0-20140806.020422-210.jar
No artifacts from karaf-2.x ? Apache Karaf :: Management :: MBeans :: Services #251 to compare,
so performing full copy of artifacts
[JENKINS] Archiving <https://builds.apache.org/job/karaf-2.x/ws/shell/commands/pom.xml>
to org.apache.karaf.shell/org.apache.karaf.shell.commands/2.4.0-SNAPSHOT/org.apache.karaf.shell.commands-2.4.0-SNAPSHOT.pom
[JENKINS] Archiving <https://builds.apache.org/job/karaf-2.x/ws/shell/commands/target/org.apache.karaf.shell.commands-2.4.0-SNAPSHOT.jar>
to org.apache.karaf.shell/org.apache.karaf.shell.commands/2.4.0-20140806.020011-213/org.apache.karaf.shell.commands-2.4.0-20140806.020011-213.jar
No artifacts from karaf-2.x ? Apache Karaf :: Shell :: Various Commands #251 to compare, so
performing full copy of artifacts
[JENKINS] Archiving <https://builds.apache.org/job/karaf-2.x/ws/demos/web/pom.xml> to
org.apache.karaf.demos/web/2.4.0-SNAPSHOT/web-2.4.0-SNAPSHOT.pom
[JENKINS] Archiving <https://builds.apache.org/job/karaf-2.x/ws/demos/web/target/web-2.4.0-SNAPSHOT.war>
to org.apache.karaf.demos/web/2.4.0-20140806.020943-204/web-2.4.0-20140806.020943-204.war
No artifacts from karaf-2.x ? Apache Karaf :: Demos :: Web #251 to compare, so performing
full copy of artifacts
[JENKINS] Archiving <https://builds.apache.org/job/karaf-2.x/ws/jms/core/pom.xml> to
org.apache.karaf.jms/org.apache.karaf.jms.core/2.4.0-SNAPSHOT/org.apache.karaf.jms.core-2.4.0-SNAPSHOT.pom
[JENKINS] Archiving <https://builds.apache.org/job/karaf-2.x/ws/jms/core/target/org.apache.karaf.jms.core-2.4.0-SNAPSHOT.jar>
to org.apache.karaf.jms/org.apache.karaf.jms.core/2.4.0-20140806.020531-209/org.apache.karaf.jms.core-2.4.0-20140806.020531-209.jar
No artifacts from karaf-2.x ? Apache Karaf :: JMS :: Core #251 to compare, so performing full
copy of artifacts
[JENKINS] Archiving <https://builds.apache.org/job/karaf-2.x/ws/management/mbeans/dev/pom.xml>
to org.apache.karaf.management.mbeans/org.apache.karaf.management.mbeans.dev/2.4.0-SNAPSHOT/org.apache.karaf.management.mbeans.dev-2.4.0-SNAPSHOT.pom
[JENKINS] Archiving <https://builds.apache.org/job/karaf-2.x/ws/management/mbeans/dev/target/org.apache.karaf.management.mbeans.dev-2.4.0-SNAPSHOT.jar>
to org.apache.karaf.management.mbeans/org.apache.karaf.management.mbeans.dev/2.4.0-20140806.020355-210/org.apache.karaf.management.mbeans.dev-2.4.0-20140806.020355-210.jar
No artifacts from karaf-2.x ? Apache Karaf :: Management :: MBeans :: Dev #251 to compare,
so performing full copy of artifacts
[JENKINS] Archiving <https://builds.apache.org/job/karaf-2.x/ws/demos/dump/pom.xml>
to org.apache.karaf.demos/dump/2.4.0-SNAPSHOT/dump-2.4.0-SNAPSHOT.pom
[JENKINS] Archiving <https://builds.apache.org/job/karaf-2.x/ws/demos/dump/target/dump-2.4.0-SNAPSHOT.jar>
to org.apache.karaf.demos/dump/2.4.0-20140806.021007-204/dump-2.4.0-20140806.021007-204.jar
No artifacts from karaf-2.x ? Apache Karaf :: Demos :: Demo Dump provider #251 to compare,
so performing full copy of artifacts
[JENKINS] Archiving <https://builds.apache.org/job/karaf-2.x/ws/shell/scr/pom.xml> to
org.apache.karaf.shell/org.apache.karaf.shell.scr/2.4.0-SNAPSHOT/org.apache.karaf.shell.scr-2.4.0-SNAPSHOT.pom
[JENKINS] Archiving <https://builds.apache.org/job/karaf-2.x/ws/shell/scr/target/org.apache.karaf.shell.scr-2.4.0-SNAPSHOT.jar>
to org.apache.karaf.shell/org.apache.karaf.shell.scr/2.4.0-20140806.020140-210/org.apache.karaf.shell.scr-2.4.0-20140806.020140-210.jar
No artifacts from karaf-2.x ? Apache Karaf :: Shell :: SCR Commands #251 to compare, so performing
full copy of artifacts
[JENKINS] Archiving <https://builds.apache.org/job/karaf-2.x/ws/demos/deployer/feature/pom.xml>
to org.apache.karaf.demos.deployer.feature/my-feature/2.4.0-SNAPSHOT/my-feature-2.4.0-SNAPSHOT.pom
[JENKINS] Archiving <https://builds.apache.org/job/karaf-2.x/ws/demos/deployer/feature/target/classes/feature.xml>
to org.apache.karaf.demos.deployer.feature/my-feature/2.4.0-20140806.021107-204/my-feature-2.4.0-20140806.021107-204-features.xml
No artifacts from karaf-2.x ? Apache Karaf :: Demos :: Deployer :: Feature #251 to compare,
so performing full copy of artifacts
[JENKINS] Archiving <https://builds.apache.org/job/karaf-2.x/ws/exception/pom.xml> to
org.apache.karaf/org.apache.karaf.exception/2.4.0-SNAPSHOT/org.apache.karaf.exception-2.4.0-SNAPSHOT.pom
[JENKINS] Archiving <https://builds.apache.org/job/karaf-2.x/ws/exception/target/org.apache.karaf.exception-2.4.0-SNAPSHOT.jar>
to org.apache.karaf/org.apache.karaf.exception/2.4.0-20140806.020637-206/org.apache.karaf.exception-2.4.0-20140806.020637-206.jar
No artifacts from karaf-2.x ? Apache Karaf :: Exception #251 to compare, so performing full
copy of artifacts
[JENKINS] Archiving <https://builds.apache.org/job/karaf-2.x/ws/shell/pom.xml> to org.apache.karaf.shell/shell/2.4.0-SNAPSHOT/shell-2.4.0-SNAPSHOT.pom
No artifacts from karaf-2.x ? Apache Karaf :: Shell #251 to compare, so performing full copy
of artifacts
[JENKINS] Archiving <https://builds.apache.org/job/karaf-2.x/ws/archetypes/bundle/pom.xml>
to org.apache.karaf.archetypes/karaf-bundle-archetype/2.4.0-SNAPSHOT/karaf-bundle-archetype-2.4.0-SNAPSHOT.pom
[JENKINS] Archiving <https://builds.apache.org/job/karaf-2.x/ws/archetypes/bundle/target/karaf-bundle-archetype-2.4.0-SNAPSHOT.jar>
to org.apache.karaf.archetypes/karaf-bundle-archetype/2.4.0-20140806.021247-202/karaf-bundle-archetype-2.4.0-20140806.021247-202.jar
No artifacts from karaf-2.x ? Apache Karaf :: Archetypes :: Bundle Archetype #251 to compare,
so performing full copy of artifacts
[JENKINS] Archiving <https://builds.apache.org/job/karaf-2.x/ws/admin/core/pom.xml>
to org.apache.karaf.admin/org.apache.karaf.admin.core/2.4.0-SNAPSHOT/org.apache.karaf.admin.core-2.4.0-SNAPSHOT.pom
[JENKINS] Archiving <https://builds.apache.org/job/karaf-2.x/ws/admin/core/target/org.apache.karaf.admin.core-2.4.0-SNAPSHOT.jar>
to org.apache.karaf.admin/org.apache.karaf.admin.core/2.4.0-20140806.015836-216/org.apache.karaf.admin.core-2.4.0-20140806.015836-216.jar
No artifacts from karaf-2.x ? Apache Karaf :: Admin :: Core #251 to compare, so performing
full copy of artifacts
[JENKINS] Archiving <https://builds.apache.org/job/karaf-2.x/ws/shell/config/pom.xml>
to org.apache.karaf.shell/org.apache.karaf.shell.config/2.4.0-SNAPSHOT/org.apache.karaf.shell.config-2.4.0-SNAPSHOT.pom
[JENKINS] Archiving <https://builds.apache.org/job/karaf-2.x/ws/shell/config/target/org.apache.karaf.shell.config-2.4.0-SNAPSHOT.jar>
to org.apache.karaf.shell/org.apache.karaf.shell.config/2.4.0-20140806.020023-212/org.apache.karaf.shell.config-2.4.0-20140806.020023-212.jar
No artifacts from karaf-2.x ? Apache Karaf :: Shell :: ConfigAdmin Commands #251 to compare,
so performing full copy of artifacts
[JENKINS] Archiving <https://builds.apache.org/job/karaf-2.x/ws/pom.xml> to org.apache.karaf/karaf/2.4.0-SNAPSHOT/karaf-2.4.0-SNAPSHOT.pom
No artifacts from karaf-2.x ? Apache Karaf #251 to compare, so performing full copy of artifacts
[JENKINS] Archiving <https://builds.apache.org/job/karaf-2.x/ws/shell/packages/pom.xml>
to org.apache.karaf.shell/org.apache.karaf.shell.packages/2.4.0-SNAPSHOT/org.apache.karaf.shell.packages-2.4.0-SNAPSHOT.pom
[JENKINS] Archiving <https://builds.apache.org/job/karaf-2.x/ws/shell/packages/target/org.apache.karaf.shell.packages-2.4.0-SNAPSHOT.jar>
to org.apache.karaf.shell/org.apache.karaf.shell.packages/2.4.0-20140806.020052-210/org.apache.karaf.shell.packages-2.4.0-20140806.020052-210.jar
No artifacts from karaf-2.x ? Apache Karaf :: Shell :: PackageAdmin Commands #251 to compare,
so performing full copy of artifacts
[JENKINS] Archiving <https://builds.apache.org/job/karaf-2.x/ws/demos/deployer/wrap/dependency-reduced-pom.xml>
to org.apache.karaf.demos.deployer.wrap/osgi.commons-lang/2.4.0-SNAPSHOT/osgi.commons-lang-2.4.0-SNAPSHOT.pom
[JENKINS] Archiving <https://builds.apache.org/job/karaf-2.x/ws/demos/deployer/wrap/target/osgi.commons-lang-2.4.0-SNAPSHOT.jar>
to org.apache.karaf.demos.deployer.wrap/osgi.commons-lang/2.4.0-20140806.021053-204/osgi.commons-lang-2.4.0-20140806.021053-204.jar
No artifacts from karaf-2.x ? Apache Karaf :: Demos :: Deployer :: Wrap Bundle osgi.commons-lang
#251 to compare, so performing full copy of artifacts
[JENKINS] Archiving <https://builds.apache.org/job/karaf-2.x/ws/archetypes/assembly/pom.xml>
to org.apache.karaf.archetypes/karaf-assembly-archetype/2.4.0-SNAPSHOT/karaf-assembly-archetype-2.4.0-SNAPSHOT.pom
[JENKINS] Archiving <https://builds.apache.org/job/karaf-2.x/ws/archetypes/assembly/target/karaf-assembly-archetype-2.4.0-SNAPSHOT.jar>
to org.apache.karaf.archetypes/karaf-assembly-archetype/2.4.0-20140806.021211-202/karaf-assembly-archetype-2.4.0-20140806.021211-202.jar
No artifacts from karaf-2.x ? Apache Karaf :: Archetypes :: Assembly Archetype #251 to compare,
so performing full copy of artifacts
[JENKINS] Archiving <https://builds.apache.org/job/karaf-2.x/ws/management/mbeans/system/pom.xml>
to org.apache.karaf.management.mbeans/org.apache.karaf.management.mbeans.system/2.4.0-SNAPSHOT/org.apache.karaf.management.mbeans.system-2.4.0-SNAPSHOT.pom
[JENKINS] Archiving <https://builds.apache.org/job/karaf-2.x/ws/management/mbeans/system/target/org.apache.karaf.management.mbeans.system-2.4.0-SNAPSHOT.jar>
to org.apache.karaf.management.mbeans/org.apache.karaf.management.mbeans.system/2.4.0-20140806.020328-210/org.apache.karaf.management.mbeans.system-2.4.0-20140806.020328-210.jar
No artifacts from karaf-2.x ? Apache Karaf :: Management :: MBeans :: System #251 to compare,
so performing full copy of artifacts
[JENKINS] Archiving <https://builds.apache.org/job/karaf-2.x/ws/management/pom.xml>
to org.apache.karaf.management/management/2.4.0-SNAPSHOT/management-2.4.0-SNAPSHOT.pom
No artifacts from karaf-2.x ? Apache Karaf :: Management #251 to compare, so performing full
copy of artifacts
[JENKINS] Archiving <https://builds.apache.org/job/karaf-2.x/ws/shell/wrapper/pom.xml>
to org.apache.karaf.shell/org.apache.karaf.shell.wrapper/2.4.0-SNAPSHOT/org.apache.karaf.shell.wrapper-2.4.0-SNAPSHOT.pom
[JENKINS] Archiving <https://builds.apache.org/job/karaf-2.x/ws/shell/wrapper/target/org.apache.karaf.shell.wrapper-2.4.0-SNAPSHOT.jar>
to org.apache.karaf.shell/org.apache.karaf.shell.wrapper/2.4.0-20140806.020116-210/org.apache.karaf.shell.wrapper-2.4.0-20140806.020116-210.jar
No artifacts from karaf-2.x ? Apache Karaf :: Shell :: Service Wrapper #251 to compare, so
performing full copy of artifacts
[JENKINS] Archiving <https://builds.apache.org/job/karaf-2.x/ws/jndi/pom.xml> to org.apache.karaf.jndi/jndi/2.4.0-SNAPSHOT/jndi-2.4.0-SNAPSHOT.pom
No artifacts from karaf-2.x ? Apache Karaf :: JNDI #251 to compare, so performing full copy
of artifacts
[JENKINS] Archiving <https://builds.apache.org/job/karaf-2.x/ws/tooling/features-maven-plugin/pom.xml>
to org.apache.karaf.tooling/features-maven-plugin/2.4.0-SNAPSHOT/features-maven-plugin-2.4.0-SNAPSHOT.pom
[JENKINS] Archiving <https://builds.apache.org/job/karaf-2.x/ws/tooling/features-maven-plugin/target/features-maven-plugin-2.4.0-SNAPSHOT.jar>
to org.apache.karaf.tooling/features-maven-plugin/2.4.0-20140806.020819-208/features-maven-plugin-2.4.0-20140806.020819-208.jar
No artifacts from karaf-2.x ? Apache Karaf :: Tooling :: Maven2 Features plugin #251 to compare,
so performing full copy of artifacts
[JENKINS] Archiving <https://builds.apache.org/job/karaf-2.x/ws/shell/web/pom.xml> to
org.apache.karaf.shell/org.apache.karaf.shell.web/2.4.0-SNAPSHOT/org.apache.karaf.shell.web-2.4.0-SNAPSHOT.pom
[JENKINS] Archiving <https://builds.apache.org/job/karaf-2.x/ws/shell/web/target/org.apache.karaf.shell.web-2.4.0-SNAPSHOT.jar>
to org.apache.karaf.shell/org.apache.karaf.shell.web/2.4.0-20140806.020149-210/org.apache.karaf.shell.web-2.4.0-20140806.020149-210.jar
No artifacts from karaf-2.x ? Apache Karaf :: Shell :: Web Commands #251 to compare, so performing
full copy of artifacts
[JENKINS] Archiving <https://builds.apache.org/job/karaf-2.x/ws/archetypes/blueprint/pom.xml>
to org.apache.karaf.archetypes/karaf-blueprint-archetype/2.4.0-SNAPSHOT/karaf-blueprint-archetype-2.4.0-SNAPSHOT.pom
[JENKINS] Archiving <https://builds.apache.org/job/karaf-2.x/ws/archetypes/blueprint/target/karaf-blueprint-archetype-2.4.0-SNAPSHOT.jar>
to org.apache.karaf.archetypes/karaf-blueprint-archetype/2.4.0-20140806.021232-202/karaf-blueprint-archetype-2.4.0-20140806.021232-202.jar
No artifacts from karaf-2.x ? Apache Karaf :: Archetypes :: Blueprint Archetype #251 to compare,
so performing full copy of artifacts
[JENKINS] Archiving <https://builds.apache.org/job/karaf-2.x/ws/admin/pom.xml> to org.apache.karaf.admin/admin/2.4.0-SNAPSHOT/admin-2.4.0-SNAPSHOT.pom
No artifacts from karaf-2.x ? Apache Karaf :: Admin #251 to compare, so performing full copy
of artifacts
[JENKINS] Archiving <https://builds.apache.org/job/karaf-2.x/ws/deployer/spring/pom.xml>
to org.apache.karaf.deployer/org.apache.karaf.deployer.spring/2.4.0-SNAPSHOT/org.apache.karaf.deployer.spring-2.4.0-SNAPSHOT.pom
[JENKINS] Archiving <https://builds.apache.org/job/karaf-2.x/ws/deployer/spring/target/org.apache.karaf.deployer.spring-2.4.0-SNAPSHOT.jar>
to org.apache.karaf.deployer/org.apache.karaf.deployer.spring/2.4.0-20140806.015913-214/org.apache.karaf.deployer.spring-2.4.0-20140806.015913-214.jar
No artifacts from karaf-2.x ? Apache Karaf :: Deployer :: Spring #251 to compare, so performing
full copy of artifacts
[JENKINS] Archiving <https://builds.apache.org/job/karaf-2.x/ws/jdbc/command/pom.xml>
to org.apache.karaf.jdbc/org.apache.karaf.jdbc.command/2.4.0-SNAPSHOT/org.apache.karaf.jdbc.command-2.4.0-SNAPSHOT.pom
[JENKINS] Archiving <https://builds.apache.org/job/karaf-2.x/ws/jdbc/command/target/org.apache.karaf.jdbc.command-2.4.0-SNAPSHOT.jar>
to org.apache.karaf.jdbc/org.apache.karaf.jdbc.command/2.4.0-20140806.020519-209/org.apache.karaf.jdbc.command-2.4.0-20140806.020519-209.jar
No artifacts from karaf-2.x ? Apache Karaf :: JDBC :: Command #251 to compare, so performing
full copy of artifacts
[JENKINS] Archiving <https://builds.apache.org/job/karaf-2.x/ws/assemblies/features/standard/pom.xml>
to org.apache.karaf.assemblies.features/standard/2.4.0-SNAPSHOT/standard-2.4.0-SNAPSHOT.pom
[JENKINS] Archiving <https://builds.apache.org/job/karaf-2.x/ws/assemblies/features/standard/target/standard-2.4.0-SNAPSHOT.jar>
to org.apache.karaf.assemblies.features/standard/2.4.0-20140806.020655-206/standard-2.4.0-20140806.020655-206.jar
[JENKINS] Archiving <https://builds.apache.org/job/karaf-2.x/ws/assemblies/features/standard/target/classes/features.xml>
to org.apache.karaf.assemblies.features/standard/2.4.0-20140806.020655-206/standard-2.4.0-20140806.020655-206-features.xml
No artifacts from karaf-2.x ? Apache Karaf :: Assemblies :: Features :: Standard #251 to compare,
so performing full copy of artifacts
[JENKINS] Archiving <https://builds.apache.org/job/karaf-2.x/ws/jaas/jasypt/pom.xml>
to org.apache.karaf.jaas/org.apache.karaf.jaas.jasypt/2.4.0-SNAPSHOT/org.apache.karaf.jaas.jasypt-2.4.0-SNAPSHOT.pom
[JENKINS] Archiving <https://builds.apache.org/job/karaf-2.x/ws/jaas/jasypt/target/org.apache.karaf.jaas.jasypt-2.4.0-SNAPSHOT.jar>
to org.apache.karaf.jaas/org.apache.karaf.jaas.jasypt/2.4.0-20140806.020238-210/org.apache.karaf.jaas.jasypt-2.4.0-20140806.020238-210.jar
No artifacts from karaf-2.x ? Apache Karaf :: JAAS :: Jasypt Encryption #251 to compare, so
performing full copy of artifacts
[JENKINS] Archiving <https://builds.apache.org/job/karaf-2.x/ws/diagnostic/core/pom.xml>
to org.apache.karaf.diagnostic/org.apache.karaf.diagnostic.core/2.4.0-SNAPSHOT/org.apache.karaf.diagnostic.core-2.4.0-SNAPSHOT.pom
[JENKINS] Archiving <https://builds.apache.org/job/karaf-2.x/ws/diagnostic/core/target/org.apache.karaf.diagnostic.core-2.4.0-SNAPSHOT.jar>
to org.apache.karaf.diagnostic/org.apache.karaf.diagnostic.core/2.4.0-20140806.020722-206/org.apache.karaf.diagnostic.core-2.4.0-20140806.020722-206.jar
No artifacts from karaf-2.x ? Apache Karaf :: Diagnostic :: Core #251 to compare, so performing
full copy of artifacts
[JENKINS] Archiving <https://builds.apache.org/job/karaf-2.x/ws/deployer/pom.xml> to
org.apache.karaf.deployer/deployer/2.4.0-SNAPSHOT/deployer-2.4.0-SNAPSHOT.pom
No artifacts from karaf-2.x ? Apache Karaf :: Deployer #251 to compare, so performing full
copy of artifacts
[JENKINS] Archiving <https://builds.apache.org/job/karaf-2.x/ws/shell/obr/pom.xml> to
org.apache.karaf.shell/org.apache.karaf.shell.obr/2.4.0-SNAPSHOT/org.apache.karaf.shell.obr-2.4.0-SNAPSHOT.pom
[JENKINS] Archiving <https://builds.apache.org/job/karaf-2.x/ws/shell/obr/target/org.apache.karaf.shell.obr-2.4.0-SNAPSHOT.jar>
to org.apache.karaf.shell/org.apache.karaf.shell.obr/2.4.0-20140806.015640-216/org.apache.karaf.shell.obr-2.4.0-20140806.015640-216.jar
No artifacts from karaf-2.x ? Apache Karaf :: Shell :: OBR Commands #251 to compare, so performing
full copy of artifacts
[JENKINS] Archiving <https://builds.apache.org/job/karaf-2.x/ws/shell/ssh/pom.xml> to
org.apache.karaf.shell/org.apache.karaf.shell.ssh/2.4.0-SNAPSHOT/org.apache.karaf.shell.ssh-2.4.0-SNAPSHOT.pom
[JENKINS] Archiving <https://builds.apache.org/job/karaf-2.x/ws/shell/ssh/target/org.apache.karaf.shell.ssh-2.4.0-SNAPSHOT.jar>
to org.apache.karaf.shell/org.apache.karaf.shell.ssh/2.4.0-20140806.020104-210/org.apache.karaf.shell.ssh-2.4.0-20140806.020104-210.jar
No artifacts from karaf-2.x ? Apache Karaf :: Shell :: SSH #251 to compare, so performing
full copy of artifacts
[JENKINS] Archiving <https://builds.apache.org/job/karaf-2.x/ws/webconsole/admin/pom.xml>
to org.apache.karaf.webconsole/org.apache.karaf.webconsole.admin/2.4.0-SNAPSHOT/org.apache.karaf.webconsole.admin-2.4.0-SNAPSHOT.pom
[JENKINS] Archiving <https://builds.apache.org/job/karaf-2.x/ws/webconsole/admin/target/org.apache.karaf.webconsole.admin-2.4.0-SNAPSHOT.jar>
to org.apache.karaf.webconsole/org.apache.karaf.webconsole.admin/2.4.0-20140806.020631-206/org.apache.karaf.webconsole.admin-2.4.0-20140806.020631-206.jar
No artifacts from karaf-2.x ? Apache Karaf :: Web Console :: Admin Plugin #251 to compare,
so performing full copy of artifacts
[JENKINS] Archiving <https://builds.apache.org/job/karaf-2.x/ws/shell/osgi/pom.xml>
to org.apache.karaf.shell/org.apache.karaf.shell.osgi/2.4.0-SNAPSHOT/org.apache.karaf.shell.osgi-2.4.0-SNAPSHOT.pom
[JENKINS] Archiving <https://builds.apache.org/job/karaf-2.x/ws/shell/osgi/target/org.apache.karaf.shell.osgi-2.4.0-SNAPSHOT.jar>
to org.apache.karaf.shell/org.apache.karaf.shell.osgi/2.4.0-20140806.020044-210/org.apache.karaf.shell.osgi-2.4.0-20140806.020044-210.jar
No artifacts from karaf-2.x ? Apache Karaf :: Shell :: OSGi Commands #251 to compare, so performing
full copy of artifacts
[JENKINS] Archiving <https://builds.apache.org/job/karaf-2.x/ws/deployer/features/pom.xml>
to org.apache.karaf.deployer/org.apache.karaf.deployer.features/2.4.0-SNAPSHOT/org.apache.karaf.deployer.features-2.4.0-SNAPSHOT.pom
[JENKINS] Archiving <https://builds.apache.org/job/karaf-2.x/ws/deployer/features/target/org.apache.karaf.deployer.features-2.4.0-SNAPSHOT.jar>
to org.apache.karaf.deployer/org.apache.karaf.deployer.features/2.4.0-20140806.015934-214/org.apache.karaf.deployer.features-2.4.0-20140806.015934-214.jar
No artifacts from karaf-2.x ? Apache Karaf :: Deployer :: Features #251 to compare, so performing
full copy of artifacts
[JENKINS] Archiving <https://builds.apache.org/job/karaf-2.x/ws/client/dependency-reduced-pom.xml>
to org.apache.karaf/org.apache.karaf.client/2.4.0-SNAPSHOT/org.apache.karaf.client-2.4.0-SNAPSHOT.pom
[JENKINS] Archiving <https://builds.apache.org/job/karaf-2.x/ws/client/target/org.apache.karaf.client-2.4.0-SNAPSHOT.jar>
to org.apache.karaf/org.apache.karaf.client/2.4.0-20140806.020258-210/org.apache.karaf.client-2.4.0-20140806.020258-210.jar
No artifacts from karaf-2.x ? Apache Karaf :: Client #251 to compare, so performing full copy
of artifacts
[JENKINS] Archiving <https://builds.apache.org/job/karaf-2.x/ws/assemblies/apache-karaf/pom.xml>
to org.apache.karaf/apache-karaf/2.4.0-SNAPSHOT/apache-karaf-2.4.0-SNAPSHOT.pom
[JENKINS] Archiving <https://builds.apache.org/job/karaf-2.x/ws/assemblies/apache-karaf/src/main/resources/extra/jetty.xml>
to org.apache.karaf/apache-karaf/2.4.0-20140806.020913-206/apache-karaf-2.4.0-20140806.020913-206-jettyconfig.xml
[JENKINS] Archiving <https://builds.apache.org/job/karaf-2.x/ws/assemblies/apache-karaf/target/apache-karaf-2.4.0-SNAPSHOT-minimal.tar.gz>
to org.apache.karaf/apache-karaf/2.4.0-20140806.020913-206/apache-karaf-2.4.0-20140806.020913-206-minimal.tar.gz
[JENKINS] Archiving <https://builds.apache.org/job/karaf-2.x/ws/assemblies/apache-karaf/target/apache-karaf-2.4.0-SNAPSHOT.tar.gz>
to org.apache.karaf/apache-karaf/2.4.0-20140806.020913-206/apache-karaf-2.4.0-20140806.020913-206.tar.gz
[JENKINS] Archiving <https://builds.apache.org/job/karaf-2.x/ws/assemblies/apache-karaf/target/apache-karaf-2.4.0-SNAPSHOT-minimal.zip>
to org.apache.karaf/apache-karaf/2.4.0-20140806.020913-206/apache-karaf-2.4.0-20140806.020913-206-minimal.zip
[JENKINS] Archiving <https://builds.apache.org/job/karaf-2.x/ws/assemblies/apache-karaf/target/apache-karaf-2.4.0-SNAPSHOT.zip>
to org.apache.karaf/apache-karaf/2.4.0-20140806.020913-206/apache-karaf-2.4.0-20140806.020913-206.zip
No artifacts from karaf-2.x ? Apache Karaf :: Assembly #251 to compare, so performing full
copy of artifacts
Build timed out (after 70 minutes). Marking the build as aborted.
Sending e-mails to: commits@karaf.apache.org
Sending e-mails to: commits@karaf.apache.org
channel stopped
ERROR: Failed to parse POMs
java.io.IOException: java.io.IOException: Failed to extract <https://builds.apache.org/job/karaf-2.x/ws/assemblies/apache-karaf/transfer>
of 6 files
	at hudson.FilePath.readFromTar(FilePath.java:2089)
	at hudson.FilePath.copyRecursiveTo(FilePath.java:2001)
	at jenkins.model.StandardArtifactManager.archive(StandardArtifactManager.java:57)
	at com.cloudbees.jenkins.plugins.jsync.archiver.JSyncArtifactManager.remoteSync(JSyncArtifactManager.java:103)
	at com.cloudbees.jenkins.plugins.jsync.archiver.JSyncArtifactManager.archive(JSyncArtifactManager.java:67)
	at hudson.maven.MavenBuild$ProxyImpl.performArchiving(MavenBuild.java:474)
	at hudson.maven.MavenModuleSetBuild$MavenModuleSetBuildExecution.doRun(MavenModuleSetBuild.java:845)
	at hudson.model.AbstractBuild$AbstractBuildExecution.run(AbstractBuild.java:585)
	at hudson.model.Run.execute(Run.java:1676)
	at hudson.maven.MavenModuleSetBuild.run(MavenModuleSetBuild.java:529)
	at hudson.model.ResourceController.execute(ResourceController.java:88)
	at hudson.model.Executor.run(Executor.java:231)
Caused by: java.io.IOException
	at hudson.remoting.FastPipedInputStream.read(FastPipedInputStream.java:177)
	at hudson.util.HeadBufferingStream.read(HeadBufferingStream.java:61)
	at com.jcraft.jzlib.InflaterInputStream.fill(InflaterInputStream.java:175)
	at com.jcraft.jzlib.InflaterInputStream.read(InflaterInputStream.java:106)
	at org.apache.tools.tar.TarBuffer.readBlock(TarBuffer.java:257)
	at org.apache.tools.tar.TarBuffer.readRecord(TarBuffer.java:223)
	at hudson.org.apache.tools.tar.TarInputStream.read(TarInputStream.java:345)
	at java.io.FilterInputStream.read(FilterInputStream.java:107)
	at org.apache.commons.io.IOUtils.copyLarge(IOUtils.java:1792)
	at org.apache.commons.io.IOUtils.copyLarge(IOUtils.java:1769)
	at org.apache.commons.io.IOUtils.copy(IOUtils.java:1744)
	at hudson.util.IOUtils.copy(IOUtils.java:40)
	at hudson.FilePath.readFromTar(FilePath.java:2079)
	... 11 more

	at hudson.FilePath.copyRecursiveTo(FilePath.java:2008)
	at jenkins.model.StandardArtifactManager.archive(StandardArtifactManager.java:57)
	at com.cloudbees.jenkins.plugins.jsync.archiver.JSyncArtifactManager.remoteSync(JSyncArtifactManager.java:103)
	at com.cloudbees.jenkins.plugins.jsync.archiver.JSyncArtifactManager.archive(JSyncArtifactManager.java:67)
	at hudson.maven.MavenBuild$ProxyImpl.performArchiving(MavenBuild.java:474)
	at hudson.maven.MavenModuleSetBuild$MavenModuleSetBuildExecution.doRun(MavenModuleSetBuild.java:845)
	at hudson.model.AbstractBuild$AbstractBuildExecution.run(AbstractBuild.java:585)
	at hudson.model.Run.execute(Run.java:1676)
	at hudson.maven.MavenModuleSetBuild.run(MavenModuleSetBuild.java:529)
	at hudson.model.ResourceController.execute(ResourceController.java:88)
	at hudson.model.Executor.run(Executor.java:231)
Caused by: java.util.concurrent.ExecutionException: java.io.IOException: Pipe is already closed
	at hudson.remoting.Channel$3.adapt(Channel.java:755)
	at hudson.remoting.Channel$3.adapt(Channel.java:750)
	at hudson.remoting.FutureAdapter.get(FutureAdapter.java:59)
	at hudson.FilePath.copyRecursiveTo(FilePath.java:2004)
	... 10 more
Caused by: java.io.IOException: Pipe is already closed
	at hudson.remoting.PipeWindow.checkDeath(PipeWindow.java:108)
	at hudson.remoting.PipeWindow$Real.get(PipeWindow.java:203)
	at hudson.remoting.ProxyOutputStream._write(ProxyOutputStream.java:141)
	at hudson.remoting.ProxyOutputStream.write(ProxyOutputStream.java:109)
	at java.io.BufferedOutputStream.flushBuffer(BufferedOutputStream.java:82)
	at java.io.BufferedOutputStream.write(BufferedOutputStream.java:126)
	at com.jcraft.jzlib.DeflaterOutputStream.deflate(DeflaterOutputStream.java:144)
	at com.jcraft.jzlib.DeflaterOutputStream.write(DeflaterOutputStream.java:102)
	at java.io.BufferedOutputStream.write(BufferedOutputStream.java:122)
	at org.apache.tools.tar.TarBuffer.writeBlock(TarBuffer.java:410)
	at org.apache.tools.tar.TarBuffer.writeRecord(TarBuffer.java:351)
	at hudson.org.apache.tools.tar.TarOutputStream.writeEOFRecord(TarOutputStream.java:356)
	at hudson.org.apache.tools.tar.TarOutputStream.finish(TarOutputStream.java:137)
	at hudson.org.apache.tools.tar.TarOutputStream.close(TarOutputStream.java:149)
	at hudson.util.io.TarArchiver.close(TarArchiver.java:125)
	at hudson.FilePath.writeToTar(FilePath.java:2055)
	at hudson.FilePath.access$1000(FilePath.java:172)
	at hudson.FilePath$41.invoke(FilePath.java:1994)
	at hudson.FilePath$41.invoke(FilePath.java:1990)
	at hudson.FilePath$FileCallableWrapper.call(FilePath.java:2462)
	at hudson.remoting.UserRequest.perform(UserRequest.java:118)
	at hudson.remoting.UserRequest.perform(UserRequest.java:48)
	at hudson.remoting.Request$2.run(Request.java:328)
	at hudson.remoting.InterceptingExecutorService$1.call(InterceptingExecutorService.java:72)
	at java.util.concurrent.FutureTask.run(FutureTask.java:262)
	at java.util.concurrent.ThreadPoolExecutor.runWorker(ThreadPoolExecutor.java:1145)
	at java.util.concurrent.ThreadPoolExecutor$Worker.run(ThreadPoolExecutor.java:615)
	at java.lang.Thread.run(Thread.java:745)
Caused by: java.io.IOException: Pipe is already closed
	at hudson.remoting.FastPipedOutputStream.write(FastPipedOutputStream.java:153)
	at hudson.remoting.FastPipedOutputStream.write(FastPipedOutputStream.java:137)
	at hudson.remoting.ProxyOutputStream$Chunk$1.run(ProxyOutputStream.java:264)
	at hudson.remoting.PipeWriter$1.run(PipeWriter.java:158)
	at java.util.concurrent.Executors$RunnableAdapter.call(Executors.java:471)
	at java.util.concurrent.FutureTask.run(FutureTask.java:262)
	at hudson.remoting.SingleLaneExecutorService$1.run(SingleLaneExecutorService.java:111)
	... 5 more
Caused by: hudson.remoting.FastPipedInputStream$ClosedBy: The pipe was closed at...
	at hudson.remoting.FastPipedInputStream.close(FastPipedInputStream.java:112)
	at java.io.FilterInputStream.close(FilterInputStream.java:181)
	at com.jcraft.jzlib.InflaterInputStream.close(InflaterInputStream.java:168)
	at org.apache.tools.tar.TarBuffer.close(TarBuffer.java:456)
	at hudson.org.apache.tools.tar.TarInputStream.close(TarInputStream.java:110)
	at hudson.FilePath.readFromTar(FilePath.java:2096)
	at hudson.FilePath.copyRecursiveTo(FilePath.java:2001)
	at jenkins.model.StandardArtifactManager.archive(StandardArtifactManager.java:57)
	at com.cloudbees.jenkins.plugins.jsync.archiver.JSyncArtifactManager.remoteSync(JSyncArtifactManager.java:103)
	at com.cloudbees.jenkins.plugins.jsync.archiver.JSyncArtifactManager.archive(JSyncArtifactManager.java:67)
	at hudson.maven.MavenBuild$ProxyImpl.performArchiving(MavenBuild.java:474)
	at hudson.maven.MavenModuleSetBuild$MavenModuleSetBuildExecution.doRun(MavenModuleSetBuild.java:845)
	at hudson.model.AbstractBuild$AbstractBuildExecution.run(AbstractBuild.java:585)
	at hudson.model.Run.execute(Run.java:1676)
	at hudson.maven.MavenModuleSetBuild.run(MavenModuleSetBuild.java:529)
	at hudson.model.ResourceController.execute(ResourceController.java:88)
	at hudson.model.Executor.run(Executor.java:231)

Mime
View raw message