karaf-commits mailing list archives

Site index · List index
Message view « Date » · « Thread »
Top « Date » · « Thread »
From Apache Jenkins Server <jenk...@builds.apache.org>
Subject Build failed in Jenkins: karaf-2.x » Apache Karaf :: Integration Tests #112
Date Mon, 16 Jun 2014 21:59:52 GMT
See <https://builds.apache.org/job/karaf-2.x/org.apache.karaf.itests$itests/112/>

------------------------------------------
[...truncated 14307 lines...]
[org.ops4j.store.intern.TemporaryStore] : Storage Area is /tmp/1402953932249-0
[org.ops4j.pax.url.mvn.internal.Connection] : Resolving [mvn:org.apache.karaf/apache-karaf/2.4.0-SNAPSHOT/tar.gz]
[org.ops4j.pax.url.mvn.internal.Connection] : Collecting versions from repository [file:/home/jenkins/jenkins-slave/maven-repositories/1/,releases=true,snapshots=true]
[org.ops4j.pax.url.mvn.internal.Connection] :   Resolving snapshot version [2.4.0-SNAPSHOT]
[org.ops4j.pax.url.mvn.internal.Connection] :   Resolving metadata
[org.ops4j.pax.exam.karaf.container.internal.KarafTestContainer] : Test Container started
in 0 millis
[org.ops4j.pax.exam.karaf.container.internal.KarafTestContainer] : Wait for test container
to finish its initialization [ RelativeTimeout value = 180000 ]
[org.ops4j.pax.exam.rbc.client.RemoteBundleContextClient] : Waiting for remote bundle context..
on 21448 name: be3d77b7-84e7-4b64-a582-4053a37cd232 timout: [ RelativeTimeout value = 180000
]
        __ __                  ____      
       / //_/____ __________ _/ __/      
      / ,<  / __ `/ ___/ __ `/ /_        
     / /| |/ /_/ / /  / /_/ / __/        
    /_/ |_|\__,_/_/   \__,_/_/         

  Apache Karaf (2.4.0-SNAPSHOT)

Hit '<tab>' for a list of available commands
and '[cmd] --help' for help on a specific command.
Hit '<ctrl-d>' or type 'osgi:shutdown' or 'logout' to shutdown Karaf.

karaf@root> SLF4J: Failed to load class "org.slf4j.impl.StaticLoggerBinder".
SLF4J: Defaulting to no-operation (NOP) logger implementation
SLF4J: See http://www.slf4j.org/codes.html#StaticLoggerBinder for further details.
[org.ops4j.pax.exam.rbc.client.RemoteBundleContextClient] : Remote bundle context found after
3458 millis
[org.ops4j.pax.exam.spi.reactors.EagerSingleStagedReactor] : installing probe org.ops4j.pax.exam.spi.intern.TestProbeBuilderImpl@a10f4a
[org.ops4j.pax.tinybundles.core.intern.RawBuilder] : make()
[org.ops4j.store.intern.TemporaryStore] : Enter store()
[org.ops4j.pax.tinybundles.core.intern.RawBuilder] : Creating manifest from added headers.
[org.ops4j.pax.tinybundles.core.intern.RawBuilder] : PaxExam-c2e25526-b862-4aa1-9a1d-744986a7ef46
= org.apache.karaf.itests.FeaturesTest;repoAddRemoveCommand
[org.ops4j.pax.tinybundles.core.intern.RawBuilder] : PaxExam-8ecae2e5-6843-4f14-b1e3-5d19952e9542
= org.apache.karaf.itests.ServicesTest;listViaMBean
[org.ops4j.pax.tinybundles.core.intern.RawBuilder] : PaxExam-66a4f7e9-6bf8-42b9-ad97-909910013230
= org.apache.karaf.itests.JMXSecurityTest;testJMXSecurityAsViewer
[org.ops4j.pax.tinybundles.core.intern.RawBuilder] : PaxExam-05fdfedc-2ab8-4070-bf78-f013529486fd
= org.apache.karaf.itests.FeaturesTest;listCommand
[org.ops4j.pax.tinybundles.core.intern.RawBuilder] : PaxExam-fe6d2538-e2e9-47c8-abec-4d81d5ca3f59
= org.apache.karaf.itests.LogTest;setDebugAndDisplay
[org.ops4j.pax.tinybundles.core.intern.RawBuilder] : PaxExam-a7f9fb6e-6963-49c4-a6fd-ea8bdbb8fb25
= org.apache.karaf.itests.ObrTest;listCommands
[org.ops4j.pax.tinybundles.core.intern.RawBuilder] : PaxExam-e686c40c-d9d5-4917-a6d9-a0f1365af630
= org.apache.karaf.itests.FeaturesTest;repoAddRemoveViaMBean
[org.ops4j.pax.tinybundles.core.intern.RawBuilder] : PaxExam-5e067931-ba5e-4754-a383-0e0399515091
= org.apache.karaf.itests.StandardFeaturesTest;testSpringOxmFeature
[org.ops4j.pax.tinybundles.core.intern.RawBuilder] : PaxExam-f39c01d3-3588-4da1-9018-89b64fed0fd6
= org.apache.karaf.itests.OsgiTest;nameViaMBean
[org.ops4j.pax.tinybundles.core.intern.RawBuilder] : Ignore-Package = 
[org.ops4j.pax.tinybundles.core.intern.RawBuilder] : PaxExam-34ada591-7a23-4864-98a8-e4c1d7ddbd04
= org.apache.karaf.itests.ObrTest;listsViaMBean
[org.ops4j.pax.tinybundles.core.intern.RawBuilder] : PaxExam-891c7aa7-931b-4896-a56c-304db6b61a75
= org.apache.karaf.itests.LogTest;setDebugViaMBean
[org.ops4j.pax.tinybundles.core.intern.RawBuilder] : PaxExam-d68a25c2-9520-4f4a-99d9-51f722684247
= org.apache.karaf.itests.JaasTest;testLoginSingleReg
[org.ops4j.pax.tinybundles.core.intern.RawBuilder] : PaxExam-44601055-4fdd-4977-918b-ed1fee4cbe0b
= org.apache.karaf.itests.OsgiSshCommandSecurityTest;testOsgiCommandSecurityViaSsh
[org.ops4j.pax.tinybundles.core.intern.RawBuilder] : PaxExam-88f587f1-6bc1-4ca1-9c10-78e7318b2235
= org.apache.karaf.itests.AdminTest;cloneCommand
[org.ops4j.pax.tinybundles.core.intern.RawBuilder] : PaxExam-01e49a81-c2e6-4504-b997-c9e77a347779
= org.apache.karaf.itests.EnterpriseFeaturesTest;testJpaFeature
[org.ops4j.pax.tinybundles.core.intern.RawBuilder] : PaxExam-3a60331d-2317-4d66-ac48-5bb849823edb
= org.apache.karaf.itests.OsgiTest;listViaMBean
[org.ops4j.pax.tinybundles.core.intern.RawBuilder] : PaxExam-c2e398da-2e55-4ada-8385-1a5bf39224d3
= org.apache.karaf.itests.FeaturesTest;listViaMBean
[org.ops4j.pax.tinybundles.core.intern.RawBuilder] : PaxExam-4d81a948-3984-4c6a-9b11-3adf4c682736
= org.apache.karaf.itests.StandardFeaturesTest;testHttpFeature
[org.ops4j.pax.tinybundles.core.intern.RawBuilder] : PaxExam-713902d6-d491-4e82-890d-7bb8caf733b1
= org.apache.karaf.itests.JaasSshCommandSecurityTest;testJaasCommandSecurityViaSsh
[org.ops4j.pax.tinybundles.core.intern.RawBuilder] : PaxExam-16fabfee-823f-4980-850a-9cebfd31f74c
= org.apache.karaf.itests.JMXSecurityTest;testJMXSecurityAsManager
[org.ops4j.pax.tinybundles.core.intern.RawBuilder] : PaxExam-babd2b83-c1ee-4606-849a-7227ccc86171
= org.apache.karaf.itests.OsgiTest;classesCommand
[org.ops4j.pax.tinybundles.core.intern.RawBuilder] : PaxExam-7a5fa355-6236-465d-9a62-b26681a9a8db
= org.apache.karaf.itests.EnterpriseFeaturesTest;testHibernateFeature
[org.ops4j.pax.tinybundles.core.intern.RawBuilder] : PaxExam-59528f12-f544-41d5-9822-d7395b9958a3
= org.apache.karaf.itests.AdminTest;createDestroyViaMBean
[org.ops4j.pax.tinybundles.core.intern.RawBuilder] : PaxExam-ec2d6c27-1334-4748-a82d-08942c6976d6
= org.apache.karaf.itests.ShellCommandSecurityTest;testShellCommandSecurityViaSsh
[org.ops4j.pax.tinybundles.core.intern.RawBuilder] : PaxExam-037cdb58-2ad3-44ac-8465-c4dba73db61e
= org.apache.karaf.itests.StandardFeaturesTest;testSpringDmFeature
[org.ops4j.pax.tinybundles.core.intern.RawBuilder] : PaxExam-265a9cd2-da32-4737-9ec6-7de0de9ea06a
= org.apache.karaf.itests.StandardFeaturesTest;testSpringJmsFeature
[org.ops4j.pax.tinybundles.core.intern.RawBuilder] : PaxExam-1c3f0f4c-49bf-4e09-9e50-0b1c60543538
= org.apache.karaf.itests.JaasTest;realmListCommand
[org.ops4j.pax.tinybundles.core.intern.RawBuilder] : PaxExam-dc40d64d-5a22-43b0-94f4-ebfb8e74cb7e
= org.apache.karaf.itests.PackagesTest;importsCommand
[org.ops4j.pax.tinybundles.core.intern.RawBuilder] : DynamicImport-Package = *,org.apache.felix.service.*;status=provisional
[org.ops4j.pax.tinybundles.core.intern.RawBuilder] : PaxExam-5a6e3908-8e0b-4ecf-9a03-6a972d0d843f
= org.apache.karaf.itests.FeaturesTest;installUninstallCommand
[org.ops4j.pax.tinybundles.core.intern.RawBuilder] : PaxExam-26563e70-45ee-486a-9a0f-b7ef990b23e9
= org.apache.karaf.itests.StandardFeaturesTest;testSpringWebFeature
[org.ops4j.pax.tinybundles.core.intern.RawBuilder] : PaxExam-9ab0d6f9-e7d0-4f88-8e2a-d97c7e8c9ba1
= org.apache.karaf.itests.OsgiTest;shutdownCommand
[org.ops4j.pax.tinybundles.core.intern.RawBuilder] : PaxExam-06308028-8f21-4306-bb68-ff0ca5a20423
= org.apache.karaf.itests.JMXSecurityTest;testJMXSecurityAsAdmin
[org.ops4j.pax.tinybundles.core.intern.RawBuilder] : PaxExam-0c049e54-c416-4905-90d2-46237121f3d5
= org.apache.karaf.itests.EnterpriseFeaturesTest;testJndiFeature
[org.ops4j.pax.tinybundles.core.intern.RawBuilder] : PaxExam-bbb9e5b4-87c0-4e71-8e22-2377a3e1e0d2
= org.apache.karaf.itests.StandardFeaturesTest;testJettyFeature
[org.ops4j.pax.tinybundles.core.intern.RawBuilder] : PaxExam-90364cc8-4e82-4f5e-bdc9-39ff99a2045c
= org.apache.karaf.itests.StandardFeaturesTest;testWebconsoleFeature
[org.ops4j.pax.tinybundles.core.intern.RawBuilder] : PaxExam-9f9f335d-b972-429b-8b09-bdc730b3c684
= org.apache.karaf.itests.StandardFeaturesTest;testSpringAspectsFeature
[org.ops4j.pax.tinybundles.core.intern.RawBuilder] : PaxExam-bbc47509-11fc-481b-a2dd-3fe7904c76e6
= org.apache.karaf.itests.PackagesTest;exportsViaMBean
[org.ops4j.pax.tinybundles.core.intern.RawBuilder] : PaxExam-db080f6a-a77b-4100-9a7f-535513d34211
= org.apache.karaf.itests.StandardFeaturesTest;testSpringJdbcFeature
[org.ops4j.pax.tinybundles.core.intern.RawBuilder] : PaxExam-98e06f1e-5c1c-444b-82b1-2d7fe64588f0
= org.apache.karaf.itests.StandardFeaturesTest;testWrapperFeature
[org.ops4j.pax.tinybundles.core.intern.RawBuilder] : PaxExam-f4caae73-cc75-43c1-95b7-a7608e4e38e6
= org.apache.karaf.itests.StandardFeaturesTest;testHttpWhiteboardFeature
[org.ops4j.pax.tinybundles.core.intern.RawBuilder] : PaxExam-a84f1aa3-d45d-4975-8b4c-f4cef5c86571
= org.apache.karaf.itests.WrapperTest;installCommand
[org.ops4j.pax.tinybundles.core.intern.RawBuilder] : PaxExam-ac04b600-dcf0-4155-83c9-a8f0139d4d7c
= org.apache.karaf.itests.AdminTest;createDestroyCommand
[org.ops4j.pax.tinybundles.core.intern.RawBuilder] : PaxExam-6c791f40-3910-408e-aa11-cefdbdc46b3d
= org.apache.karaf.itests.JMXSecurityTest;testJMXSecurityCannotLogInAsGroupDirectly
[org.ops4j.pax.tinybundles.core.intern.RawBuilder] : PaxExam-8d7a02b3-977b-4523-b4bf-3f58750d2416
= org.apache.karaf.itests.StandardFeaturesTest;testSpringDmWebFeature
[org.ops4j.pax.tinybundles.core.intern.RawBuilder] : PaxExam-Executable = PaxExam-a84f1aa3-d45d-4975-8b4c-f4cef5c86571,PaxExam-20392b09-c415-410a-8474-c14359a2d2bf,PaxExam-037cdb58-2ad3-44ac-8465-c4dba73db61e,PaxExam-265a9cd2-da32-4737-9ec6-7de0de9ea06a,PaxExam-6485e2ac-db65-4255-96be-6eaad55f86a5,PaxExam-e9e5a254-3de1-4e3a-9ea2-6fb2d1e8ffa9,PaxExam-426f9b97-4a43-4baf-ac60-d98b2ee768cc,PaxExam-840178f4-0576-4104-a7ba-889f850bd021,PaxExam-98e06f1e-5c1c-444b-82b1-2d7fe64588f0,PaxExam-4e2a71bf-725f-492d-9c3a-7e28a17662e3,PaxExam-4d81a948-3984-4c6a-9b11-3adf4c682736,PaxExam-b78eaebb-2783-4ca1-883c-4424472e8b36,PaxExam-90364cc8-4e82-4f5e-bdc9-39ff99a2045c,PaxExam-40be4b9d-bce0-4eca-90c4-c8fc9f5b80cd,PaxExam-80011da5-97e8-435c-8b5e-a2df479512a1,PaxExam-d43a0ae7-a179-4a6e-9984-4ec10d9392db,PaxExam-db080f6a-a77b-4100-9a7f-535513d34211,PaxExam-60687608-c7cb-4640-b382-3a0b3e6f7072,PaxExam-5e067931-ba5e-4754-a383-0e0399515091,PaxExam-bbb9e5b4-87c0-4e71-8e22-2377a3e1e0d2,PaxExam-700e6d67-c334-413d-9014-8edaa3bdaf00,PaxExam-8d7a02b3-977b-4523-b4bf-3f58750d2416,PaxExam-9f9f335d-b972-429b-8b09-bdc730b3c684,PaxExam-26563e70-45ee-486a-9a0f-b7ef990b23e9,PaxExam-f4caae73-cc75-43c1-95b7-a7608e4e38e6,PaxExam-891c7aa7-931b-4896-a56c-304db6b61a75,PaxExam-fe6d2538-e2e9-47c8-abec-4d81d5ca3f59,PaxExam-f5cb8d45-c691-4116-bb0c-fa96bf5ae18b,PaxExam-7d6669db-ed28-4681-b63e-8b354d079c1b,PaxExam-ec2d6c27-1334-4748-a82d-08942c6976d6,PaxExam-a0b975d2-5079-4ebf-bf04-e4e453731185,PaxExam-7a17660c-64dd-413c-922e-b6e9a1878d19,PaxExam-f12c5fff-6911-4782-b97e-a60c1df1b782,PaxExam-7a5fa355-6236-465d-9a62-b26681a9a8db,PaxExam-0c049e54-c416-4905-90d2-46237121f3d5,PaxExam-63de5524-28bf-4a5f-be8c-75166d9e49d9,PaxExam-66213891-bb2b-44d0-ab95-4423abc6d377,PaxExam-01e49a81-c2e6-4504-b997-c9e77a347779,PaxExam-ef7ebec7-d7ba-4412-a85f-9df863f34c64,PaxExam-e85f7763-808d-4670-853a-ca6217e255a0,PaxExam-868c6981-b70d-4026-956b-d8c58ea3760d,PaxExam-5583e9f5-813c-48dc-9c1f-fb9ab41ddb44,PaxExam-9ab0d6f9-e7d0-4f88-8e2a-d97c7e8c9ba1,PaxExam-4f6a6dcf-821d-4508-956c-246cb58e6662,PaxExam-392abfab-6e1d-4d68-beeb-4d66c2df47cb,PaxExam-56e11f92-b17e-4311-95ac-13abdc1b65f5,PaxExam-b7a04f12-ed6f-4c18-9a90-320b211c7d7e,PaxExam-babd2b83-c1ee-4606-849a-7227ccc86171,PaxExam-10515eb3-f614-4396-806b-61648eb0b17e,PaxExam-f39c01d3-3588-4da1-9018-89b64fed0fd6,PaxExam-3a60331d-2317-4d66-ac48-5bb849823edb,PaxExam-66a4f7e9-6bf8-42b9-ad97-909910013230,PaxExam-06308028-8f21-4306-bb68-ff0ca5a20423,PaxExam-16fabfee-823f-4980-850a-9cebfd31f74c,PaxExam-6c791f40-3910-408e-aa11-cefdbdc46b3d,PaxExam-e4af1aec-54f5-4973-a680-e6f91ae8a1d7,PaxExam-13dd48d3-753d-482e-8306-dfedbc5b07b1,PaxExam-44601055-4fdd-4977-918b-ed1fee4cbe0b,PaxExam-e686c40c-d9d5-4917-a6d9-a0f1365af630,PaxExam-c2e25526-b862-4aa1-9a1d-744986a7ef46,PaxExam-5a6e3908-8e0b-4ecf-9a03-6a972d0d843f,PaxExam-05fdfedc-2ab8-4070-bf78-f013529486fd,PaxExam-1025255b-d107-475d-9a40-f84a43ed874b,PaxExam-c2e398da-2e55-4ada-8385-1a5bf39224d3,PaxExam-e12d1ca8-8ab8-4383-8600-d1dfeb11149d,PaxExam-32cef487-a0eb-457e-b5a3-a6cd6a189884,PaxExam-6cdd708a-38ba-4e31-a969-8be5c5476bad,PaxExam-bbc47509-11fc-481b-a2dd-3fe7904c76e6,PaxExam-39393f1d-6dbc-474e-89ae-ab91b53ce605,PaxExam-dc40d64d-5a22-43b0-94f4-ebfb8e74cb7e,PaxExam-a7f9fb6e-6963-49c4-a6fd-ea8bdbb8fb25,PaxExam-34ada591-7a23-4864-98a8-e4c1d7ddbd04,PaxExam-bafe1460-1fb2-4763-b362-dd3cdf576a7a,PaxExam-ac04b600-dcf0-4155-83c9-a8f0139d4d7c,PaxExam-e46709c8-9b6b-4bbe-a374-88ed1d4194e4,PaxExam-88f587f1-6bc1-4ca1-9c10-78e7318b2235,PaxExam-59528f12-f544-41d5-9822-d7395b9958a3,PaxExam-d68a25c2-9520-4f4a-99d9-51f722684247,PaxExam-1c3f0f4c-49bf-4e09-9e50-0b1c60543538,PaxExam-18eabdf6-ae18-4949-9056-73b078c5ee5a,PaxExam-8ecae2e5-6843-4f14-b1e3-5d19952e9542,PaxExam-713902d6-d491-4e82-890d-7bb8caf733b1,
[org.ops4j.pax.tinybundles.core.intern.RawBuilder] : PaxExam-f5cb8d45-c691-4116-bb0c-fa96bf5ae18b
= org.apache.karaf.itests.LogTest;setGetDebugAndClear
[org.ops4j.pax.tinybundles.core.intern.RawBuilder] : PaxExam-63de5524-28bf-4a5f-be8c-75166d9e49d9
= org.apache.karaf.itests.EnterpriseFeaturesTest;testApplicationWithoutIsolationFeature
[org.ops4j.pax.tinybundles.core.intern.RawBuilder] : PaxExam-5583e9f5-813c-48dc-9c1f-fb9ab41ddb44
= org.apache.karaf.itests.OsgiTest;infoCommand
[org.ops4j.pax.tinybundles.core.intern.RawBuilder] : PaxExam-e4af1aec-54f5-4973-a680-e6f91ae8a1d7
= org.apache.karaf.itests.ConfigTest;listCommand
[org.ops4j.pax.tinybundles.core.intern.RawBuilder] : PaxExam-e12d1ca8-8ab8-4383-8600-d1dfeb11149d
= org.apache.karaf.itests.ConfigSshCommandSecurityTest;testConfigCommandSecurityWithoutEditSessionViaSsh
[org.ops4j.pax.tinybundles.core.intern.RawBuilder] : PaxExam-20392b09-c415-410a-8474-c14359a2d2bf
= org.apache.karaf.itests.StandardFeaturesTest;testEventadminFeature
[org.ops4j.pax.tinybundles.core.intern.RawBuilder] : PaxExam-66213891-bb2b-44d0-ab95-4423abc6d377
= org.apache.karaf.itests.EnterpriseFeaturesTest;testTransactionFeature
[org.ops4j.pax.tinybundles.core.intern.RawBuilder] : PaxExam-e46709c8-9b6b-4bbe-a374-88ed1d4194e4
= org.apache.karaf.itests.AdminTest;cloneViaMBean
[org.ops4j.pax.tinybundles.core.intern.RawBuilder] : PaxExam-13dd48d3-753d-482e-8306-dfedbc5b07b1
= org.apache.karaf.itests.ConfigTest;listViaMBean
[org.ops4j.pax.tinybundles.core.intern.RawBuilder] : PaxExam-392abfab-6e1d-4d68-beeb-4d66c2df47cb
= org.apache.karaf.itests.OsgiTest;findClassCommand
[org.ops4j.pax.tinybundles.core.intern.RawBuilder] : PaxExam-b78eaebb-2783-4ca1-883c-4424472e8b36
= org.apache.karaf.itests.StandardFeaturesTest;testSpringOrmFeature
[org.ops4j.pax.tinybundles.core.intern.RawBuilder] : Bundle-SymbolicName = PAXEXAM-PROBE-93f0af59-fe44-4139-8188-18b87ed0606a
[org.ops4j.pax.tinybundles.core.intern.RawBuilder] : PaxExam-e9e5a254-3de1-4e3a-9ea2-6fb2d1e8ffa9
= org.apache.karaf.itests.StandardFeaturesTest;testSpringTestFeature
[org.ops4j.pax.tinybundles.core.intern.RawBuilder] : PaxExam-426f9b97-4a43-4baf-ac60-d98b2ee768cc
= org.apache.karaf.itests.StandardFeaturesTest;testJasyptEncryptionFeature
[org.ops4j.pax.tinybundles.core.intern.RawBuilder] : PaxExam-f12c5fff-6911-4782-b97e-a60c1df1b782
= org.apache.karaf.itests.EnterpriseFeaturesTest;testHibernateValidatorFeature
[org.ops4j.pax.tinybundles.core.intern.RawBuilder] : PaxExam-700e6d67-c334-413d-9014-8edaa3bdaf00
= org.apache.karaf.itests.StandardFeaturesTest;testSpringInstrumentFeature
[org.ops4j.pax.tinybundles.core.intern.RawBuilder] : PaxExam-6485e2ac-db65-4255-96be-6eaad55f86a5
= org.apache.karaf.itests.StandardFeaturesTest;testSpringStrutsFeature
[org.ops4j.pax.tinybundles.core.intern.RawBuilder] : PaxExam-868c6981-b70d-4026-956b-d8c58ea3760d
= org.apache.karaf.itests.OsgiTest;startLevelCommand
[org.ops4j.pax.tinybundles.core.intern.RawBuilder] : PaxExam-39393f1d-6dbc-474e-89ae-ab91b53ce605
= org.apache.karaf.itests.PackagesTest;exportsCommand
[org.ops4j.pax.tinybundles.core.intern.RawBuilder] : PaxExam-ef7ebec7-d7ba-4412-a85f-9df863f34c64
= org.apache.karaf.itests.OsgiTest;installCommand
[org.ops4j.pax.tinybundles.core.intern.RawBuilder] : PaxExam-840178f4-0576-4104-a7ba-889f850bd021
= org.apache.karaf.itests.StandardFeaturesTest;testSpringWebPortletFeature
[org.ops4j.pax.tinybundles.core.intern.RawBuilder] : PaxExam-80011da5-97e8-435c-8b5e-a2df479512a1
= org.apache.karaf.itests.StandardFeaturesTest;testWarFeature
[org.ops4j.pax.tinybundles.core.intern.RawBuilder] : PaxExam-a0b975d2-5079-4ebf-bf04-e4e453731185
= org.apache.karaf.itests.EnterpriseFeaturesTest;testHibernateEnversFeature
[org.ops4j.pax.tinybundles.core.intern.RawBuilder] : PaxExam-4f6a6dcf-821d-4508-956c-246cb58e6662
= org.apache.karaf.itests.OsgiTest;versionViaMBean
[org.ops4j.pax.tinybundles.core.intern.RawBuilder] : PaxExam-e85f7763-808d-4670-853a-ca6217e255a0
= org.apache.karaf.itests.OsgiTest;headersCommand
[org.ops4j.pax.tinybundles.core.intern.RawBuilder] : PaxExam-18eabdf6-ae18-4949-9056-73b078c5ee5a
= org.apache.karaf.itests.ServicesTest;listCommand
[org.ops4j.pax.tinybundles.core.intern.RawBuilder] : PaxExam-d43a0ae7-a179-4a6e-9984-4ec10d9392db
= org.apache.karaf.itests.StandardFeaturesTest;testSpringFeature
[org.ops4j.pax.tinybundles.core.intern.RawBuilder] : PaxExam-60687608-c7cb-4640-b382-3a0b3e6f7072
= org.apache.karaf.itests.StandardFeaturesTest;testSpringTxFeature
[org.ops4j.pax.tinybundles.core.intern.RawBuilder] : PaxExam-56e11f92-b17e-4311-95ac-13abdc1b65f5
= org.apache.karaf.itests.OsgiTest;versionCommand
[org.ops4j.pax.tinybundles.core.intern.RawBuilder] : Bundle-ManifestVersion = 2
[org.ops4j.pax.tinybundles.core.intern.RawBuilder] : PaxExam-b7a04f12-ed6f-4c18-9a90-320b211c7d7e
= org.apache.karaf.itests.OsgiTest;nameCommand
[org.ops4j.pax.tinybundles.core.intern.RawBuilder] : PaxExam-7a17660c-64dd-413c-922e-b6e9a1878d19
= org.apache.karaf.itests.EnterpriseFeaturesTest;testOpenJpaFeature
[org.ops4j.pax.tinybundles.core.intern.RawBuilder] : PaxExam-bafe1460-1fb2-4763-b362-dd3cdf576a7a
= org.apache.karaf.itests.AdminTest;renameCommand
[org.ops4j.pax.tinybundles.core.intern.RawBuilder] : PaxExam-32cef487-a0eb-457e-b5a3-a6cd6a189884
= org.apache.karaf.itests.ConfigSshCommandSecurityTest;testConfigCommandSecurityViaSsh
[org.ops4j.pax.tinybundles.core.intern.RawBuilder] : PaxExam-7d6669db-ed28-4681-b63e-8b354d079c1b
= org.apache.karaf.itests.FeaturesSshCommandSecurityTest;testFeatureCommandSecurityViaSsh
[org.ops4j.pax.tinybundles.core.intern.RawBuilder] : PaxExam-4e2a71bf-725f-492d-9c3a-7e28a17662e3
= org.apache.karaf.itests.StandardFeaturesTest;testBootFeatures
[org.ops4j.pax.tinybundles.core.intern.RawBuilder] : PaxExam-40be4b9d-bce0-4eca-90c4-c8fc9f5b80cd
= org.apache.karaf.itests.StandardFeaturesTest;testObrFeature
[org.ops4j.pax.tinybundles.core.intern.RawBuilder] : PaxExam-1025255b-d107-475d-9a40-f84a43ed874b
= org.apache.karaf.itests.FeaturesTest;installUninstallViaMBean
[org.ops4j.pax.tinybundles.core.intern.RawBuilder] : PaxExam-6cdd708a-38ba-4e31-a969-8be5c5476bad
= org.apache.karaf.itests.PackagesTest;importsViaMBean
[org.ops4j.pax.tinybundles.core.intern.RawBuilder] : PaxExam-10515eb3-f614-4396-806b-61648eb0b17e
= org.apache.karaf.itests.OsgiTest;listCommand
[org.ops4j.pax.tinybundles.core.intern.RawBuilder] : Copying resource org/apache/karaf/itests/FeaturesSshCommandSecurityTest.class
[org.ops4j.pax.tinybundles.core.intern.RawBuilder] : Copying resource org/apache/karaf/itests/ShellCommandSecurityTest.class
[org.ops4j.pax.tinybundles.core.intern.RawBuilder] : Copying resource org/apache/karaf/itests/SshCommandTestBase$Result.class
[org.ops4j.pax.tinybundles.core.intern.RawBuilder] : Copying resource org/apache/karaf/itests/KarafTestSupport$2.class
[org.ops4j.pax.tinybundles.core.intern.RawBuilder] : Copying resource org/apache/karaf/itests/PackagesTest.class
[org.ops4j.pax.tinybundles.core.intern.RawBuilder] : Copying resource org/apache/karaf/itests/KarafTestSupport$1.class
[org.ops4j.pax.tinybundles.core.intern.RawBuilder] : Copying resource META-INF/DEPENDENCIES
[org.ops4j.pax.tinybundles.core.intern.RawBuilder] : Copying resource org/apache/karaf/itests/ObrTest.class
[org.ops4j.pax.tinybundles.core.intern.RawBuilder] : Copying resource org/apache/karaf/itests/KarafTestSupport$2$1.class
[org.ops4j.pax.tinybundles.core.intern.RawBuilder] : Copying resource org/apache/karaf/itests/FeaturesTest.class
[org.ops4j.pax.tinybundles.core.intern.RawBuilder] : Copying resource META-INF/LICENSE
[org.ops4j.pax.tinybundles.core.intern.RawBuilder] : Copying resource org/apache/karaf/itests/SshCommandTestBase.class
[org.ops4j.pax.tinybundles.core.intern.RawBuilder] : Copying resource org/apache/karaf/itests/JaasTest$1.class
[org.ops4j.pax.tinybundles.core.intern.RawBuilder] : Copying resource org/apache/karaf/itests/WrapperTest.class
[org.ops4j.pax.tinybundles.core.intern.RawBuilder] : Copying resource org/apache/karaf/itests/JaasTest.class
[org.ops4j.pax.tinybundles.core.intern.RawBuilder] : Copying resource org/apache/karaf/itests/OsgiSshCommandSecurityTest.class
[org.ops4j.pax.tinybundles.core.intern.RawBuilder] : Copying resource org/apache/karaf/itests/JMXSecurityTest.class
[org.ops4j.pax.tinybundles.core.intern.RawBuilder] : Copying resource META-INF/NOTICE
[org.ops4j.pax.tinybundles.core.intern.RawBuilder] : Copying resource org/apache/karaf/itests/EnterpriseFeaturesTest.class
[org.ops4j.pax.tinybundles.core.intern.RawBuilder] : Copying resource org/apache/karaf/itests/StandardFeaturesTest.class
[org.ops4j.pax.tinybundles.core.intern.RawBuilder] : Copying resource org/apache/karaf/itests/KarafTestSupport.class
[org.ops4j.pax.tinybundles.core.intern.RawBuilder] : Copying resource org/apache/karaf/itests/LogTest.class
[org.ops4j.pax.tinybundles.core.intern.RawBuilder] : Copying resource org/apache/karaf/itests/ServicesTest.class
[org.ops4j.pax.tinybundles.core.intern.RawBuilder] : Copying resource org/apache/karaf/itests/JaasSshCommandSecurityTest.class
[org.ops4j.pax.tinybundles.core.intern.RawBuilder] : Copying resource org/apache/karaf/itests/ConfigTest.class
[org.ops4j.pax.tinybundles.core.intern.RawBuilder] : Copying resource org/apache/karaf/itests/AdminTest.class
[org.ops4j.pax.tinybundles.core.intern.RawBuilder] : Copying resource org/apache/karaf/itests/SshCommandTestBase$1.class
[org.ops4j.pax.tinybundles.core.intern.RawBuilder] : Copying resource org/apache/karaf/itests/ConfigSshCommandSecurityTest.class
[org.ops4j.pax.tinybundles.core.intern.RawBuilder] : Copying resource org/apache/karaf/itests/OsgiTest.class
[org.ops4j.store.intern.TemporaryStore] : Exit store(): 15c7c85c09a90b0592d01916d84f0936246f4634
[org.ops4j.pax.exam.container.remote.RBCRemoteTarget] : Preparing and Installing bundle (from
stream )..
[org.ops4j.pax.exam.rbc.client.RemoteBundleContextClient] : Packing probe into memory for
true RMI. Hopefully things will fill in..
[org.ops4j.pax.exam.container.remote.RBCRemoteTarget] : Installed bundle (from stream) as
ID: 76
[org.ops4j.pax.exam.junit.impl.ProbeRunner] : Invoke testJaasCommandSecurityViaSsh @ [TestAddress:PaxExam-f66fa334-9e08-4ea7-a877-c47bd23964ad
root:PaxExam-713902d6-d491-4e82-890d-7bb8caf733b1] Arguments: [Ljava.lang.Object;@1570c18
[org.ops4j.pax.exam.container.remote.RBCRemoteTarget] : call [[TestAddress:PaxExam-f66fa334-9e08-4ea7-a877-c47bd23964ad
root:PaxExam-713902d6-d491-4e82-890d-7bb8caf733b1]]
        __ __                  ____      
       / //_/____ __________ _/ __/      
      / ,<  / __ `/ ___/ __ `/ /_        
     / /| |/ /_/ / /  / /_/ / __/        
    /_/ |_|\__,_/_/   \__,_/_/         

  Apache Karaf (2.3.6-SNAPSHOT)

Hit '<tab>' for a list of available commands
and '[cmd] --help' for help on a specific command.
Hit 'osgi:shutdown' to shutdown Karaf.
Hit '<ctrl-d>' or type 'logout' to disconnect shell from current session.

karaf@root> jaas:manage --realm=karaf;jaas:useradd viewer8452669209444526_jaas
v 
iewer8452669209444526_jaas;jaas:roleadd viewer8452669209444526_jaas viewer;jaas: 
update;jaas:manage --realm=karaf;jaas:users
User Name            Role                
karaf                admin               
viewer8451300684970682_features viewer              
view8451307168631174_0 viewer              
man8451863495330364_0 manager             
man8451863495330364_0 viewer              
view8451863495351366_1 viewer              
man8452135587096082_0 manager             
man8452135587096082_0 viewer              
view8452135587115731_1 viewer              
man8452135985559498_2 manager             
man8452135985559498_2 viewer              
view8452135985564490_3 viewer              
viewer8452669209444526_jaas viewer              
karaf@root> logout

[org.ops4j.pax.exam.karaf.container.internal.KarafTestContainer] : Shutting down the test
container (Pax Runner)
[org.ops4j.pax.exam.spi.reactors.ReactorManager] : suite finished
Tests run: 1, Failures: 0, Errors: 1, Skipped: 0, Time elapsed: 5.334 sec <<< FAILURE!
- in org.apache.karaf.itests.JaasSshCommandSecurityTest
testJaasCommandSecurityViaSsh(org.apache.karaf.itests.JaasSshCommandSecurityTest)  Time elapsed:
0.429 sec  <<< ERROR!
java.lang.Exception: Could not open SSH channel
	at org.apache.karaf.itests.SshCommandTestBase.openSshChannel(SshCommandTestBase.java:130)
	at org.apache.karaf.itests.SshCommandTestBase.assertCommand(SshCommandTestBase.java:91)
	at org.apache.karaf.itests.JaasSshCommandSecurityTest.testJaasCommandSecurityViaSsh(JaasSshCommandSecurityTest.java:32)


Results :

Tests in error: 
  FeaturesSshCommandSecurityTest.testFeatureCommandSecurityViaSsh:30->SshCommandTestBase.assertCommand:91->SshCommandTestBase.openSshChannel:130
? 
  ShellCommandSecurityTest.testShellCommandSecurityViaSsh:36->SshCommandTestBase.assertCommand:91->SshCommandTestBase.openSshChannel:130
? 
  OsgiSshCommandSecurityTest.testOsgiCommandSecurityViaSsh:40->SshCommandTestBase.assertCommand:91->SshCommandTestBase.openSshChannel:130
? 
  ConfigSshCommandSecurityTest.testConfigCommandSecurityWithoutEditSessionViaSsh:100->testConfigEditsNoSession:122->SshCommandTestBase.assertCommand:91->SshCommandTestBase.openSshChannel:130
? 
  ConfigSshCommandSecurityTest.testConfigCommandSecurityViaSsh:41->SshCommandTestBase.assertCommand:91->SshCommandTestBase.openSshChannel:130
? 
  JaasSshCommandSecurityTest.testJaasCommandSecurityViaSsh:32->SshCommandTestBase.assertCommand:91->SshCommandTestBase.openSshChannel:130
? 

Tests run: 82, Failures: 0, Errors: 6, Skipped: 0

[ERROR] There are test failures.

Please refer to <https://builds.apache.org/job/karaf-2.x/org.apache.karaf.itests$itests/ws/target/surefire-reports>
for the individual test results.
[JENKINS] Recording test results
[INFO] 
[INFO] --- maven-jar-plugin:2.4:jar (default-jar) @ itests ---
[INFO] Building jar: <https://builds.apache.org/job/karaf-2.x/org.apache.karaf.itests$itests/ws/target/itests-2.4.0-SNAPSHOT.jar>
[INFO] 
[INFO] --- maven-site-plugin:3.3:attach-descriptor (attach-descriptor) @ itests ---
[INFO] 
[INFO] --- maven-jar-plugin:2.4:test-jar (jar-test-classes) @ itests ---
[INFO] Building jar: <https://builds.apache.org/job/karaf-2.x/org.apache.karaf.itests$itests/ws/target/itests-2.4.0-SNAPSHOT-tests.jar>
[INFO] 
[INFO] --- apache-rat-plugin:0.10:check (default) @ itests ---
[INFO] 51 implicit excludes (use -debug for more details).
[INFO] Exclude: **/target/**/*
[INFO] Exclude: **/.git/**/*
[INFO] Exclude: **/.idea/**/*
[INFO] Exclude: **/*.iml
[INFO] Exclude: **/*.ipr
[INFO] Exclude: **/*.iws
[INFO] Exclude: **/.*
[INFO] Exclude: **/eclipse-classes/**/*
[INFO] Exclude: **/dependency-reduced-pom.xml
[INFO] Exclude: **/.settings/**/*
[INFO] Exclude: **/bundle.info
[INFO] Exclude: **/*.txt
[INFO] Exclude: **/foo
[INFO] Exclude: **/pom.properties
[INFO] Exclude: **/*.rat
[INFO] Exclude: **/build-main.xml
[INFO] Exclude: **/*.css
[INFO] Exclude: **/*.ssp
[INFO] Exclude: **/*.conf
[INFO] 22 resources included (use -debug for more details)
[INFO] Rat check: Summary of files. Unapproved: 0 unknown: 0 generated: 0 approved: 21 licence.
[INFO] 
[INFO] --- maven-install-plugin:2.5.1:install (default-install) @ itests ---
[INFO] Installing <https://builds.apache.org/job/karaf-2.x/org.apache.karaf.itests$itests/ws/target/itests-2.4.0-SNAPSHOT.jar>
to /home/jenkins/jenkins-slave/maven-repositories/1/org/apache/karaf/itests/itests/2.4.0-SNAPSHOT/itests-2.4.0-SNAPSHOT.jar
[INFO] Installing <https://builds.apache.org/job/karaf-2.x/org.apache.karaf.itests$itests/ws/pom.xml>
to /home/jenkins/jenkins-slave/maven-repositories/1/org/apache/karaf/itests/itests/2.4.0-SNAPSHOT/itests-2.4.0-SNAPSHOT.pom
[INFO] Installing <https://builds.apache.org/job/karaf-2.x/org.apache.karaf.itests$itests/ws/target/itests-2.4.0-SNAPSHOT-tests.jar>
to /home/jenkins/jenkins-slave/maven-repositories/1/org/apache/karaf/itests/itests/2.4.0-SNAPSHOT/itests-2.4.0-SNAPSHOT-tests.jar
[INFO] 
[INFO] --- maven-deploy-plugin:2.8.1:deploy (default-deploy) @ itests ---
Downloading: https://repository.apache.org/content/repositories/snapshots/org/apache/karaf/itests/itests/2.4.0-SNAPSHOT/maven-metadata.xml
[WARNING] Could not transfer metadata org.apache.karaf.itests:itests:2.4.0-SNAPSHOT/maven-metadata.xml
from/to apache.snapshots.https (https://repository.apache.org/content/repositories/snapshots):
Failed to transfer file: https://repository.apache.org/content/repositories/snapshots/org/apache/karaf/itests/itests/2.4.0-SNAPSHOT/maven-metadata.xml.
Return code is: 503, ReasonPhrase:Service Temporarily Unavailable.

Mime
View raw message