karaf-commits mailing list archives

Site index · List index
Message view « Date » · « Thread »
Top « Date » · « Thread »
From Apache Jenkins Server <jenk...@builds.apache.org>
Subject Build failed in Jenkins: karaf-2.3.x » Apache Karaf :: Main #1202
Date Thu, 19 Jun 2014 02:49:49 GMT
See <https://builds.apache.org/job/karaf-2.3.x/org.apache.karaf$org.apache.karaf.main/1202/>

------------------------------------------
[INFO]                                                                         
[INFO] ------------------------------------------------------------------------
[INFO] Building Apache Karaf :: Main 2.3.6-SNAPSHOT
[INFO] ------------------------------------------------------------------------
[INFO] 
[INFO] --- maven-clean-plugin:2.5:clean (default-clean) @ org.apache.karaf.main ---
[INFO] Deleting <https://builds.apache.org/job/karaf-2.3.x/org.apache.karaf$org.apache.karaf.main/ws/target>
[INFO] 
[INFO] --- maven-bundle-plugin:2.4.0:cleanVersions (cleanVersions) @ org.apache.karaf.main
---
[INFO] 
[INFO] --- maven-remote-resources-plugin:1.5:process (default) @ org.apache.karaf.main ---
[INFO] 
[INFO] --- maven-antrun-plugin:1.7:run (copy-notice) @ org.apache.karaf.main ---
[INFO] Executing tasks

main:
     [copy] Copying 1 file to <https://builds.apache.org/job/karaf-2.3.x/org.apache.karaf$org.apache.karaf.main/ws/target/maven-shared-archive-resources/META-INF>
[INFO] Executed tasks
[INFO] 
[INFO] --- maven-resources-plugin:2.6:resources (default-resources) @ org.apache.karaf.main
---
[INFO] Using 'UTF-8' encoding to copy filtered resources.
[INFO] Copying 2 resources
[INFO] Copying 3 resources
[INFO] 
[INFO] --- maven-compiler-plugin:3.1:compile (default-compile) @ org.apache.karaf.main ---
[INFO] Changes detected - recompiling the module!
[INFO] Compiling 19 source files to <https://builds.apache.org/job/karaf-2.3.x/org.apache.karaf$org.apache.karaf.main/ws/target/classes>
[WARNING] Note: <https://builds.apache.org/job/karaf-2.3.x/org.apache.karaf$org.apache.karaf.main/ws/src/main/java/org/apache/karaf/main/Main.java>
uses or overrides a deprecated API.
[WARNING] Note: Recompile with -Xlint:deprecation for details.
[WARNING] Note: Some input files use unchecked or unsafe operations.
[WARNING] Note: Recompile with -Xlint:unchecked for details.
[INFO] 
[INFO] --- maven-resources-plugin:2.6:testResources (default-testResources) @ org.apache.karaf.main
---
[INFO] Using 'UTF-8' encoding to copy filtered resources.
[INFO] Copying 5 resources
[INFO] Copying 3 resources
[INFO] 
[INFO] --- maven-compiler-plugin:3.1:testCompile (default-testCompile) @ org.apache.karaf.main
---
[INFO] Changes detected - recompiling the module!
[INFO] Compiling 18 source files to <https://builds.apache.org/job/karaf-2.3.x/org.apache.karaf$org.apache.karaf.main/ws/target/test-classes>
[WARNING] Note: <https://builds.apache.org/job/karaf-2.3.x/org.apache.karaf$org.apache.karaf.main/ws/src/test/java/org/apache/karaf/main/MainLockingTest.java>
uses or overrides a deprecated API.
[WARNING] Note: Recompile with -Xlint:deprecation for details.
[WARNING] Note: <https://builds.apache.org/job/karaf-2.3.x/org.apache.karaf$org.apache.karaf.main/ws/src/test/java/org/apache/karaf/main/MainLockingTest.java>
uses unchecked or unsafe operations.
[WARNING] Note: Recompile with -Xlint:unchecked for details.
[INFO] 
[INFO] --- maven-surefire-plugin:2.12:test (default-test) @ org.apache.karaf.main ---
[INFO] Surefire report directory: <https://builds.apache.org/job/karaf-2.3.x/org.apache.karaf$org.apache.karaf.main/ws/target/surefire-reports>

-------------------------------------------------------
 T E S T S
-------------------------------------------------------
Running org.apache.karaf.main.MySQLJDBCLockTest
Jun 19, 2014 2:46:46 AM org.apache.karaf.main.DefaultJDBCLock schemaExists
SEVERE: Error testing for db table: java.lang.NullPointerException
Jun 19, 2014 2:46:46 AM org.apache.karaf.main.DefaultJDBCLock createSchema
SEVERE: Could not create schema: java.lang.IllegalStateException: missing behavior definition
for the preceding method call:
Connection.getMetaData()
Usage is: expect(a.foo()).andXXX()
Jun 19, 2014 2:46:46 AM org.apache.karaf.main.DefaultJDBCLock updateLock
WARNING: Failed to update database lock: java.sql.SQLException
Jun 19, 2014 2:46:46 AM org.apache.karaf.main.DefaultJDBCLock updateLock
WARNING: Failed to update database lock: java.sql.SQLException
Jun 19, 2014 2:46:46 AM org.apache.karaf.main.DefaultJDBCLock isAlive
SEVERE: Lost lock!
Jun 19, 2014 2:46:46 AM org.apache.karaf.main.DefaultJDBCLock isAlive
SEVERE: Lost lock!
Jun 19, 2014 2:46:46 AM org.apache.karaf.main.DefaultJDBCLock updateLock
WARNING: Failed to update database lock: java.sql.SQLException
Tests run: 14, Failures: 0, Errors: 0, Skipped: 0, Time elapsed: 0.203 sec
Running org.apache.karaf.main.OracleJDBCLockTest
Jun 19, 2014 2:46:46 AM org.apache.karaf.main.DefaultJDBCLock aquireLock
WARNING: Failed to acquire database lock: java.sql.SQLException
Jun 19, 2014 2:46:46 AM org.apache.karaf.main.DefaultJDBCLock aquireLock
WARNING: Failed to acquire database lock: java.sql.SQLException
Jun 19, 2014 2:46:46 AM org.apache.karaf.main.DefaultJDBCLock aquireLock
WARNING: Failed to acquire database lock: java.sql.SQLException
Jun 19, 2014 2:46:46 AM org.apache.karaf.main.DefaultJDBCLock isAlive
SEVERE: Lost lock!
Jun 19, 2014 2:46:46 AM org.apache.karaf.main.DefaultJDBCLock isAlive
SEVERE: Lost lock!
Tests run: 13, Failures: 0, Errors: 0, Skipped: 0, Time elapsed: 0.024 sec
Running org.apache.karaf.main.OracleJDBCLockIntegrationTest
Tests run: 1, Failures: 0, Errors: 0, Skipped: 1, Time elapsed: 0.001 sec
Running org.apache.karaf.main.PostgreSQLJDBCLockIntegrationTest
Tests run: 1, Failures: 0, Errors: 0, Skipped: 1, Time elapsed: 0.001 sec
Running org.apache.karaf.main.MySQLJDBCLockIntegrationTest
Tests run: 1, Failures: 0, Errors: 0, Skipped: 1, Time elapsed: 0 sec
Running org.apache.karaf.main.StatementsTest
Tests run: 6, Failures: 0, Errors: 0, Skipped: 0, Time elapsed: 0.001 sec
Running org.apache.karaf.main.MainLockingTest
SLF4J: Failed to load class "org.slf4j.impl.StaticLoggerBinder".
SLF4J: Defaulting to no-operation (NOP) logger implementation
SLF4J: See http://www.slf4j.org/codes.html#StaticLoggerBinder for further details.
Jun 19, 2014 2:46:48 AM org.ops4j.pax.swissbox.tinybundles.core.metadata.RawBuilder$1 run
INFO: Copy thread finished.
Jun 19, 2014 2:46:48 AM org.apache.karaf.main.Main doLock
INFO: Lost the lock, reducing start level to 1
Jun 19, 2014 2:46:59 AM org.apache.karaf.main.Main doLock
INFO: Waiting for the lock ...
Jun 19, 2014 2:47:00 AM org.apache.karaf.main.Main doLock
INFO: Lock acquired.
Tests run: 1, Failures: 0, Errors: 0, Skipped: 0, Time elapsed: 25.469 sec
Running org.apache.karaf.main.DefaultJDBCLockTest
Jun 19, 2014 2:47:11 AM org.apache.karaf.main.DefaultJDBCLock schemaExists
SEVERE: Error testing for db table: java.lang.NullPointerException
Jun 19, 2014 2:47:11 AM org.apache.karaf.main.DefaultJDBCLock createSchema
SEVERE: Could not create schema: java.lang.IllegalStateException: missing behavior definition
for the preceding method call:
Connection.getMetaData()
Usage is: expect(a.foo()).andXXX()
Jun 19, 2014 2:47:12 AM org.apache.karaf.main.DefaultJDBCLock updateLock
WARNING: Failed to update database lock: java.sql.SQLException
Jun 19, 2014 2:47:12 AM org.apache.karaf.main.DefaultJDBCLock updateLock
WARNING: Failed to update database lock: java.sql.SQLException
Jun 19, 2014 2:47:12 AM org.apache.karaf.main.DefaultJDBCLock isAlive
SEVERE: Lost lock!
Jun 19, 2014 2:47:12 AM org.apache.karaf.main.DefaultJDBCLock isAlive
SEVERE: Lost lock!
Jun 19, 2014 2:47:12 AM org.apache.karaf.main.DefaultJDBCLock updateLock
WARNING: Failed to update database lock: java.sql.SQLException
Tests run: 14, Failures: 0, Errors: 0, Skipped: 0, Time elapsed: 0.022 sec
Running org.apache.karaf.main.DerbyJDBCLockIntegrationTest
Tests run: 1, Failures: 0, Errors: 0, Skipped: 1, Time elapsed: 0 sec
Running org.apache.karaf.main.StringMapTest
Tests run: 1, Failures: 0, Errors: 0, Skipped: 0, Time elapsed: 0 sec
Running org.apache.karaf.main.DefaultJDBCLockIntegrationTest
Tests run: 1, Failures: 0, Errors: 0, Skipped: 1, Time elapsed: 0 sec
Running org.apache.karaf.main.MainStartTest
Tests run: 2, Failures: 0, Errors: 0, Skipped: 2, Time elapsed: 0.001 sec
Running org.apache.karaf.main.PostgreSQLJDBCLockTest
Jun 19, 2014 2:47:12 AM org.apache.karaf.main.DefaultJDBCLock schemaExists
SEVERE: Error testing for db table: java.lang.NullPointerException
Jun 19, 2014 2:47:12 AM org.apache.karaf.main.DefaultJDBCLock createSchema
SEVERE: Could not create schema: java.lang.IllegalStateException: missing behavior definition
for the preceding method call:
Connection.getMetaData()
Usage is: expect(a.foo()).andXXX()
Jun 19, 2014 2:47:12 AM org.apache.karaf.main.DefaultJDBCLock updateLock
WARNING: Failed to update database lock: java.sql.SQLException
Jun 19, 2014 2:47:12 AM org.apache.karaf.main.DefaultJDBCLock updateLock
WARNING: Failed to update database lock: java.sql.SQLException
Jun 19, 2014 2:47:12 AM org.apache.karaf.main.DefaultJDBCLock isAlive
SEVERE: Lost lock!
Jun 19, 2014 2:47:12 AM org.apache.karaf.main.DefaultJDBCLock isAlive
SEVERE: Lost lock!
Jun 19, 2014 2:47:12 AM org.apache.karaf.main.DefaultJDBCLock updateLock
WARNING: Failed to update database lock: java.sql.SQLException
Tests run: 14, Failures: 0, Errors: 0, Skipped: 0, Time elapsed: 0.001 sec
Running org.apache.karaf.main.DerbyJDBCLockTest
Jun 19, 2014 2:47:12 AM org.apache.karaf.main.DefaultJDBCLock schemaExists
SEVERE: Error testing for db table: java.lang.NullPointerException
Jun 19, 2014 2:47:12 AM org.apache.karaf.main.DefaultJDBCLock createSchema
SEVERE: Could not create schema: java.lang.IllegalStateException: missing behavior definition
for the preceding method call:
Connection.getMetaData()
Usage is: expect(a.foo()).andXXX()
Jun 19, 2014 2:47:12 AM org.apache.karaf.main.DefaultJDBCLock updateLock
WARNING: Failed to update database lock: java.sql.SQLException
Jun 19, 2014 2:47:12 AM org.apache.karaf.main.DefaultJDBCLock updateLock
WARNING: Failed to update database lock: java.sql.SQLException
Jun 19, 2014 2:47:12 AM org.apache.karaf.main.DefaultJDBCLock isAlive
SEVERE: Lost lock!
Jun 19, 2014 2:47:12 AM org.apache.karaf.main.DefaultJDBCLock isAlive
SEVERE: Lost lock!
Jun 19, 2014 2:47:12 AM org.apache.karaf.main.DefaultJDBCLock updateLock
WARNING: Failed to update database lock: java.sql.SQLException
Tests run: 14, Failures: 0, Errors: 0, Skipped: 0, Time elapsed: 0.011 sec

Results :

Tests run: 84, Failures: 0, Errors: 0, Skipped: 7

[JENKINS] Recording test results
[INFO] 
[INFO] --- maven-bundle-plugin:2.4.0:bundle (default-bundle) @ org.apache.karaf.main ---
[WARNING] Bundle org.apache.karaf:org.apache.karaf.main:bundle:2.3.6-SNAPSHOT : Export org.apache.karaf.main,
 has 2,  private references [org.osgi.framework.launch, org.osgi.framework], 
[INFO] 
[INFO] --- maven-site-plugin:3.3:attach-descriptor (attach-descriptor) @ org.apache.karaf.main
---
[INFO] 
[INFO] --- maven-shade-plugin:2.2:shade (default) @ org.apache.karaf.main ---
[INFO] Excluding org.apache.karaf:org.apache.karaf.util:jar:2.3.6-SNAPSHOT from the shaded
jar.
[INFO] Excluding org.osgi:org.osgi.core:jar:4.3.1 from the shaded jar.
[INFO] Excluding org.apache.felix:org.apache.felix.utils:jar:1.4.2 from the shaded jar.
[INFO] Excluding org.osgi:org.osgi.compendium:jar:4.3.1 from the shaded jar.
[INFO] Replacing original artifact with shaded artifact.
[INFO] Replacing <https://builds.apache.org/job/karaf-2.3.x/org.apache.karaf$org.apache.karaf.main/ws/target/org.apache.karaf.main-2.3.6-SNAPSHOT.jar>
with <https://builds.apache.org/job/karaf-2.3.x/org.apache.karaf$org.apache.karaf.main/ws/target/org.apache.karaf.main-2.3.6-SNAPSHOT-shaded.jar>
[INFO] 
[INFO] --- maven-install-plugin:2.5.1:install (default-install) @ org.apache.karaf.main ---
[INFO] Installing <https://builds.apache.org/job/karaf-2.3.x/org.apache.karaf$org.apache.karaf.main/ws/target/org.apache.karaf.main-2.3.6-SNAPSHOT.jar>
to /home/jenkins/jenkins-slave/workspace/karaf-2.3.x/.repository/org/apache/karaf/org.apache.karaf.main/2.3.6-SNAPSHOT/org.apache.karaf.main-2.3.6-SNAPSHOT.jar
[INFO] Installing <https://builds.apache.org/job/karaf-2.3.x/org.apache.karaf$org.apache.karaf.main/ws/pom.xml>
to /home/jenkins/jenkins-slave/workspace/karaf-2.3.x/.repository/org/apache/karaf/org.apache.karaf.main/2.3.6-SNAPSHOT/org.apache.karaf.main-2.3.6-SNAPSHOT.pom
[INFO] 
[INFO] --- maven-bundle-plugin:2.4.0:install (default-install) @ org.apache.karaf.main ---
[INFO] Installing org/apache/karaf/org.apache.karaf.main/2.3.6-SNAPSHOT/org.apache.karaf.main-2.3.6-SNAPSHOT.jar
[INFO] Writing OBR metadata
[INFO] 
[INFO] --- maven-deploy-plugin:2.8.1:deploy (default-deploy) @ org.apache.karaf.main ---
Downloading: https://repository.apache.org/content/repositories/snapshots/org/apache/karaf/org.apache.karaf.main/2.3.6-SNAPSHOT/maven-metadata.xml
[WARNING] Could not transfer metadata org.apache.karaf:org.apache.karaf.main:2.3.6-SNAPSHOT/maven-metadata.xml
from/to apache.snapshots.https (https://repository.apache.org/content/repositories/snapshots):
Failed to transfer file: https://repository.apache.org/content/repositories/snapshots/org/apache/karaf/org.apache.karaf.main/2.3.6-SNAPSHOT/maven-metadata.xml.
Return code is: 503, ReasonPhrase:Service Temporarily Unavailable.

Mime
View raw message