karaf-commits mailing list archives

Site index · List index
Message view « Date » · « Thread »
Top « Date » · « Thread »
From Apache Jenkins Server <jenk...@builds.apache.org>
Subject Build failed in Jenkins: karaf-3.0.x » Apache Karaf :: Tooling :: Maven Karaf Plugin #51
Date Thu, 10 Apr 2014 01:04:08 GMT
See <https://builds.apache.org/job/karaf-3.0.x/org.apache.karaf.tooling$karaf-maven-plugin/51/changes>

Changes:

[jbonofre] [KARAF-1432] Fix the way the features-validate-descriptor parses the system packages

------------------------------------------
[INFO]                                                                         
[INFO] ------------------------------------------------------------------------
[INFO] Building Apache Karaf :: Tooling :: Maven Karaf Plugin 3.0.1-SNAPSHOT
[INFO] ------------------------------------------------------------------------
[INFO] 
[INFO] --- maven-clean-plugin:2.5:clean (default-clean) @ karaf-maven-plugin ---
[INFO] Deleting <https://builds.apache.org/job/karaf-3.0.x/org.apache.karaf.tooling$karaf-maven-plugin/ws/target>
[INFO] 
[INFO] --- maven-enforcer-plugin:1.3.1:enforce (enforce-maven) @ karaf-maven-plugin ---
[INFO] 
[INFO] --- maven-bundle-plugin:2.4.0:cleanVersions (cleanVersions) @ karaf-maven-plugin ---
[INFO] 
[INFO] --- maven-plugin-plugin:3.2:descriptor (default-descriptor) @ karaf-maven-plugin ---
[INFO] Using 'UTF-8' encoding to read mojo metadata.
[INFO] Applying mojo extractor for language: java-annotations
[INFO] Mojo extractor for language: java-annotations found 0 mojo descriptors.
[INFO] Applying mojo extractor for language: java
[INFO] Mojo extractor for language: java found 8 mojo descriptors.
[INFO] Applying mojo extractor for language: bsh
[INFO] Mojo extractor for language: bsh found 0 mojo descriptors.
[INFO] 
[INFO] --- maven-remote-resources-plugin:1.5:process (default) @ karaf-maven-plugin ---
[INFO] 
[INFO] --- maven-resources-plugin:2.6:resources (default-resources) @ karaf-maven-plugin ---
[INFO] Using 'UTF-8' encoding to copy filtered resources.
[INFO] Copying 4 resources
[INFO] Copying 3 resources
[INFO] 
[INFO] --- maven-compiler-plugin:3.1:compile (default-compile) @ karaf-maven-plugin ---
[INFO] Changes detected - recompiling the module!
[INFO] Compiling 32 source files to <https://builds.apache.org/job/karaf-3.0.x/org.apache.karaf.tooling$karaf-maven-plugin/ws/target/classes>
[WARNING] <https://builds.apache.org/job/karaf-3.0.x/org.apache.karaf.tooling$karaf-maven-plugin/ws/src/main/java/org/apache/karaf/tooling/utils/MojoSupport.java>:
Some input files use or override a deprecated API.
[WARNING] <https://builds.apache.org/job/karaf-3.0.x/org.apache.karaf.tooling$karaf-maven-plugin/ws/src/main/java/org/apache/karaf/tooling/utils/MojoSupport.java>:
Recompile with -Xlint:deprecation for details.
[INFO] 
[INFO] --- maven-resources-plugin:2.6:testResources (default-testResources) @ karaf-maven-plugin
---
[INFO] Using 'UTF-8' encoding to copy filtered resources.
[INFO] Copying 3 resources
[INFO] Copying 3 resources
[INFO] 
[INFO] --- maven-compiler-plugin:3.1:testCompile (default-testCompile) @ karaf-maven-plugin
---
[INFO] Changes detected - recompiling the module!
[INFO] Compiling 6 source files to <https://builds.apache.org/job/karaf-3.0.x/org.apache.karaf.tooling$karaf-maven-plugin/ws/target/test-classes>
[INFO] 
[INFO] --- maven-surefire-plugin:2.16:test (default-test) @ karaf-maven-plugin ---
[INFO] Surefire report directory: <https://builds.apache.org/job/karaf-3.0.x/org.apache.karaf.tooling$karaf-maven-plugin/ws/target/surefire-reports>

-------------------------------------------------------
 T E S T S
-------------------------------------------------------
Running org.apache.karaf.tooling.features.BundleToArtifactTest
Tests run: 3, Failures: 0, Errors: 0, Skipped: 0, Time elapsed: 0.086 sec - in org.apache.karaf.tooling.features.BundleToArtifactTest
Running org.apache.karaf.tooling.features.MavenUtilTest
Tests run: 8, Failures: 0, Errors: 0, Skipped: 2, Time elapsed: 0.038 sec - in org.apache.karaf.tooling.features.MavenUtilTest
Running org.apache.karaf.tooling.features.ManifestUtilsTest
Tests run: 2, Failures: 0, Errors: 0, Skipped: 0, Time elapsed: 0.033 sec - in org.apache.karaf.tooling.features.ManifestUtilsTest
Running org.apache.karaf.tooling.features.GenerateDescriptorMojoTest
Tests run: 2, Failures: 0, Errors: 0, Skipped: 0, Time elapsed: 0.162 sec - in org.apache.karaf.tooling.features.GenerateDescriptorMojoTest
Running org.apache.karaf.tooling.features.AddToRepositoryMojoTest
Tests run: 1, Failures: 0, Errors: 0, Skipped: 0, Time elapsed: 0.011 sec - in org.apache.karaf.tooling.features.AddToRepositoryMojoTest
Running org.apache.karaf.tooling.features.FeatureMetaDataExporterTest
Tests run: 1, Failures: 0, Errors: 0, Skipped: 0, Time elapsed: 0.044 sec - in org.apache.karaf.tooling.features.FeatureMetaDataExporterTest

Results :

Tests run: 17, Failures: 0, Errors: 0, Skipped: 2

[JENKINS] Recording test results
[INFO] 
[INFO] --- maven-jar-plugin:2.4:jar (default-jar) @ karaf-maven-plugin ---
[INFO] Building jar: <https://builds.apache.org/job/karaf-3.0.x/org.apache.karaf.tooling$karaf-maven-plugin/ws/target/karaf-maven-plugin-3.0.1-SNAPSHOT.jar>
[INFO] 
[INFO] --- maven-plugin-plugin:3.2:addPluginArtifactMetadata (default-addPluginArtifactMetadata)
@ karaf-maven-plugin ---
[INFO] 
[INFO] --- maven-site-plugin:3.3:attach-descriptor (attach-descriptor) @ karaf-maven-plugin
---
[INFO] 
[INFO] --- maven-invoker-plugin:1.6:install (integration-test) @ karaf-maven-plugin ---
[INFO] Installing /home/jenkins/jenkins-slave/workspace/karaf-3.0.x/features/core/pom.xml
to <https://builds.apache.org/job/karaf-3.0.x/org.apache.karaf.tooling$karaf-maven-plugin/ws/target/system/org/apache/karaf/features/org.apache.karaf.features.core/3.0.1-SNAPSHOT/org.apache.karaf.features.core-3.0.1-SNAPSHOT.pom>
[INFO] Installing /home/jenkins/jenkins-slave/workspace/karaf-3.0.x/features/core/target/org.apache.karaf.features.core-3.0.1-SNAPSHOT.jar
to <https://builds.apache.org/job/karaf-3.0.x/org.apache.karaf.tooling$karaf-maven-plugin/ws/target/system/org/apache/karaf/features/org.apache.karaf.features.core/3.0.1-SNAPSHOT/org.apache.karaf.features.core-3.0.1-SNAPSHOT.jar>
[INFO] Installing /home/jenkins/jenkins-slave/workspace/karaf-3.0.x/features/core/pom.xml
to <https://builds.apache.org/job/karaf-3.0.x/org.apache.karaf.tooling$karaf-maven-plugin/ws/target/system/org/apache/karaf/features/org.apache.karaf.features.core/3.0.1-SNAPSHOT/org.apache.karaf.features.core-3.0.1-SNAPSHOT.pom>
[INFO] Installing /home/jenkins/jenkins-slave/workspace/karaf-3.0.x/features/pom.xml to <https://builds.apache.org/job/karaf-3.0.x/org.apache.karaf.tooling$karaf-maven-plugin/ws/target/system/org/apache/karaf/features/features/3.0.1-SNAPSHOT/features-3.0.1-SNAPSHOT.pom>
[INFO] Installing /home/jenkins/jenkins-slave/workspace/karaf-3.0.x/pom.xml to <https://builds.apache.org/job/karaf-3.0.x/org.apache.karaf.tooling$karaf-maven-plugin/ws/target/system/org/apache/karaf/karaf/3.0.1-SNAPSHOT/karaf-3.0.1-SNAPSHOT.pom>
[INFO] Installing /home/jenkins/jenkins-slave/workspace/karaf-3.0.x/deployer/spring/pom.xml
to <https://builds.apache.org/job/karaf-3.0.x/org.apache.karaf.tooling$karaf-maven-plugin/ws/target/system/org/apache/karaf/deployer/org.apache.karaf.deployer.spring/3.0.1-SNAPSHOT/org.apache.karaf.deployer.spring-3.0.1-SNAPSHOT.pom>
[INFO] Installing /home/jenkins/jenkins-slave/workspace/karaf-3.0.x/deployer/spring/target/org.apache.karaf.deployer.spring-3.0.1-SNAPSHOT.jar
to <https://builds.apache.org/job/karaf-3.0.x/org.apache.karaf.tooling$karaf-maven-plugin/ws/target/system/org/apache/karaf/deployer/org.apache.karaf.deployer.spring/3.0.1-SNAPSHOT/org.apache.karaf.deployer.spring-3.0.1-SNAPSHOT.jar>
[INFO] Installing /home/jenkins/jenkins-slave/workspace/karaf-3.0.x/deployer/spring/pom.xml
to <https://builds.apache.org/job/karaf-3.0.x/org.apache.karaf.tooling$karaf-maven-plugin/ws/target/system/org/apache/karaf/deployer/org.apache.karaf.deployer.spring/3.0.1-SNAPSHOT/org.apache.karaf.deployer.spring-3.0.1-SNAPSHOT.pom>
[INFO] Installing /home/jenkins/jenkins-slave/workspace/karaf-3.0.x/deployer/pom.xml to <https://builds.apache.org/job/karaf-3.0.x/org.apache.karaf.tooling$karaf-maven-plugin/ws/target/system/org/apache/karaf/deployer/deployer/3.0.1-SNAPSHOT/deployer-3.0.1-SNAPSHOT.pom>
[INFO] Installing /home/jenkins/jenkins-slave/workspace/karaf-3.0.x/deployer/blueprint/pom.xml
to <https://builds.apache.org/job/karaf-3.0.x/org.apache.karaf.tooling$karaf-maven-plugin/ws/target/system/org/apache/karaf/deployer/org.apache.karaf.deployer.blueprint/3.0.1-SNAPSHOT/org.apache.karaf.deployer.blueprint-3.0.1-SNAPSHOT.pom>
[INFO] Installing /home/jenkins/jenkins-slave/workspace/karaf-3.0.x/deployer/blueprint/target/org.apache.karaf.deployer.blueprint-3.0.1-SNAPSHOT.jar
to <https://builds.apache.org/job/karaf-3.0.x/org.apache.karaf.tooling$karaf-maven-plugin/ws/target/system/org/apache/karaf/deployer/org.apache.karaf.deployer.blueprint/3.0.1-SNAPSHOT/org.apache.karaf.deployer.blueprint-3.0.1-SNAPSHOT.jar>
[INFO] Installing /home/jenkins/jenkins-slave/workspace/karaf-3.0.x/deployer/blueprint/pom.xml
to <https://builds.apache.org/job/karaf-3.0.x/org.apache.karaf.tooling$karaf-maven-plugin/ws/target/system/org/apache/karaf/deployer/org.apache.karaf.deployer.blueprint/3.0.1-SNAPSHOT/org.apache.karaf.deployer.blueprint-3.0.1-SNAPSHOT.pom>
[INFO] Installing /home/jenkins/jenkins-slave/workspace/karaf-3.0.x/deployer/features/pom.xml
to <https://builds.apache.org/job/karaf-3.0.x/org.apache.karaf.tooling$karaf-maven-plugin/ws/target/system/org/apache/karaf/deployer/org.apache.karaf.deployer.features/3.0.1-SNAPSHOT/org.apache.karaf.deployer.features-3.0.1-SNAPSHOT.pom>
[INFO] Installing /home/jenkins/jenkins-slave/workspace/karaf-3.0.x/deployer/features/target/org.apache.karaf.deployer.features-3.0.1-SNAPSHOT.jar
to <https://builds.apache.org/job/karaf-3.0.x/org.apache.karaf.tooling$karaf-maven-plugin/ws/target/system/org/apache/karaf/deployer/org.apache.karaf.deployer.features/3.0.1-SNAPSHOT/org.apache.karaf.deployer.features-3.0.1-SNAPSHOT.jar>
[INFO] Installing /home/jenkins/jenkins-slave/workspace/karaf-3.0.x/deployer/features/pom.xml
to <https://builds.apache.org/job/karaf-3.0.x/org.apache.karaf.tooling$karaf-maven-plugin/ws/target/system/org/apache/karaf/deployer/org.apache.karaf.deployer.features/3.0.1-SNAPSHOT/org.apache.karaf.deployer.features-3.0.1-SNAPSHOT.pom>
[INFO] Installing /home/jenkins/jenkins-slave/workspace/karaf-3.0.x/deployer/kar/pom.xml to
<https://builds.apache.org/job/karaf-3.0.x/org.apache.karaf.tooling$karaf-maven-plugin/ws/target/system/org/apache/karaf/deployer/org.apache.karaf.deployer.kar/3.0.1-SNAPSHOT/org.apache.karaf.deployer.kar-3.0.1-SNAPSHOT.pom>
[INFO] Installing /home/jenkins/jenkins-slave/workspace/karaf-3.0.x/deployer/kar/target/org.apache.karaf.deployer.kar-3.0.1-SNAPSHOT.jar
to <https://builds.apache.org/job/karaf-3.0.x/org.apache.karaf.tooling$karaf-maven-plugin/ws/target/system/org/apache/karaf/deployer/org.apache.karaf.deployer.kar/3.0.1-SNAPSHOT/org.apache.karaf.deployer.kar-3.0.1-SNAPSHOT.jar>
[INFO] Installing /home/jenkins/jenkins-slave/workspace/karaf-3.0.x/deployer/kar/pom.xml to
<https://builds.apache.org/job/karaf-3.0.x/org.apache.karaf.tooling$karaf-maven-plugin/ws/target/system/org/apache/karaf/deployer/org.apache.karaf.deployer.kar/3.0.1-SNAPSHOT/org.apache.karaf.deployer.kar-3.0.1-SNAPSHOT.pom>
[INFO] Installing /home/jenkins/jenkins-slave/workspace/karaf-3.0.x/kar/core/pom.xml to <https://builds.apache.org/job/karaf-3.0.x/org.apache.karaf.tooling$karaf-maven-plugin/ws/target/system/org/apache/karaf/kar/org.apache.karaf.kar.core/3.0.1-SNAPSHOT/org.apache.karaf.kar.core-3.0.1-SNAPSHOT.pom>
[INFO] Installing /home/jenkins/jenkins-slave/workspace/karaf-3.0.x/kar/core/target/org.apache.karaf.kar.core-3.0.1-SNAPSHOT.jar
to <https://builds.apache.org/job/karaf-3.0.x/org.apache.karaf.tooling$karaf-maven-plugin/ws/target/system/org/apache/karaf/kar/org.apache.karaf.kar.core/3.0.1-SNAPSHOT/org.apache.karaf.kar.core-3.0.1-SNAPSHOT.jar>
[INFO] Installing /home/jenkins/jenkins-slave/workspace/karaf-3.0.x/kar/core/pom.xml to <https://builds.apache.org/job/karaf-3.0.x/org.apache.karaf.tooling$karaf-maven-plugin/ws/target/system/org/apache/karaf/kar/org.apache.karaf.kar.core/3.0.1-SNAPSHOT/org.apache.karaf.kar.core-3.0.1-SNAPSHOT.pom>
[INFO] Installing /home/jenkins/jenkins-slave/workspace/karaf-3.0.x/kar/pom.xml to <https://builds.apache.org/job/karaf-3.0.x/org.apache.karaf.tooling$karaf-maven-plugin/ws/target/system/org/apache/karaf/kar/kar/3.0.1-SNAPSHOT/kar-3.0.1-SNAPSHOT.pom>
[INFO] Installing /home/jenkins/jenkins-slave/workspace/karaf-3.0.x/shell/console/pom.xml
to <https://builds.apache.org/job/karaf-3.0.x/org.apache.karaf.tooling$karaf-maven-plugin/ws/target/system/org/apache/karaf/shell/org.apache.karaf.shell.console/3.0.1-SNAPSHOT/org.apache.karaf.shell.console-3.0.1-SNAPSHOT.pom>
[INFO] Installing /home/jenkins/jenkins-slave/workspace/karaf-3.0.x/shell/console/target/org.apache.karaf.shell.console-3.0.1-SNAPSHOT.jar
to <https://builds.apache.org/job/karaf-3.0.x/org.apache.karaf.tooling$karaf-maven-plugin/ws/target/system/org/apache/karaf/shell/org.apache.karaf.shell.console/3.0.1-SNAPSHOT/org.apache.karaf.shell.console-3.0.1-SNAPSHOT.jar>
[INFO] Installing /home/jenkins/jenkins-slave/workspace/karaf-3.0.x/shell/console/pom.xml
to <https://builds.apache.org/job/karaf-3.0.x/org.apache.karaf.tooling$karaf-maven-plugin/ws/target/system/org/apache/karaf/shell/org.apache.karaf.shell.console/3.0.1-SNAPSHOT/org.apache.karaf.shell.console-3.0.1-SNAPSHOT.pom>
[INFO] Installing /home/jenkins/jenkins-slave/workspace/karaf-3.0.x/shell/pom.xml to <https://builds.apache.org/job/karaf-3.0.x/org.apache.karaf.tooling$karaf-maven-plugin/ws/target/system/org/apache/karaf/shell/shell/3.0.1-SNAPSHOT/shell-3.0.1-SNAPSHOT.pom>
[INFO] Installing /home/jenkins/jenkins-slave/workspace/karaf-3.0.x/jaas/modules/pom.xml to
<https://builds.apache.org/job/karaf-3.0.x/org.apache.karaf.tooling$karaf-maven-plugin/ws/target/system/org/apache/karaf/jaas/org.apache.karaf.jaas.modules/3.0.1-SNAPSHOT/org.apache.karaf.jaas.modules-3.0.1-SNAPSHOT.pom>
[INFO] Installing /home/jenkins/jenkins-slave/workspace/karaf-3.0.x/jaas/modules/target/org.apache.karaf.jaas.modules-3.0.1-SNAPSHOT.jar
to <https://builds.apache.org/job/karaf-3.0.x/org.apache.karaf.tooling$karaf-maven-plugin/ws/target/system/org/apache/karaf/jaas/org.apache.karaf.jaas.modules/3.0.1-SNAPSHOT/org.apache.karaf.jaas.modules-3.0.1-SNAPSHOT.jar>
[INFO] Installing /home/jenkins/jenkins-slave/workspace/karaf-3.0.x/jaas/modules/pom.xml to
<https://builds.apache.org/job/karaf-3.0.x/org.apache.karaf.tooling$karaf-maven-plugin/ws/target/system/org/apache/karaf/jaas/org.apache.karaf.jaas.modules/3.0.1-SNAPSHOT/org.apache.karaf.jaas.modules-3.0.1-SNAPSHOT.pom>
[INFO] Installing /home/jenkins/jenkins-slave/workspace/karaf-3.0.x/jaas/pom.xml to <https://builds.apache.org/job/karaf-3.0.x/org.apache.karaf.tooling$karaf-maven-plugin/ws/target/system/org/apache/karaf/jaas/jaas/3.0.1-SNAPSHOT/jaas-3.0.1-SNAPSHOT.pom>
[INFO] Installing /home/jenkins/jenkins-slave/workspace/karaf-3.0.x/jaas/config/pom.xml to
<https://builds.apache.org/job/karaf-3.0.x/org.apache.karaf.tooling$karaf-maven-plugin/ws/target/system/org/apache/karaf/jaas/org.apache.karaf.jaas.config/3.0.1-SNAPSHOT/org.apache.karaf.jaas.config-3.0.1-SNAPSHOT.pom>
[INFO] Installing /home/jenkins/jenkins-slave/workspace/karaf-3.0.x/jaas/config/target/org.apache.karaf.jaas.config-3.0.1-SNAPSHOT.jar
to <https://builds.apache.org/job/karaf-3.0.x/org.apache.karaf.tooling$karaf-maven-plugin/ws/target/system/org/apache/karaf/jaas/org.apache.karaf.jaas.config/3.0.1-SNAPSHOT/org.apache.karaf.jaas.config-3.0.1-SNAPSHOT.jar>
[INFO] Installing /home/jenkins/jenkins-slave/workspace/karaf-3.0.x/jaas/config/pom.xml to
<https://builds.apache.org/job/karaf-3.0.x/org.apache.karaf.tooling$karaf-maven-plugin/ws/target/system/org/apache/karaf/jaas/org.apache.karaf.jaas.config/3.0.1-SNAPSHOT/org.apache.karaf.jaas.config-3.0.1-SNAPSHOT.pom>
[INFO] Installing /home/jenkins/jenkins-slave/workspace/karaf-3.0.x/jaas/boot/pom.xml to <https://builds.apache.org/job/karaf-3.0.x/org.apache.karaf.tooling$karaf-maven-plugin/ws/target/system/org/apache/karaf/jaas/org.apache.karaf.jaas.boot/3.0.1-SNAPSHOT/org.apache.karaf.jaas.boot-3.0.1-SNAPSHOT.pom>
[INFO] Installing /home/jenkins/jenkins-slave/workspace/karaf-3.0.x/jaas/boot/target/org.apache.karaf.jaas.boot-3.0.1-SNAPSHOT.jar
to <https://builds.apache.org/job/karaf-3.0.x/org.apache.karaf.tooling$karaf-maven-plugin/ws/target/system/org/apache/karaf/jaas/org.apache.karaf.jaas.boot/3.0.1-SNAPSHOT/org.apache.karaf.jaas.boot-3.0.1-SNAPSHOT.jar>
[INFO] Installing /home/jenkins/jenkins-slave/workspace/karaf-3.0.x/jaas/boot/pom.xml to <https://builds.apache.org/job/karaf-3.0.x/org.apache.karaf.tooling$karaf-maven-plugin/ws/target/system/org/apache/karaf/jaas/org.apache.karaf.jaas.boot/3.0.1-SNAPSHOT/org.apache.karaf.jaas.boot-3.0.1-SNAPSHOT.pom>
[INFO] Installing /home/jenkins/jenkins-slave/workspace/karaf-3.0.x/tooling/pom.xml to <https://builds.apache.org/job/karaf-3.0.x/org.apache.karaf.tooling$karaf-maven-plugin/ws/target/system/org/apache/karaf/tooling/tooling/3.0.1-SNAPSHOT/tooling-3.0.1-SNAPSHOT.pom>
[INFO] Installing <https://builds.apache.org/job/karaf-3.0.x/org.apache.karaf.tooling$karaf-maven-plugin/ws/pom.xml>
to <https://builds.apache.org/job/karaf-3.0.x/org.apache.karaf.tooling$karaf-maven-plugin/ws/target/system/org/apache/karaf/tooling/karaf-maven-plugin/3.0.1-SNAPSHOT/karaf-maven-plugin-3.0.1-SNAPSHOT.pom>
[INFO] Installing <https://builds.apache.org/job/karaf-3.0.x/org.apache.karaf.tooling$karaf-maven-plugin/ws/target/karaf-maven-plugin-3.0.1-SNAPSHOT.jar>
to <https://builds.apache.org/job/karaf-3.0.x/org.apache.karaf.tooling$karaf-maven-plugin/ws/target/system/org/apache/karaf/tooling/karaf-maven-plugin/3.0.1-SNAPSHOT/karaf-maven-plugin-3.0.1-SNAPSHOT.jar>
[INFO] 
[INFO] --- maven-invoker-plugin:1.6:run (integration-test) @ karaf-maven-plugin ---
[INFO] Building: test-basic-generation/pom.xml
[INFO] run script <https://builds.apache.org/job/karaf-3.0.x/org.apache.karaf.tooling$karaf-maven-plugin/ws/target/it/test-basic-generation/verify.bsh>
[INFO] ..SUCCESS (10.4 s)
[INFO] Building: test-kar-packaging/pom.xml
[INFO] run script <https://builds.apache.org/job/karaf-3.0.x/org.apache.karaf.tooling$karaf-maven-plugin/ws/target/it/test-kar-packaging/verify.bsh>
[INFO] ..SUCCESS (3.6 s)
[INFO] Building: test-aggregate-features/pom.xml
[INFO] run script <https://builds.apache.org/job/karaf-3.0.x/org.apache.karaf.tooling$karaf-maven-plugin/ws/target/it/test-aggregate-features/verify.bsh>
[INFO] ..SUCCESS (7.4 s)
[INFO] Building: test-recursive/pom.xml
[INFO] run script <https://builds.apache.org/job/karaf-3.0.x/org.apache.karaf.tooling$karaf-maven-plugin/ws/target/it/test-recursive/verify.bsh>
[INFO] ..SUCCESS (6.6 s)
[INFO] Building: test-check-dependencies-failure/pom.xml
[INFO] run script <https://builds.apache.org/job/karaf-3.0.x/org.apache.karaf.tooling$karaf-maven-plugin/ws/target/it/test-check-dependencies-failure/verify.bsh>
[INFO] ..FAILED (6.4 s)
[INFO]   The post-build script returned false.
[INFO] Building: test-kar-with-pom-packaging/pom.xml
[INFO] run script <https://builds.apache.org/job/karaf-3.0.x/org.apache.karaf.tooling$karaf-maven-plugin/ws/target/it/test-kar-with-pom-packaging/verify.bsh>
[INFO] ..SUCCESS (3.2 s)
[INFO] Building: test-check-dependencies/pom.xml
[INFO] run script <https://builds.apache.org/job/karaf-3.0.x/org.apache.karaf.tooling$karaf-maven-plugin/ws/target/it/test-check-dependencies/verify.bsh>
[INFO] ..SUCCESS (6.1 s)
[INFO] Building: test-type-classifier/pom.xml
[INFO] run script <https://builds.apache.org/job/karaf-3.0.x/org.apache.karaf.tooling$karaf-maven-plugin/ws/target/it/test-type-classifier/verify.bsh>
[INFO] ..SUCCESS (4.7 s)
[INFO] Building: test-input-file/pom.xml
[INFO] run script <https://builds.apache.org/job/karaf-3.0.x/org.apache.karaf.tooling$karaf-maven-plugin/ws/target/it/test-input-file/verify.bsh>
[INFO] ..SUCCESS (4.8 s)
[INFO] Building: test-kar-classifier/pom.xml
[INFO] run script <https://builds.apache.org/job/karaf-3.0.x/org.apache.karaf.tooling$karaf-maven-plugin/ws/target/it/test-kar-classifier/verify.bsh>
[INFO] ..SUCCESS (3.2 s)
[INFO] Building: test-kar-multiple-kars/pom.xml
[INFO] run script <https://builds.apache.org/job/karaf-3.0.x/org.apache.karaf.tooling$karaf-maven-plugin/ws/target/it/test-kar-multiple-kars/verify.bsh>
[INFO] ..SUCCESS (3.7 s)
[INFO] -------------------------------------------------
[INFO] Build Summary:
[INFO]   Passed: 10, Failed: 1, Errors: 0, Skipped: 0
[INFO] -------------------------------------------------
[ERROR] The following builds failed:
[ERROR] *  test-check-dependencies-failure/pom.xml
[INFO] -------------------------------------------------

Mime
View raw message