karaf-commits mailing list archives

Site index · List index
Message view « Date » · « Thread »
Top « Date » · « Thread »
From Apache Jenkins Server <jenk...@builds.apache.org>
Subject Build failed in Jenkins: karaf-master » Apache Karaf :: Archetypes :: Assembly Archetype #2469
Date Sun, 02 Mar 2014 00:30:29 GMT
See <https://builds.apache.org/job/karaf-master/org.apache.karaf.archetypes$karaf-assembly-archetype/2469/>

------------------------------------------
[INFO]                                                                         
[INFO] ------------------------------------------------------------------------
[INFO] Building Apache Karaf :: Archetypes :: Assembly Archetype 3.1.0-SNAPSHOT
[INFO] ------------------------------------------------------------------------
[INFO] 
[INFO] --- maven-clean-plugin:2.5:clean (default-clean) @ karaf-assembly-archetype ---
[INFO] Deleting <https://builds.apache.org/job/karaf-master/org.apache.karaf.archetypes$karaf-assembly-archetype/ws/target>
[INFO] 
[INFO] --- maven-enforcer-plugin:1.3.1:enforce (enforce-maven) @ karaf-assembly-archetype
---
[INFO] 
[INFO] --- maven-bundle-plugin:2.4.0:cleanVersions (cleanVersions) @ karaf-assembly-archetype
---
[INFO] 
[INFO] --- maven-remote-resources-plugin:1.5:process (default) @ karaf-assembly-archetype
---
[INFO] 
[INFO] --- maven-resources-plugin:2.6:resources (default-resources) @ karaf-assembly-archetype
---
[INFO] Using 'UTF-8' encoding to copy filtered resources.
[INFO] Copying 2 resources
[INFO] Copying 3 resources
[INFO] 
[INFO] --- maven-resources-plugin:2.6:testResources (default-testResources) @ karaf-assembly-archetype
---
[INFO] Using 'UTF-8' encoding to copy filtered resources.
[INFO] Copying 2 resources
[INFO] Copying 3 resources
[INFO] 
[INFO] --- maven-archetype-plugin:2.2:jar (default-jar) @ karaf-assembly-archetype ---
[INFO] Building archetype jar: <https://builds.apache.org/job/karaf-master/org.apache.karaf.archetypes$karaf-assembly-archetype/ws/target/karaf-assembly-archetype-3.1.0-SNAPSHOT>
[INFO] 
[INFO] --- maven-site-plugin:3.3:attach-descriptor (attach-descriptor) @ karaf-assembly-archetype
---
[INFO] 
[INFO] --- maven-archetype-plugin:2.2:integration-test (default-integration-test) @ karaf-assembly-archetype
---
[INFO] Processing Archetype IT project: assembly
[INFO] ----------------------------------------------------------------------------
[INFO] Using following parameters for creating project from Archetype: karaf-assembly-archetype:3.1.0-SNAPSHOT
[INFO] ----------------------------------------------------------------------------
[INFO] Parameter: groupId, Value: archetype.it
[INFO] Parameter: artifactId, Value: assembly
[INFO] Parameter: version, Value: 0.1-SNAPSHOT
[INFO] Parameter: package, Value: null
[INFO] Parameter: packageInPathFormat, Value: null
[INFO] Parameter: version, Value: 0.1-SNAPSHOT
[INFO] Parameter: groupId, Value: archetype.it
[INFO] Parameter: artifactId, Value: assembly
[INFO] project created from Archetype in dir: <https://builds.apache.org/job/karaf-master/org.apache.karaf.archetypes$karaf-assembly-archetype/ws/target/test-classes/projects/assembly/project/assembly>
[INFO] Invoking post-archetype-generation goals: clean install verify
[INFO] [INFO] Error stacktraces are turned on.
[INFO] [INFO] Scanning for projects...
[INFO] [INFO]                                                                         
[INFO] [INFO] ------------------------------------------------------------------------
[INFO] [INFO] Building assembly-feature 0.1-SNAPSHOT
[INFO] [INFO] ------------------------------------------------------------------------
[INFO] [INFO] 
[INFO] [INFO] --- maven-clean-plugin:2.4.1:clean (default-clean) @ assembly ---
[INFO] [INFO] 
[INFO] [INFO] --- maven-resources-plugin:2.6:resources (default-resources) @ assembly ---
[INFO] [WARNING] Using platform encoding (ANSI_X3.4-1968 actually) to copy filtered resources,
i.e. build is platform dependent!
[INFO] [INFO] skip non existing resourceDirectory /x1/jenkins/jenkins-slave/workspace/karaf-master/archetypes/assembly/target/test-classes/projects/assembly/project/assembly/src/main/resources
[INFO] [INFO] 
[INFO] [INFO] --- karaf-maven-plugin:3.1.0-SNAPSHOT:install-kars (default-install-kars) @
assembly ---
[INFO] [INFO] Installing feature file:/x1/jenkins/jenkins-slave/workspace/karaf-master/archetypes/assembly/target/test-classes/projects/assembly/project/assembly/target/assembly/system/org/apache/karaf/features/framework/3.1.0-SNAPSHOT/framework-3.1.0-SNAPSHOT-features.xml
to system and startup.properties
[INFO] [INFO] Adding feature repository to system: mvn:org.apache.karaf.features/standard/3.1.0-SNAPSHOT/xml/features
[INFO] [WARNING] could not resolve org.ops4j.pax.web:pax-web-features:xml:features:3.0.7-SNAPSHOT
[INFO] org.sonatype.aether.resolution.ArtifactResolutionException: Could not find artifact
org.ops4j.pax.web:pax-web-features:xml:features:3.0.7-SNAPSHOT
[INFO] 	at org.sonatype.aether.impl.internal.DefaultArtifactResolver.resolve(DefaultArtifactResolver.java:538)
[INFO] 	at org.sonatype.aether.impl.internal.DefaultArtifactResolver.resolveArtifacts(DefaultArtifactResolver.java:216)
[INFO] 	at org.sonatype.aether.impl.internal.DefaultArtifactResolver.resolveArtifact(DefaultArtifactResolver.java:193)
[INFO] 	at org.sonatype.aether.impl.internal.DefaultRepositorySystem.resolveArtifact(DefaultRepositorySystem.java:286)
[INFO] 	at org.apache.karaf.tooling.features.InstallKarsMojo.resolve(InstallKarsMojo.java:356)
[INFO] 	at org.apache.karaf.tooling.features.InstallKarsMojo$OfflineFeaturesService.addRepository(InstallKarsMojo.java:398)
[INFO] 	at org.apache.karaf.tooling.features.InstallKarsMojo.execute(InstallKarsMojo.java:261)
[INFO] 	at org.apache.maven.plugin.DefaultBuildPluginManager.executeMojo(DefaultBuildPluginManager.java:101)
[INFO] 	at org.apache.maven.lifecycle.internal.MojoExecutor.execute(MojoExecutor.java:209)
[INFO] 	at org.apache.maven.lifecycle.internal.MojoExecutor.execute(MojoExecutor.java:153)
[INFO] 	at org.apache.maven.lifecycle.internal.MojoExecutor.execute(MojoExecutor.java:145)
[INFO] 	at org.apache.maven.lifecycle.internal.LifecycleModuleBuilder.buildProject(LifecycleModuleBuilder.java:84)
[INFO] 	at org.apache.maven.lifecycle.internal.LifecycleModuleBuilder.buildProject(LifecycleModuleBuilder.java:59)
[INFO] 	at org.apache.maven.lifecycle.internal.LifecycleStarter.singleThreadedBuild(LifecycleStarter.java:183)
[INFO] 	at org.apache.maven.lifecycle.internal.LifecycleStarter.execute(LifecycleStarter.java:161)
[INFO] 	at org.apache.maven.DefaultMaven.doExecute(DefaultMaven.java:320)
[INFO] 	at org.apache.maven.DefaultMaven.execute(DefaultMaven.java:156)
[INFO] 	at org.apache.maven.cli.MavenCli.execute(MavenCli.java:537)
[INFO] 	at org.apache.maven.cli.MavenCli.doMain(MavenCli.java:196)
[INFO] 	at org.apache.maven.cli.MavenCli.main(MavenCli.java:141)
[INFO] 	at sun.reflect.NativeMethodAccessorImpl.invoke0(Native Method)
[INFO] 	at sun.reflect.NativeMethodAccessorImpl.invoke(NativeMethodAccessorImpl.java:57)
[INFO] 	at sun.reflect.DelegatingMethodAccessorImpl.invoke(DelegatingMethodAccessorImpl.java:43)
[INFO] 	at java.lang.reflect.Method.invoke(Method.java:606)
[INFO] 	at org.codehaus.plexus.classworlds.launcher.Launcher.launchEnhanced(Launcher.java:290)
[INFO] 	at org.codehaus.plexus.classworlds.launcher.Launcher.launch(Launcher.java:230)
[INFO] 	at org.codehaus.plexus.classworlds.launcher.Launcher.mainWithExitCode(Launcher.java:409)
[INFO] 	at org.codehaus.plexus.classworlds.launcher.Launcher.main(Launcher.java:352)
[INFO] Caused by: org.sonatype.aether.transfer.ArtifactNotFoundException: Could not find artifact
org.ops4j.pax.web:pax-web-features:xml:features:3.0.7-SNAPSHOT
[INFO] 	at org.sonatype.aether.impl.internal.DefaultArtifactResolver.resolve(DefaultArtifactResolver.java:528)
[INFO] 	... 27 more
[INFO] [INFO] ------------------------------------------------------------------------
[INFO] [INFO] BUILD FAILURE
[INFO] [INFO] ------------------------------------------------------------------------
[INFO] [INFO] Total time: 3.269s
[INFO] [INFO] Finished at: Sun Mar 02 00:29:53 UTC 2014
[INFO] [INFO] Final Memory: 15M/178M
[INFO] [INFO] ------------------------------------------------------------------------
[INFO] [ERROR] Failed to execute goal org.apache.karaf.tooling:karaf-maven-plugin:3.1.0-SNAPSHOT:install-kars
(default-install-kars) on project assembly: Could not unpack all dependencies:
[INFO] [ERROR] Could not install feature: org.apache.karaf.features:standard:xml:features:3.1.0-SNAPSHOT
[INFO] [ERROR] Couldn't resolve artifact org.ops4j.pax.web:pax-web-features:xml:features:3.0.7-SNAPSHOT
[INFO] [ERROR] -> [Help 1]
[INFO] org.apache.maven.lifecycle.LifecycleExecutionException: Failed to execute goal org.apache.karaf.tooling:karaf-maven-plugin:3.1.0-SNAPSHOT:install-kars
(default-install-kars) on project assembly: Could not unpack all dependencies:
[INFO] Could not install feature: org.apache.karaf.features:standard:xml:features:3.1.0-SNAPSHOT
[INFO] Couldn't resolve artifact org.ops4j.pax.web:pax-web-features:xml:features:3.0.7-SNAPSHOT
[INFO] 
[INFO] 
[INFO] 	at org.apache.maven.lifecycle.internal.MojoExecutor.execute(MojoExecutor.java:217)
[INFO] 	at org.apache.maven.lifecycle.internal.MojoExecutor.execute(MojoExecutor.java:153)
[INFO] 	at org.apache.maven.lifecycle.internal.MojoExecutor.execute(MojoExecutor.java:145)
[INFO] 	at org.apache.maven.lifecycle.internal.LifecycleModuleBuilder.buildProject(LifecycleModuleBuilder.java:84)
[INFO] 	at org.apache.maven.lifecycle.internal.LifecycleModuleBuilder.buildProject(LifecycleModuleBuilder.java:59)
[INFO] 	at org.apache.maven.lifecycle.internal.LifecycleStarter.singleThreadedBuild(LifecycleStarter.java:183)
[INFO] 	at org.apache.maven.lifecycle.internal.LifecycleStarter.execute(LifecycleStarter.java:161)
[INFO] 	at org.apache.maven.DefaultMaven.doExecute(DefaultMaven.java:320)
[INFO] 	at org.apache.maven.DefaultMaven.execute(DefaultMaven.java:156)
[INFO] 	at org.apache.maven.cli.MavenCli.execute(MavenCli.java:537)
[INFO] 	at org.apache.maven.cli.MavenCli.doMain(MavenCli.java:196)
[INFO] 	at org.apache.maven.cli.MavenCli.main(MavenCli.java:141)
[INFO] 	at sun.reflect.NativeMethodAccessorImpl.invoke0(Native Method)
[INFO] 	at sun.reflect.NativeMethodAccessorImpl.invoke(NativeMethodAccessorImpl.java:57)
[INFO] 	at sun.reflect.DelegatingMethodAccessorImpl.invoke(DelegatingMethodAccessorImpl.java:43)
[INFO] 	at java.lang.reflect.Method.invoke(Method.java:606)
[INFO] 	at org.codehaus.plexus.classworlds.launcher.Launcher.launchEnhanced(Launcher.java:290)
[INFO] 	at org.codehaus.plexus.classworlds.launcher.Launcher.launch(Launcher.java:230)
[INFO] 	at org.codehaus.plexus.classworlds.launcher.Launcher.mainWithExitCode(Launcher.java:409)
[INFO] 	at org.codehaus.plexus.classworlds.launcher.Launcher.main(Launcher.java:352)
[INFO] Caused by: org.apache.maven.plugin.MojoExecutionException: Could not unpack all dependencies:
[INFO] Could not install feature: org.apache.karaf.features:standard:xml:features:3.1.0-SNAPSHOT
[INFO] Couldn't resolve artifact org.ops4j.pax.web:pax-web-features:xml:features:3.0.7-SNAPSHOT
[INFO] 
[INFO] 
[INFO] 	at org.apache.karaf.tooling.features.InstallKarsMojo.execute(InstallKarsMojo.java:331)
[INFO] 	at org.apache.maven.plugin.DefaultBuildPluginManager.executeMojo(DefaultBuildPluginManager.java:101)
[INFO] 	at org.apache.maven.lifecycle.internal.MojoExecutor.execute(MojoExecutor.java:209)
[INFO] 	... 19 more
[INFO] [ERROR] 
[INFO] [ERROR] Re-run Maven using the -X switch to enable full debug logging.
[INFO] [ERROR] 
[INFO] [ERROR] For more information about the errors and possible solutions, please read the
following articles:
[INFO] [ERROR] [Help 1] http://cwiki.apache.org/confluence/display/MAVEN/MojoExecutionException
[INFO] Post-archetype-generation invoker exit code: 1
[JENKINS] Recording test results

Mime
View raw message