karaf-commits mailing list archives

Site index · List index
Message view « Date » · « Thread »
Top « Date » · « Thread »
From Apache Jenkins Server <jenk...@builds.apache.org>
Subject Build failed in Jenkins: karaf-master » Apache Karaf :: Tooling :: Maven Karaf Plugin #2498
Date Thu, 27 Mar 2014 03:08:12 GMT
See <https://builds.apache.org/job/karaf-master/org.apache.karaf.tooling$karaf-maven-plugin/2498/>

------------------------------------------
[...truncated 494 lines...]
Downloaded: http://repo.maven.apache.org/maven2/org/codehaus/plexus/plexus-interpolation/1.11/plexus-interpolation-1.11.jar
(50 KB at 975.3 KB/sec)
Downloading: http://repo.maven.apache.org/maven2/commons-logging/commons-logging/1.0.4/commons-logging-1.0.4.jar
Downloaded: http://repo.maven.apache.org/maven2/org/apache/maven/reporting/maven-reporting-impl/2.1/maven-reporting-impl-2.1.jar
(17 KB at 599.7 KB/sec)
Downloading: http://repo.maven.apache.org/maven2/org/apache/maven/plugin-tools/maven-plugin-tools-java/3.2/maven-plugin-tools-java-3.2.jar
Downloaded: http://repo.maven.apache.org/maven2/commons-digester/commons-digester/1.6/commons-digester-1.6.jar
(165 KB at 3290.0 KB/sec)
Downloading: http://repo.maven.apache.org/maven2/org/apache/maven/plugin-tools/maven-plugin-tools-beanshell/3.2/maven-plugin-tools-beanshell-3.2.jar
Downloaded: http://repo.maven.apache.org/maven2/org/apache/maven/plugin-tools/maven-plugin-tools-java/3.2/maven-plugin-tools-java-3.2.jar
(18 KB at 643.6 KB/sec)
Downloading: http://repo.maven.apache.org/maven2/bsh/bsh/1.3.0/bsh-1.3.0.jar
Downloaded: http://repo.maven.apache.org/maven2/org/apache/maven/plugin-tools/maven-plugin-tools-beanshell/3.2/maven-plugin-tools-beanshell-3.2.jar
(13 KB at 494.6 KB/sec)
Downloading: http://repo.maven.apache.org/maven2/org/apache/maven/plugin-tools/maven-plugin-tools-model/3.2/maven-plugin-tools-model-3.2.jar
Downloaded: http://repo.maven.apache.org/maven2/org/apache/maven/plugin-tools/maven-plugin-tools-model/3.2/maven-plugin-tools-model-3.2.jar
(32 KB at 1153.2 KB/sec)
Downloaded: http://repo.maven.apache.org/maven2/bsh/bsh/1.3.0/bsh-1.3.0.jar (237 KB at 3330.7
KB/sec)
Downloaded: http://repo.maven.apache.org/maven2/net/sf/jtidy/jtidy/r938/jtidy-r938.jar (245
KB at 586.7 KB/sec)
Downloaded: http://repo.maven.apache.org/maven2/commons-validator/commons-validator/1.2.0/commons-validator-1.2.0.jar
(89 KB at 178.7 KB/sec)
Downloaded: http://repo.maven.apache.org/maven2/commons-logging/commons-logging/1.0.4/commons-logging-1.0.4.jar
(38 KB at 56.9 KB/sec)
[INFO] Using 'UTF-8' encoding to read mojo metadata.
[INFO] Applying mojo extractor for language: java-annotations
[INFO] Mojo extractor for language: java-annotations found 0 mojo descriptors.
[INFO] Applying mojo extractor for language: java
[INFO] Mojo extractor for language: java found 8 mojo descriptors.
[INFO] Applying mojo extractor for language: bsh
[INFO] Mojo extractor for language: bsh found 0 mojo descriptors.
[INFO] 
[INFO] --- maven-remote-resources-plugin:1.5:process (default) @ karaf-maven-plugin ---
[INFO] 
[INFO] --- maven-resources-plugin:2.6:resources (default-resources) @ karaf-maven-plugin ---
[INFO] Using 'UTF-8' encoding to copy filtered resources.
[INFO] Copying 4 resources
[INFO] Copying 3 resources
[INFO] 
[INFO] --- maven-compiler-plugin:3.1:compile (default-compile) @ karaf-maven-plugin ---
[INFO] Changes detected - recompiling the module!
[INFO] Compiling 32 source files to <https://builds.apache.org/job/karaf-master/org.apache.karaf.tooling$karaf-maven-plugin/ws/target/classes>
[WARNING] <https://builds.apache.org/job/karaf-master/org.apache.karaf.tooling$karaf-maven-plugin/ws/src/main/java/org/apache/karaf/tooling/utils/MojoSupport.java>:
Some input files use or override a deprecated API.
[WARNING] <https://builds.apache.org/job/karaf-master/org.apache.karaf.tooling$karaf-maven-plugin/ws/src/main/java/org/apache/karaf/tooling/utils/MojoSupport.java>:
Recompile with -Xlint:deprecation for details.
[INFO] 
[INFO] --- maven-resources-plugin:2.6:testResources (default-testResources) @ karaf-maven-plugin
---
[INFO] Using 'UTF-8' encoding to copy filtered resources.
[INFO] Copying 3 resources
[INFO] Copying 3 resources
[INFO] 
[INFO] --- maven-compiler-plugin:3.1:testCompile (default-testCompile) @ karaf-maven-plugin
---
[INFO] Changes detected - recompiling the module!
[INFO] Compiling 6 source files to <https://builds.apache.org/job/karaf-master/org.apache.karaf.tooling$karaf-maven-plugin/ws/target/test-classes>
[INFO] 
[INFO] --- maven-surefire-plugin:2.16:test (default-test) @ karaf-maven-plugin ---
[INFO] Surefire report directory: <https://builds.apache.org/job/karaf-master/org.apache.karaf.tooling$karaf-maven-plugin/ws/target/surefire-reports>

-------------------------------------------------------
 T E S T S
-------------------------------------------------------
Running org.apache.karaf.tooling.features.BundleToArtifactTest
Tests run: 3, Failures: 0, Errors: 0, Skipped: 0, Time elapsed: 0.087 sec - in org.apache.karaf.tooling.features.BundleToArtifactTest
Running org.apache.karaf.tooling.features.MavenUtilTest
Tests run: 8, Failures: 0, Errors: 0, Skipped: 2, Time elapsed: 0.039 sec - in org.apache.karaf.tooling.features.MavenUtilTest
Running org.apache.karaf.tooling.features.ManifestUtilsTest
Tests run: 2, Failures: 0, Errors: 0, Skipped: 0, Time elapsed: 0.033 sec - in org.apache.karaf.tooling.features.ManifestUtilsTest
Running org.apache.karaf.tooling.features.GenerateDescriptorMojoTest
Tests run: 2, Failures: 0, Errors: 0, Skipped: 0, Time elapsed: 0.17 sec - in org.apache.karaf.tooling.features.GenerateDescriptorMojoTest
Running org.apache.karaf.tooling.features.AddToRepositoryMojoTest
Tests run: 1, Failures: 0, Errors: 0, Skipped: 0, Time elapsed: 0.011 sec - in org.apache.karaf.tooling.features.AddToRepositoryMojoTest
Running org.apache.karaf.tooling.features.FeatureMetaDataExporterTest
Tests run: 1, Failures: 0, Errors: 0, Skipped: 0, Time elapsed: 0.007 sec - in org.apache.karaf.tooling.features.FeatureMetaDataExporterTest

Results :

Tests run: 17, Failures: 0, Errors: 0, Skipped: 2

[JENKINS] Recording test results
[INFO] 
[INFO] --- maven-jar-plugin:2.4:jar (default-jar) @ karaf-maven-plugin ---
[INFO] Building jar: <https://builds.apache.org/job/karaf-master/org.apache.karaf.tooling$karaf-maven-plugin/ws/target/karaf-maven-plugin-4.0.0-SNAPSHOT.jar>
[INFO] 
[INFO] --- maven-plugin-plugin:3.2:addPluginArtifactMetadata (default-addPluginArtifactMetadata)
@ karaf-maven-plugin ---
[INFO] 
[INFO] --- maven-site-plugin:3.3:attach-descriptor (attach-descriptor) @ karaf-maven-plugin
---
[INFO] 
[INFO] --- maven-invoker-plugin:1.6:install (integration-test) @ karaf-maven-plugin ---
Downloading: http://repo.maven.apache.org/maven2/xmlunit/xmlunit/1.3/xmlunit-1.3.pom
Downloaded: http://repo.maven.apache.org/maven2/xmlunit/xmlunit/1.3/xmlunit-1.3.pom (3 KB
at 89.8 KB/sec)
Downloading: http://repo.maven.apache.org/maven2/org/codehaus/plexus/plexus-utils/1.5.6/plexus-utils-1.5.6.pom
Downloaded: http://repo.maven.apache.org/maven2/org/codehaus/plexus/plexus-utils/1.5.6/plexus-utils-1.5.6.pom
(6 KB at 178.5 KB/sec)
Downloading: http://repo.maven.apache.org/maven2/org/codehaus/plexus/plexus/1.0.12/plexus-1.0.12.pom
Downloaded: http://repo.maven.apache.org/maven2/org/codehaus/plexus/plexus/1.0.12/plexus-1.0.12.pom
(10 KB at 341.8 KB/sec)
Downloading: http://repo.maven.apache.org/maven2/org/apache/maven/maven-project/2.0.10/maven-project-2.0.10.pom
Downloaded: http://repo.maven.apache.org/maven2/org/apache/maven/maven-project/2.0.10/maven-project-2.0.10.pom
(3 KB at 95.9 KB/sec)
Downloading: http://repo.maven.apache.org/maven2/org/apache/maven/maven/2.0.10/maven-2.0.10.pom
Downloaded: http://repo.maven.apache.org/maven2/org/apache/maven/maven/2.0.10/maven-2.0.10.pom
(24 KB at 592.8 KB/sec)
Downloading: http://repo.maven.apache.org/maven2/org/apache/maven/maven-parent/9/maven-parent-9.pom
Downloaded: http://repo.maven.apache.org/maven2/org/apache/maven/maven-parent/9/maven-parent-9.pom
(33 KB at 801.7 KB/sec)
Downloading: http://repo.maven.apache.org/maven2/org/apache/maven/maven-settings/2.0.10/maven-settings-2.0.10.pom
Downloaded: http://repo.maven.apache.org/maven2/org/apache/maven/maven-settings/2.0.10/maven-settings-2.0.10.pom
(3 KB at 75.4 KB/sec)
Downloading: http://repo.maven.apache.org/maven2/org/apache/maven/maven-model/2.0.10/maven-model-2.0.10.pom
Downloaded: http://repo.maven.apache.org/maven2/org/apache/maven/maven-model/2.0.10/maven-model-2.0.10.pom
(4 KB at 112.3 KB/sec)
Downloading: http://repo.maven.apache.org/maven2/org/codehaus/plexus/plexus-interpolation/1.1/plexus-interpolation-1.1.pom
Downloaded: http://repo.maven.apache.org/maven2/org/codehaus/plexus/plexus-interpolation/1.1/plexus-interpolation-1.1.pom
(2 KB at 50.1 KB/sec)
Downloading: http://repo.maven.apache.org/maven2/org/apache/maven/maven-profile/2.0.10/maven-profile-2.0.10.pom
Downloaded: http://repo.maven.apache.org/maven2/org/apache/maven/maven-profile/2.0.10/maven-profile-2.0.10.pom
(3 KB at 73.0 KB/sec)
Downloading: http://repo.maven.apache.org/maven2/org/apache/maven/maven-artifact-manager/2.0.10/maven-artifact-manager-2.0.10.pom
Downloaded: http://repo.maven.apache.org/maven2/org/apache/maven/maven-artifact-manager/2.0.10/maven-artifact-manager-2.0.10.pom
(3 KB at 94.2 KB/sec)
Downloading: http://repo.maven.apache.org/maven2/org/apache/maven/maven-repository-metadata/2.0.10/maven-repository-metadata-2.0.10.pom
Downloaded: http://repo.maven.apache.org/maven2/org/apache/maven/maven-repository-metadata/2.0.10/maven-repository-metadata-2.0.10.pom
(3 KB at 78.0 KB/sec)
Downloading: http://repo.maven.apache.org/maven2/org/apache/maven/maven-artifact/2.0.10/maven-artifact-2.0.10.pom
Downloaded: http://repo.maven.apache.org/maven2/org/apache/maven/maven-artifact/2.0.10/maven-artifact-2.0.10.pom
(2 KB at 56.5 KB/sec)
Downloading: http://repo.maven.apache.org/maven2/org/apache/maven/maven-plugin-registry/2.0.10/maven-plugin-registry-2.0.10.pom
Downloaded: http://repo.maven.apache.org/maven2/org/apache/maven/maven-plugin-registry/2.0.10/maven-plugin-registry-2.0.10.pom
(2 KB at 70.3 KB/sec)
Downloading: http://repo.maven.apache.org/maven2/org/apache/maven/maven-plugin-api/2.0.10/maven-plugin-api-2.0.10.pom
Downloaded: http://repo.maven.apache.org/maven2/org/apache/maven/maven-plugin-api/2.0.10/maven-plugin-api-2.0.10.pom
(2 KB at 52.1 KB/sec)
Downloading: http://repo.maven.apache.org/maven2/org/codehaus/plexus/plexus-utils/1.5.12/plexus-utils-1.5.12.pom
Downloaded: http://repo.maven.apache.org/maven2/org/codehaus/plexus/plexus-utils/1.5.12/plexus-utils-1.5.12.pom
(6 KB at 189.7 KB/sec)
Downloading: http://repo.maven.apache.org/maven2/org/apache/maven/doxia/doxia-sink-api/1.1.4/doxia-sink-api-1.1.4.pom
Downloaded: http://repo.maven.apache.org/maven2/org/apache/maven/doxia/doxia-sink-api/1.1.4/doxia-sink-api-1.1.4.pom
(2 KB at 54.9 KB/sec)
Downloading: http://repo.maven.apache.org/maven2/org/apache/maven/doxia/doxia/1.1.4/doxia-1.1.4.pom
Downloaded: http://repo.maven.apache.org/maven2/org/apache/maven/doxia/doxia/1.1.4/doxia-1.1.4.pom
(19 KB at 658.3 KB/sec)
Downloading: http://repo.maven.apache.org/maven2/org/apache/maven/doxia/doxia-logging-api/1.1.4/doxia-logging-api-1.1.4.pom
Downloaded: http://repo.maven.apache.org/maven2/org/apache/maven/doxia/doxia-logging-api/1.1.4/doxia-logging-api-1.1.4.pom
(2 KB at 55.1 KB/sec)
Downloading: http://repo.maven.apache.org/maven2/org/apache/maven/doxia/doxia-site-renderer/1.1.4/doxia-site-renderer-1.1.4.pom
Downloaded: http://repo.maven.apache.org/maven2/org/apache/maven/doxia/doxia-site-renderer/1.1.4/doxia-site-renderer-1.1.4.pom
(6 KB at 213.4 KB/sec)
Downloading: http://repo.maven.apache.org/maven2/org/apache/maven/doxia/doxia-sitetools/1.1.4/doxia-sitetools-1.1.4.pom
Downloaded: http://repo.maven.apache.org/maven2/org/apache/maven/doxia/doxia-sitetools/1.1.4/doxia-sitetools-1.1.4.pom
(16 KB at 539.5 KB/sec)
Downloading: http://repo.maven.apache.org/maven2/org/apache/maven/doxia/doxia-core/1.1.4/doxia-core-1.1.4.pom
Downloaded: http://repo.maven.apache.org/maven2/org/apache/maven/doxia/doxia-core/1.1.4/doxia-core-1.1.4.pom
(4 KB at 129.8 KB/sec)
Downloading: http://repo.maven.apache.org/maven2/org/apache/maven/doxia/doxia-decoration-model/1.1.4/doxia-decoration-model-1.1.4.pom
Downloaded: http://repo.maven.apache.org/maven2/org/apache/maven/doxia/doxia-decoration-model/1.1.4/doxia-decoration-model-1.1.4.pom
(3 KB at 100.2 KB/sec)
Downloading: http://repo.maven.apache.org/maven2/org/apache/maven/doxia/doxia-module-xhtml/1.1.4/doxia-module-xhtml-1.1.4.pom
Downloaded: http://repo.maven.apache.org/maven2/org/apache/maven/doxia/doxia-module-xhtml/1.1.4/doxia-module-xhtml-1.1.4.pom
(2 KB at 55.9 KB/sec)
Downloading: http://repo.maven.apache.org/maven2/org/apache/maven/doxia/doxia-modules/1.1.4/doxia-modules-1.1.4.pom
Downloaded: http://repo.maven.apache.org/maven2/org/apache/maven/doxia/doxia-modules/1.1.4/doxia-modules-1.1.4.pom
(3 KB at 85.0 KB/sec)
Downloading: http://repo.maven.apache.org/maven2/org/apache/maven/doxia/doxia-module-fml/1.1.4/doxia-module-fml-1.1.4.pom
Downloaded: http://repo.maven.apache.org/maven2/org/apache/maven/doxia/doxia-module-fml/1.1.4/doxia-module-fml-1.1.4.pom
(6 KB at 191.3 KB/sec)
Downloading: http://repo.maven.apache.org/maven2/org/codehaus/groovy/groovy/1.8.6/groovy-1.8.6.pom
Downloaded: http://repo.maven.apache.org/maven2/org/codehaus/groovy/groovy/1.8.6/groovy-1.8.6.pom
(32 KB at 773.6 KB/sec)
Downloading: http://repo.maven.apache.org/maven2/org/codehaus/plexus/plexus-interpolation/1.2/plexus-interpolation-1.2.pom
Downloaded: http://repo.maven.apache.org/maven2/org/codehaus/plexus/plexus-interpolation/1.2/plexus-interpolation-1.2.pom
(3 KB at 101.4 KB/sec)
Downloading: http://repo.maven.apache.org/maven2/xmlunit/xmlunit/1.3/xmlunit-1.3.jar
Downloading: http://repo.maven.apache.org/maven2/org/apache/maven/doxia/doxia-core/1.1.2/doxia-core-1.1.2.jar
Downloading: http://repo.maven.apache.org/maven2/xerces/xercesImpl/2.8.1/xercesImpl-2.8.1.jar
Downloading: http://repo.maven.apache.org/maven2/commons-httpclient/commons-httpclient/3.1/commons-httpclient-3.1.jar
Downloading: http://repo.maven.apache.org/maven2/commons-codec/commons-codec/1.2/commons-codec-1.2.jar
Downloaded: http://repo.maven.apache.org/maven2/commons-codec/commons-codec/1.2/commons-codec-1.2.jar
(30 KB at 979.3 KB/sec)
Downloading: http://repo.maven.apache.org/maven2/org/apache/maven/doxia/doxia-sink-api/1.1.4/doxia-sink-api-1.1.4.jar
Downloaded: http://repo.maven.apache.org/maven2/org/apache/maven/doxia/doxia-sink-api/1.1.4/doxia-sink-api-1.1.4.jar
(13 KB at 442.4 KB/sec)
Downloading: http://repo.maven.apache.org/maven2/org/apache/maven/doxia/doxia-logging-api/1.1.4/doxia-logging-api-1.1.4.jar
Downloaded: http://repo.maven.apache.org/maven2/xmlunit/xmlunit/1.3/xmlunit-1.3.jar (95 KB
at 1476.3 KB/sec)
Downloading: http://repo.maven.apache.org/maven2/org/apache/maven/doxia/doxia-site-renderer/1.1.4/doxia-site-renderer-1.1.4.jar
Downloaded: http://repo.maven.apache.org/maven2/commons-httpclient/commons-httpclient/3.1/commons-httpclient-3.1.jar
(298 KB at 4582.3 KB/sec)
Downloading: http://repo.maven.apache.org/maven2/org/apache/maven/doxia/doxia-decoration-model/1.1.4/doxia-decoration-model-1.1.4.jar
Downloaded: http://repo.maven.apache.org/maven2/org/apache/maven/doxia/doxia-core/1.1.2/doxia-core-1.1.2.jar
(155 KB at 1776.9 KB/sec)
Downloading: http://repo.maven.apache.org/maven2/org/apache/maven/doxia/doxia-module-xhtml/1.1.4/doxia-module-xhtml-1.1.4.jar
Downloaded: http://repo.maven.apache.org/maven2/org/apache/maven/doxia/doxia-logging-api/1.1.4/doxia-logging-api-1.1.4.jar
(12 KB at 410.0 KB/sec)
Downloading: http://repo.maven.apache.org/maven2/org/apache/maven/doxia/doxia-module-fml/1.1.4/doxia-module-fml-1.1.4.jar
Downloaded: http://repo.maven.apache.org/maven2/org/apache/maven/doxia/doxia-decoration-model/1.1.4/doxia-decoration-model-1.1.4.jar
(52 KB at 1825.0 KB/sec)
Downloading: http://repo.maven.apache.org/maven2/org/codehaus/plexus/plexus-velocity/1.1.7/plexus-velocity-1.1.7.jar
Downloaded: http://repo.maven.apache.org/maven2/org/apache/maven/doxia/doxia-site-renderer/1.1.4/doxia-site-renderer-1.1.4.jar
(50 KB at 1239.7 KB/sec)
Downloading: http://repo.maven.apache.org/maven2/commons-collections/commons-collections/3.2/commons-collections-3.2.jar
Downloaded: http://repo.maven.apache.org/maven2/org/apache/maven/doxia/doxia-module-xhtml/1.1.4/doxia-module-xhtml-1.1.4.jar
(15 KB at 543.6 KB/sec)
Downloading: http://repo.maven.apache.org/maven2/org/codehaus/groovy/groovy/1.8.6/groovy-1.8.6.jar
Downloaded: http://repo.maven.apache.org/maven2/org/codehaus/plexus/plexus-velocity/1.1.7/plexus-velocity-1.1.7.jar
(8 KB at 277.3 KB/sec)
Downloading: http://repo.maven.apache.org/maven2/org/codehaus/plexus/plexus-interpolation/1.2/plexus-interpolation-1.2.jar
Downloaded: http://repo.maven.apache.org/maven2/org/apache/maven/doxia/doxia-module-fml/1.1.4/doxia-module-fml-1.1.4.jar
(37 KB at 961.5 KB/sec)
Downloaded: http://repo.maven.apache.org/maven2/org/codehaus/plexus/plexus-interpolation/1.2/plexus-interpolation-1.2.jar
(36 KB at 1250.4 KB/sec)
Downloaded: http://repo.maven.apache.org/maven2/xerces/xercesImpl/2.8.1/xercesImpl-2.8.1.jar
(1185 KB at 6617.5 KB/sec)
Downloaded: http://repo.maven.apache.org/maven2/commons-collections/commons-collections/3.2/commons-collections-3.2.jar
(558 KB at 2006.7 KB/sec)
Downloaded: http://repo.maven.apache.org/maven2/org/codehaus/groovy/groovy/1.8.6/groovy-1.8.6.jar
(5417 KB at 12309.3 KB/sec)
[INFO] Installing /home/jenkins/jenkins-slave/workspace/karaf-master/features/core/pom.xml
to <https://builds.apache.org/job/karaf-master/org.apache.karaf.tooling$karaf-maven-plugin/ws/target/system/org/apache/karaf/features/org.apache.karaf.features.core/4.0.0-SNAPSHOT/org.apache.karaf.features.core-4.0.0-SNAPSHOT.pom>
[INFO] Installing /home/jenkins/jenkins-slave/workspace/karaf-master/features/core/target/org.apache.karaf.features.core-4.0.0-SNAPSHOT.jar
to <https://builds.apache.org/job/karaf-master/org.apache.karaf.tooling$karaf-maven-plugin/ws/target/system/org/apache/karaf/features/org.apache.karaf.features.core/4.0.0-SNAPSHOT/org.apache.karaf.features.core-4.0.0-SNAPSHOT.jar>
[INFO] Installing /home/jenkins/jenkins-slave/workspace/karaf-master/features/core/pom.xml
to <https://builds.apache.org/job/karaf-master/org.apache.karaf.tooling$karaf-maven-plugin/ws/target/system/org/apache/karaf/features/org.apache.karaf.features.core/4.0.0-SNAPSHOT/org.apache.karaf.features.core-4.0.0-SNAPSHOT.pom>
[INFO] Installing /home/jenkins/jenkins-slave/workspace/karaf-master/features/pom.xml to <https://builds.apache.org/job/karaf-master/org.apache.karaf.tooling$karaf-maven-plugin/ws/target/system/org/apache/karaf/features/features/4.0.0-SNAPSHOT/features-4.0.0-SNAPSHOT.pom>
[INFO] Installing /home/jenkins/jenkins-slave/workspace/karaf-master/pom.xml to <https://builds.apache.org/job/karaf-master/org.apache.karaf.tooling$karaf-maven-plugin/ws/target/system/org/apache/karaf/karaf/4.0.0-SNAPSHOT/karaf-4.0.0-SNAPSHOT.pom>
[INFO] Installing /home/jenkins/jenkins-slave/workspace/karaf-master/deployer/spring/pom.xml
to <https://builds.apache.org/job/karaf-master/org.apache.karaf.tooling$karaf-maven-plugin/ws/target/system/org/apache/karaf/deployer/org.apache.karaf.deployer.spring/4.0.0-SNAPSHOT/org.apache.karaf.deployer.spring-4.0.0-SNAPSHOT.pom>
[INFO] Installing /home/jenkins/jenkins-slave/workspace/karaf-master/deployer/spring/target/org.apache.karaf.deployer.spring-4.0.0-SNAPSHOT.jar
to <https://builds.apache.org/job/karaf-master/org.apache.karaf.tooling$karaf-maven-plugin/ws/target/system/org/apache/karaf/deployer/org.apache.karaf.deployer.spring/4.0.0-SNAPSHOT/org.apache.karaf.deployer.spring-4.0.0-SNAPSHOT.jar>
[INFO] Installing /home/jenkins/jenkins-slave/workspace/karaf-master/deployer/spring/pom.xml
to <https://builds.apache.org/job/karaf-master/org.apache.karaf.tooling$karaf-maven-plugin/ws/target/system/org/apache/karaf/deployer/org.apache.karaf.deployer.spring/4.0.0-SNAPSHOT/org.apache.karaf.deployer.spring-4.0.0-SNAPSHOT.pom>
[INFO] Installing /home/jenkins/jenkins-slave/workspace/karaf-master/deployer/pom.xml to <https://builds.apache.org/job/karaf-master/org.apache.karaf.tooling$karaf-maven-plugin/ws/target/system/org/apache/karaf/deployer/deployer/4.0.0-SNAPSHOT/deployer-4.0.0-SNAPSHOT.pom>
[INFO] Installing /home/jenkins/jenkins-slave/workspace/karaf-master/deployer/blueprint/pom.xml
to <https://builds.apache.org/job/karaf-master/org.apache.karaf.tooling$karaf-maven-plugin/ws/target/system/org/apache/karaf/deployer/org.apache.karaf.deployer.blueprint/4.0.0-SNAPSHOT/org.apache.karaf.deployer.blueprint-4.0.0-SNAPSHOT.pom>
[INFO] Installing /home/jenkins/jenkins-slave/workspace/karaf-master/deployer/blueprint/target/org.apache.karaf.deployer.blueprint-4.0.0-SNAPSHOT.jar
to <https://builds.apache.org/job/karaf-master/org.apache.karaf.tooling$karaf-maven-plugin/ws/target/system/org/apache/karaf/deployer/org.apache.karaf.deployer.blueprint/4.0.0-SNAPSHOT/org.apache.karaf.deployer.blueprint-4.0.0-SNAPSHOT.jar>
[INFO] Installing /home/jenkins/jenkins-slave/workspace/karaf-master/deployer/blueprint/pom.xml
to <https://builds.apache.org/job/karaf-master/org.apache.karaf.tooling$karaf-maven-plugin/ws/target/system/org/apache/karaf/deployer/org.apache.karaf.deployer.blueprint/4.0.0-SNAPSHOT/org.apache.karaf.deployer.blueprint-4.0.0-SNAPSHOT.pom>
[INFO] Installing /home/jenkins/jenkins-slave/workspace/karaf-master/deployer/features/pom.xml
to <https://builds.apache.org/job/karaf-master/org.apache.karaf.tooling$karaf-maven-plugin/ws/target/system/org/apache/karaf/deployer/org.apache.karaf.deployer.features/4.0.0-SNAPSHOT/org.apache.karaf.deployer.features-4.0.0-SNAPSHOT.pom>
[INFO] Installing /home/jenkins/jenkins-slave/workspace/karaf-master/deployer/features/target/org.apache.karaf.deployer.features-4.0.0-SNAPSHOT.jar
to <https://builds.apache.org/job/karaf-master/org.apache.karaf.tooling$karaf-maven-plugin/ws/target/system/org/apache/karaf/deployer/org.apache.karaf.deployer.features/4.0.0-SNAPSHOT/org.apache.karaf.deployer.features-4.0.0-SNAPSHOT.jar>
[INFO] Installing /home/jenkins/jenkins-slave/workspace/karaf-master/deployer/features/pom.xml
to <https://builds.apache.org/job/karaf-master/org.apache.karaf.tooling$karaf-maven-plugin/ws/target/system/org/apache/karaf/deployer/org.apache.karaf.deployer.features/4.0.0-SNAPSHOT/org.apache.karaf.deployer.features-4.0.0-SNAPSHOT.pom>
[INFO] Installing /home/jenkins/jenkins-slave/workspace/karaf-master/deployer/kar/pom.xml
to <https://builds.apache.org/job/karaf-master/org.apache.karaf.tooling$karaf-maven-plugin/ws/target/system/org/apache/karaf/deployer/org.apache.karaf.deployer.kar/4.0.0-SNAPSHOT/org.apache.karaf.deployer.kar-4.0.0-SNAPSHOT.pom>
[INFO] Installing /home/jenkins/jenkins-slave/workspace/karaf-master/deployer/kar/target/org.apache.karaf.deployer.kar-4.0.0-SNAPSHOT.jar
to <https://builds.apache.org/job/karaf-master/org.apache.karaf.tooling$karaf-maven-plugin/ws/target/system/org/apache/karaf/deployer/org.apache.karaf.deployer.kar/4.0.0-SNAPSHOT/org.apache.karaf.deployer.kar-4.0.0-SNAPSHOT.jar>
[INFO] Installing /home/jenkins/jenkins-slave/workspace/karaf-master/deployer/kar/pom.xml
to <https://builds.apache.org/job/karaf-master/org.apache.karaf.tooling$karaf-maven-plugin/ws/target/system/org/apache/karaf/deployer/org.apache.karaf.deployer.kar/4.0.0-SNAPSHOT/org.apache.karaf.deployer.kar-4.0.0-SNAPSHOT.pom>
[INFO] Installing /home/jenkins/jenkins-slave/workspace/karaf-master/kar/core/pom.xml to <https://builds.apache.org/job/karaf-master/org.apache.karaf.tooling$karaf-maven-plugin/ws/target/system/org/apache/karaf/kar/org.apache.karaf.kar.core/4.0.0-SNAPSHOT/org.apache.karaf.kar.core-4.0.0-SNAPSHOT.pom>
[INFO] Installing /home/jenkins/jenkins-slave/workspace/karaf-master/kar/core/target/org.apache.karaf.kar.core-4.0.0-SNAPSHOT.jar
to <https://builds.apache.org/job/karaf-master/org.apache.karaf.tooling$karaf-maven-plugin/ws/target/system/org/apache/karaf/kar/org.apache.karaf.kar.core/4.0.0-SNAPSHOT/org.apache.karaf.kar.core-4.0.0-SNAPSHOT.jar>
[INFO] Installing /home/jenkins/jenkins-slave/workspace/karaf-master/kar/core/pom.xml to <https://builds.apache.org/job/karaf-master/org.apache.karaf.tooling$karaf-maven-plugin/ws/target/system/org/apache/karaf/kar/org.apache.karaf.kar.core/4.0.0-SNAPSHOT/org.apache.karaf.kar.core-4.0.0-SNAPSHOT.pom>
[INFO] Installing /home/jenkins/jenkins-slave/workspace/karaf-master/kar/pom.xml to <https://builds.apache.org/job/karaf-master/org.apache.karaf.tooling$karaf-maven-plugin/ws/target/system/org/apache/karaf/kar/kar/4.0.0-SNAPSHOT/kar-4.0.0-SNAPSHOT.pom>
[INFO] Installing /home/jenkins/jenkins-slave/workspace/karaf-master/shell/console/pom.xml
to <https://builds.apache.org/job/karaf-master/org.apache.karaf.tooling$karaf-maven-plugin/ws/target/system/org/apache/karaf/shell/org.apache.karaf.shell.console/4.0.0-SNAPSHOT/org.apache.karaf.shell.console-4.0.0-SNAPSHOT.pom>
[INFO] Installing /home/jenkins/jenkins-slave/workspace/karaf-master/shell/console/target/org.apache.karaf.shell.console-4.0.0-SNAPSHOT.jar
to <https://builds.apache.org/job/karaf-master/org.apache.karaf.tooling$karaf-maven-plugin/ws/target/system/org/apache/karaf/shell/org.apache.karaf.shell.console/4.0.0-SNAPSHOT/org.apache.karaf.shell.console-4.0.0-SNAPSHOT.jar>
[INFO] Installing /home/jenkins/jenkins-slave/workspace/karaf-master/shell/console/pom.xml
to <https://builds.apache.org/job/karaf-master/org.apache.karaf.tooling$karaf-maven-plugin/ws/target/system/org/apache/karaf/shell/org.apache.karaf.shell.console/4.0.0-SNAPSHOT/org.apache.karaf.shell.console-4.0.0-SNAPSHOT.pom>
[INFO] Installing /home/jenkins/jenkins-slave/workspace/karaf-master/shell/pom.xml to <https://builds.apache.org/job/karaf-master/org.apache.karaf.tooling$karaf-maven-plugin/ws/target/system/org/apache/karaf/shell/shell/4.0.0-SNAPSHOT/shell-4.0.0-SNAPSHOT.pom>
[INFO] Installing /home/jenkins/jenkins-slave/workspace/karaf-master/jaas/modules/pom.xml
to <https://builds.apache.org/job/karaf-master/org.apache.karaf.tooling$karaf-maven-plugin/ws/target/system/org/apache/karaf/jaas/org.apache.karaf.jaas.modules/4.0.0-SNAPSHOT/org.apache.karaf.jaas.modules-4.0.0-SNAPSHOT.pom>
[INFO] Installing /home/jenkins/jenkins-slave/workspace/karaf-master/jaas/modules/target/org.apache.karaf.jaas.modules-4.0.0-SNAPSHOT.jar
to <https://builds.apache.org/job/karaf-master/org.apache.karaf.tooling$karaf-maven-plugin/ws/target/system/org/apache/karaf/jaas/org.apache.karaf.jaas.modules/4.0.0-SNAPSHOT/org.apache.karaf.jaas.modules-4.0.0-SNAPSHOT.jar>
[INFO] Installing /home/jenkins/jenkins-slave/workspace/karaf-master/jaas/modules/pom.xml
to <https://builds.apache.org/job/karaf-master/org.apache.karaf.tooling$karaf-maven-plugin/ws/target/system/org/apache/karaf/jaas/org.apache.karaf.jaas.modules/4.0.0-SNAPSHOT/org.apache.karaf.jaas.modules-4.0.0-SNAPSHOT.pom>
[INFO] Installing /home/jenkins/jenkins-slave/workspace/karaf-master/jaas/pom.xml to <https://builds.apache.org/job/karaf-master/org.apache.karaf.tooling$karaf-maven-plugin/ws/target/system/org/apache/karaf/jaas/jaas/4.0.0-SNAPSHOT/jaas-4.0.0-SNAPSHOT.pom>
[INFO] Installing /home/jenkins/jenkins-slave/workspace/karaf-master/jaas/config/pom.xml to
<https://builds.apache.org/job/karaf-master/org.apache.karaf.tooling$karaf-maven-plugin/ws/target/system/org/apache/karaf/jaas/org.apache.karaf.jaas.config/4.0.0-SNAPSHOT/org.apache.karaf.jaas.config-4.0.0-SNAPSHOT.pom>
[INFO] Installing /home/jenkins/jenkins-slave/workspace/karaf-master/jaas/config/target/org.apache.karaf.jaas.config-4.0.0-SNAPSHOT.jar
to <https://builds.apache.org/job/karaf-master/org.apache.karaf.tooling$karaf-maven-plugin/ws/target/system/org/apache/karaf/jaas/org.apache.karaf.jaas.config/4.0.0-SNAPSHOT/org.apache.karaf.jaas.config-4.0.0-SNAPSHOT.jar>
[INFO] Installing /home/jenkins/jenkins-slave/workspace/karaf-master/jaas/config/pom.xml to
<https://builds.apache.org/job/karaf-master/org.apache.karaf.tooling$karaf-maven-plugin/ws/target/system/org/apache/karaf/jaas/org.apache.karaf.jaas.config/4.0.0-SNAPSHOT/org.apache.karaf.jaas.config-4.0.0-SNAPSHOT.pom>
[INFO] Installing /home/jenkins/jenkins-slave/workspace/karaf-master/jaas/boot/pom.xml to
<https://builds.apache.org/job/karaf-master/org.apache.karaf.tooling$karaf-maven-plugin/ws/target/system/org/apache/karaf/jaas/org.apache.karaf.jaas.boot/4.0.0-SNAPSHOT/org.apache.karaf.jaas.boot-4.0.0-SNAPSHOT.pom>
[INFO] Installing /home/jenkins/jenkins-slave/workspace/karaf-master/jaas/boot/target/org.apache.karaf.jaas.boot-4.0.0-SNAPSHOT.jar
to <https://builds.apache.org/job/karaf-master/org.apache.karaf.tooling$karaf-maven-plugin/ws/target/system/org/apache/karaf/jaas/org.apache.karaf.jaas.boot/4.0.0-SNAPSHOT/org.apache.karaf.jaas.boot-4.0.0-SNAPSHOT.jar>
[INFO] Installing /home/jenkins/jenkins-slave/workspace/karaf-master/jaas/boot/pom.xml to
<https://builds.apache.org/job/karaf-master/org.apache.karaf.tooling$karaf-maven-plugin/ws/target/system/org/apache/karaf/jaas/org.apache.karaf.jaas.boot/4.0.0-SNAPSHOT/org.apache.karaf.jaas.boot-4.0.0-SNAPSHOT.pom>
[INFO] Installing /home/jenkins/jenkins-slave/workspace/karaf-master/shell/core/pom.xml to
<https://builds.apache.org/job/karaf-master/org.apache.karaf.tooling$karaf-maven-plugin/ws/target/system/org/apache/karaf/shell/org.apache.karaf.shell.core/4.0.0-SNAPSHOT/org.apache.karaf.shell.core-4.0.0-SNAPSHOT.pom>
[INFO] Installing /home/jenkins/jenkins-slave/workspace/karaf-master/shell/core/target/org.apache.karaf.shell.core-4.0.0-SNAPSHOT.jar
to <https://builds.apache.org/job/karaf-master/org.apache.karaf.tooling$karaf-maven-plugin/ws/target/system/org/apache/karaf/shell/org.apache.karaf.shell.core/4.0.0-SNAPSHOT/org.apache.karaf.shell.core-4.0.0-SNAPSHOT.jar>
[INFO] Installing /home/jenkins/jenkins-slave/workspace/karaf-master/shell/core/pom.xml to
<https://builds.apache.org/job/karaf-master/org.apache.karaf.tooling$karaf-maven-plugin/ws/target/system/org/apache/karaf/shell/org.apache.karaf.shell.core/4.0.0-SNAPSHOT/org.apache.karaf.shell.core-4.0.0-SNAPSHOT.pom>
[INFO] Installing /home/jenkins/jenkins-slave/workspace/karaf-master/tooling/pom.xml to <https://builds.apache.org/job/karaf-master/org.apache.karaf.tooling$karaf-maven-plugin/ws/target/system/org/apache/karaf/tooling/tooling/4.0.0-SNAPSHOT/tooling-4.0.0-SNAPSHOT.pom>
[INFO] Installing <https://builds.apache.org/job/karaf-master/org.apache.karaf.tooling$karaf-maven-plugin/ws/pom.xml>
to <https://builds.apache.org/job/karaf-master/org.apache.karaf.tooling$karaf-maven-plugin/ws/target/system/org/apache/karaf/tooling/karaf-maven-plugin/4.0.0-SNAPSHOT/karaf-maven-plugin-4.0.0-SNAPSHOT.pom>
[INFO] Installing <https://builds.apache.org/job/karaf-master/org.apache.karaf.tooling$karaf-maven-plugin/ws/target/karaf-maven-plugin-4.0.0-SNAPSHOT.jar>
to <https://builds.apache.org/job/karaf-master/org.apache.karaf.tooling$karaf-maven-plugin/ws/target/system/org/apache/karaf/tooling/karaf-maven-plugin/4.0.0-SNAPSHOT/karaf-maven-plugin-4.0.0-SNAPSHOT.jar>
[INFO] 
[INFO] --- maven-invoker-plugin:1.6:run (integration-test) @ karaf-maven-plugin ---
[INFO] Building: test-basic-generation/pom.xml
[INFO] run script <https://builds.apache.org/job/karaf-master/org.apache.karaf.tooling$karaf-maven-plugin/ws/target/it/test-basic-generation/verify.bsh>
[INFO] ..SUCCESS (13.2 s)
[INFO] Building: test-kar-packaging/pom.xml
[INFO] run script <https://builds.apache.org/job/karaf-master/org.apache.karaf.tooling$karaf-maven-plugin/ws/target/it/test-kar-packaging/verify.bsh>
[INFO] ..SUCCESS (3.6 s)
[INFO] Building: test-aggregate-features/pom.xml
[INFO] run script <https://builds.apache.org/job/karaf-master/org.apache.karaf.tooling$karaf-maven-plugin/ws/target/it/test-aggregate-features/verify.bsh>
[INFO] ..SUCCESS (10.8 s)
[INFO] Building: test-recursive/pom.xml
[INFO] run script <https://builds.apache.org/job/karaf-master/org.apache.karaf.tooling$karaf-maven-plugin/ws/target/it/test-recursive/verify.bsh>
[INFO] ..SUCCESS (5.8 s)
[INFO] Building: test-check-dependencies-failure/pom.xml
[INFO] run script <https://builds.apache.org/job/karaf-master/org.apache.karaf.tooling$karaf-maven-plugin/ws/target/it/test-check-dependencies-failure/verify.bsh>
[INFO] ..FAILED (6.2 s)
[INFO]   The post-build script returned false.
[INFO] Building: test-kar-with-pom-packaging/pom.xml
[INFO] run script <https://builds.apache.org/job/karaf-master/org.apache.karaf.tooling$karaf-maven-plugin/ws/target/it/test-kar-with-pom-packaging/verify.bsh>
[INFO] ..SUCCESS (3.2 s)
[INFO] Building: test-check-dependencies/pom.xml
[INFO] run script <https://builds.apache.org/job/karaf-master/org.apache.karaf.tooling$karaf-maven-plugin/ws/target/it/test-check-dependencies/verify.bsh>
[INFO] ..SUCCESS (6.3 s)
[INFO] Building: test-type-classifier/pom.xml
[INFO] run script <https://builds.apache.org/job/karaf-master/org.apache.karaf.tooling$karaf-maven-plugin/ws/target/it/test-type-classifier/verify.bsh>
[INFO] ..SUCCESS (4.7 s)
[INFO] Building: test-input-file/pom.xml
[INFO] run script <https://builds.apache.org/job/karaf-master/org.apache.karaf.tooling$karaf-maven-plugin/ws/target/it/test-input-file/verify.bsh>
[INFO] ..SUCCESS (4.8 s)
[INFO] Building: test-kar-classifier/pom.xml
[INFO] run script <https://builds.apache.org/job/karaf-master/org.apache.karaf.tooling$karaf-maven-plugin/ws/target/it/test-kar-classifier/verify.bsh>
[INFO] ..SUCCESS (3.2 s)
[INFO] Building: test-kar-multiple-kars/pom.xml
[INFO] run script <https://builds.apache.org/job/karaf-master/org.apache.karaf.tooling$karaf-maven-plugin/ws/target/it/test-kar-multiple-kars/verify.bsh>
[INFO] ..SUCCESS (3.4 s)
[INFO] -------------------------------------------------
[INFO] Build Summary:
[INFO]   Passed: 10, Failed: 1, Errors: 0, Skipped: 0
[INFO] -------------------------------------------------
[ERROR] The following builds failed:
[ERROR] *  test-check-dependencies-failure/pom.xml
[INFO] -------------------------------------------------

Mime
View raw message