karaf-commits mailing list archives

Site index · List index
Message view « Date » · « Thread »
Top « Date » · « Thread »
From Apache Jenkins Server <jenk...@builds.apache.org>
Subject Build failed in Jenkins: Karaf-2.3.x #1008
Date Tue, 05 Nov 2013 10:36:07 GMT
See <https://builds.apache.org/job/Karaf-2.3.x/1008/>

------------------------------------------
[...truncated 5414 lines...]
[INFO] Apache Karaf :: Web Console :: Branding ........... SKIPPED
[INFO] Apache Karaf :: Web Console :: Features Plugin .... SKIPPED
[INFO] Apache Karaf :: Web Console :: Gogo Plugin ........ SKIPPED
[INFO] Apache Karaf :: Web Console :: Admin Plugin ....... SKIPPED
[INFO] Apache Karaf :: Exception ......................... SKIPPED
[INFO] Apache Karaf :: Assemblies ........................ SKIPPED
[INFO] Apache Karaf :: Assemblies :: Features ............ SKIPPED
[INFO] Apache Karaf :: Assemblies :: Features :: Standard  SKIPPED
[INFO] Apache Karaf :: Assemblies :: Features :: Enterprise  SKIPPED
[INFO] Apache Karaf :: Diagnostic ........................ SKIPPED
[INFO] Apache Karaf :: Diagnostic :: Core ................ SKIPPED
[INFO] Apache Karaf :: Diagnostic :: Common .............. SKIPPED
[INFO] Apache Karaf :: Diagnostic :: Command ............. SKIPPED
[INFO] Apache Karaf :: Diagnostic :: Management .......... SKIPPED
[INFO] Apache Karaf :: Tooling ........................... SKIPPED
[INFO] Apache Karaf :: Tooling :: Maven2 Features plugin . SKIPPED
[INFO] Apache Karaf :: Assembly .......................... SKIPPED
[INFO] Apache Karaf :: Demos ............................. SKIPPED
[INFO] Apache Karaf :: Demos :: Web ...................... SKIPPED
[INFO] Apache Karaf :: Demos :: Branding ................. SKIPPED
[INFO] Apache Karaf :: Demos :: Branding :: Shell ........ SKIPPED
[INFO] Apache Karaf :: Demos :: Demo Dump provider ....... SKIPPED
[INFO] Apache Karaf :: Demos :: Extend Console Command ... SKIPPED
[INFO] Apache Karaf :: Demos :: Deployer ................. SKIPPED
[INFO] Apache Karaf :: Demos :: Deployer :: Kar .......... SKIPPED
[INFO] Apache Karaf :: Demos :: Deployer :: Wrap Bundle osgi.commons-lang  SKIPPED
[INFO] Apache Karaf :: Demos :: Deployer :: Bundle ....... SKIPPED
[INFO] Apache Karaf :: Demos :: Deployer :: Feature ...... SKIPPED
[INFO] Apache Karaf :: Tooling :: Maven2 Command Help plugin  SKIPPED
[INFO] Apache Karaf :: Tooling :: Exam Testing Framework . SKIPPED
[INFO] Apache Karaf :: Tooling :: Exam Testing Framework :: Options  SKIPPED
[INFO] Apache Karaf :: Tooling :: Exam Testing Framework :: Container  SKIPPED
[INFO] Apache Karaf :: Archetypes ........................ SKIPPED
[INFO] Apache Karaf :: Archetypes :: Assembly Archetype .. SKIPPED
[INFO] Apache Karaf :: Archetypes :: Blueprint Archetype . SKIPPED
[INFO] Apache Karaf :: Archetypes :: Bundle Archetype .... SKIPPED
[INFO] Apache Karaf :: Archetypes :: Command Archetype ... SKIPPED
[INFO] Apache Karaf :: Archetypes :: Feature Archetype ... SKIPPED
[INFO] Apache Karaf :: Archetypes :: Kar Archetype ....... SKIPPED
[INFO] Apache Karaf :: Integration Tests ................. SKIPPED
[INFO] ------------------------------------------------------------------------
[INFO] BUILD FAILURE
[INFO] ------------------------------------------------------------------------
[INFO] Total time: 39:21.234s
[INFO] Finished at: Tue Nov 05 09:58:01 UTC 2013
[INFO] Final Memory: 48M/268M
[INFO] ------------------------------------------------------------------------
Waiting for Jenkins to finish collecting data
[ERROR] Failed to execute goal org.apache.maven.plugins:maven-deploy-plugin:2.7:deploy (default-deploy)
on project org.apache.karaf.features.management: Failed to retrieve remote metadata org.apache.karaf.features:org.apache.karaf.features.management:2.3.4-SNAPSHOT/maven-metadata.xml:
Could not transfer metadata org.apache.karaf.features:org.apache.karaf.features.management:2.3.4-SNAPSHOT/maven-metadata.xml
from/to apache.snapshots.https (https://repository.apache.org/content/repositories/snapshots):
Connection to https://repository.apache.org refused: Connection timed out -> [Help 1]
org.apache.maven.lifecycle.LifecycleExecutionException: Failed to execute goal org.apache.maven.plugins:maven-deploy-plugin:2.7:deploy
(default-deploy) on project org.apache.karaf.features.management: Failed to retrieve remote
metadata org.apache.karaf.features:org.apache.karaf.features.management:2.3.4-SNAPSHOT/maven-metadata.xml:
Could not transfer metadata org.apache.karaf.features:org.apache.karaf.features.management:2.3.4-SNAPSHOT/maven-metadata.xml
from/to apache.snapshots.https (https://repository.apache.org/content/repositories/snapshots):
Connection to https://repository.apache.org refused
	at org.apache.maven.lifecycle.internal.MojoExecutor.execute(MojoExecutor.java:217)
	at org.apache.maven.lifecycle.internal.MojoExecutor.execute(MojoExecutor.java:153)
	at org.apache.maven.lifecycle.internal.MojoExecutor.execute(MojoExecutor.java:145)
	at org.apache.maven.lifecycle.internal.LifecycleModuleBuilder.buildProject(LifecycleModuleBuilder.java:84)
	at org.apache.maven.lifecycle.internal.LifecycleModuleBuilder.buildProject(LifecycleModuleBuilder.java:59)
	at org.apache.maven.lifecycle.internal.LifecycleStarter.singleThreadedBuild(LifecycleStarter.java:183)
	at org.apache.maven.lifecycle.internal.LifecycleStarter.execute(LifecycleStarter.java:161)
	at org.apache.maven.DefaultMaven.doExecute(DefaultMaven.java:320)
	at org.apache.maven.DefaultMaven.execute(DefaultMaven.java:156)
	at org.jvnet.hudson.maven3.launcher.Maven3Launcher.main(Maven3Launcher.java:117)
	at sun.reflect.NativeMethodAccessorImpl.invoke0(Native Method)
	at sun.reflect.NativeMethodAccessorImpl.invoke(NativeMethodAccessorImpl.java:39)
	at sun.reflect.DelegatingMethodAccessorImpl.invoke(DelegatingMethodAccessorImpl.java:25)
	at java.lang.reflect.Method.invoke(Method.java:597)
	at org.codehaus.plexus.classworlds.launcher.Launcher.launchStandard(Launcher.java:329)
	at org.codehaus.plexus.classworlds.launcher.Launcher.launch(Launcher.java:239)
	at org.jvnet.hudson.maven3.agent.Maven3Main.launch(Maven3Main.java:178)
	at sun.reflect.NativeMethodAccessorImpl.invoke0(Native Method)
	at sun.reflect.NativeMethodAccessorImpl.invoke(NativeMethodAccessorImpl.java:39)
	at sun.reflect.DelegatingMethodAccessorImpl.invoke(DelegatingMethodAccessorImpl.java:25)
	at java.lang.reflect.Method.invoke(Method.java:597)
	at hudson.maven.Maven3Builder.call(Maven3Builder.java:134)
	at hudson.maven.Maven3Builder.call(Maven3Builder.java:69)
	at hudson.remoting.UserRequest.perform(UserRequest.java:118)
	at hudson.remoting.UserRequest.perform(UserRequest.java:48)
	at hudson.remoting.Request$2.run(Request.java:326)
	at hudson.remoting.InterceptingExecutorService$1.call(InterceptingExecutorService.java:72)
	at java.util.concurrent.FutureTask$Sync.innerRun(FutureTask.java:303)
	at java.util.concurrent.FutureTask.run(FutureTask.java:138)
	at java.util.concurrent.ThreadPoolExecutor$Worker.runTask(ThreadPoolExecutor.java:895)
	at java.util.concurrent.ThreadPoolExecutor$Worker.run(ThreadPoolExecutor.java:918)
	at java.lang.Thread.run(Thread.java:662)
Caused by: org.apache.maven.plugin.MojoExecutionException: Failed to retrieve remote metadata
org.apache.karaf.features:org.apache.karaf.features.management:2.3.4-SNAPSHOT/maven-metadata.xml:
Could not transfer metadata org.apache.karaf.features:org.apache.karaf.features.management:2.3.4-SNAPSHOT/maven-metadata.xml
from/to apache.snapshots.https (https://repository.apache.org/content/repositories/snapshots):
Connection to https://repository.apache.org refused
	at org.apache.maven.plugin.deploy.DeployMojo.execute(DeployMojo.java:193)
	at org.apache.maven.plugin.DefaultBuildPluginManager.executeMojo(DefaultBuildPluginManager.java:101)
[JENKINS] Archiving <https://builds.apache.org/job/Karaf-2.3.x/ws/karaf/diagnostic/pom.xml>
to org.apache.karaf.diagnostic/diagnostic/2.3.4-SNAPSHOT/diagnostic-2.3.4-SNAPSHOT.pom
	at org.apache.maven.lifecycle.internal.MojoExecutor.execute(MojoExecutor.java:209)
	... 31 more
Caused by: org.apache.maven.artifact.deployer.ArtifactDeploymentException: Failed to retrieve
remote metadata org.apache.karaf.features:org.apache.karaf.features.management:2.3.4-SNAPSHOT/maven-metadata.xml:
Could not transfer metadata org.apache.karaf.features:org.apache.karaf.features.management:2.3.4-SNAPSHOT/maven-metadata.xml
from/to apache.snapshots.https (https://repository.apache.org/content/repositories/snapshots):
Connection to https://repository.apache.org refused
	at org.apache.maven.artifact.deployer.DefaultArtifactDeployer.deploy(DefaultArtifactDeployer.java:141)
	at org.apache.maven.plugin.deploy.AbstractDeployMojo.deploy(AbstractDeployMojo.java:167)
	at org.apache.maven.plugin.deploy.DeployMojo.execute(DeployMojo.java:157)
	... 33 more
Caused by: org.sonatype.aether.deployment.DeploymentException: Failed to retrieve remote metadata
org.apache.karaf.features:org.apache.karaf.features.management:2.3.4-SNAPSHOT/maven-metadata.xml:
Could not transfer metadata org.apache.karaf.features:org.apache.karaf.features.management:2.3.4-SNAPSHOT/maven-metadata.xml
from/to apache.snapshots.https (https://repository.apache.org/content/repositories/snapshots):
Connection to https://repository.apache.org refused
	at org.sonatype.aether.impl.internal.DefaultDeployer.upload(DefaultDeployer.java:403)
	at org.sonatype.aether.impl.internal.DefaultDeployer.deploy(DefaultDeployer.java:256)
	at org.sonatype.aether.impl.internal.DefaultDeployer.deploy(DefaultDeployer.java:211)
	at org.sonatype.aether.impl.internal.DefaultRepositorySystem.deploy(DefaultRepositorySystem.java:443)
	at org.apache.maven.artifact.deployer.DefaultArtifactDeployer.deploy(DefaultArtifactDeployer.java:137)
	... 35 more
Caused by: org.sonatype.aether.transfer.MetadataTransferException: Could not transfer metadata
org.apache.karaf.features:org.apache.karaf.features.management:2.3.4-SNAPSHOT/maven-metadata.xml
from/to apache.snapshots.https (https://repository.apache.org/content/repositories/snapshots):
Connection to https://repository.apache.org refused
	at org.sonatype.aether.connector.wagon.WagonRepositoryConnector$3.wrap(WagonRepositoryConnector.java:930)
	at org.sonatype.aether.connector.wagon.WagonRepositoryConnector$3.wrap(WagonRepositoryConnector.java:920)
	at org.sonatype.aether.connector.wagon.WagonRepositoryConnector$GetTask.run(WagonRepositoryConnector.java:669)
	at org.sonatype.aether.util.concurrency.RunnableErrorForwarder$1.run(RunnableErrorForwarder.java:60)
	... 3 more
Caused by: org.apache.maven.wagon.TransferFailedException: Connection to https://repository.apache.org
refused
	at org.apache.maven.wagon.shared.http4.AbstractHttpClientWagon.fillInputData(AbstractHttpClientWagon.java:799)
	at org.apache.maven.wagon.StreamWagon.getInputStream(StreamWagon.java:116)
	at org.apache.maven.wagon.StreamWagon.getIfNewer(StreamWagon.java:88)
	at org.apache.maven.wagon.StreamWagon.get(StreamWagon.java:61)
	at org.sonatype.aether.connector.wagon.WagonRepositoryConnector$GetTask.run(WagonRepositoryConnector.java:601)
	... 4 more
Caused by: org.apache.maven.wagon.providers.http.httpclient.conn.HttpHostConnectException:
Connection to https://repository.apache.org refused
	at org.apache.maven.wagon.providers.http.httpclient.impl.conn.DefaultClientConnectionOperator.openConnection(DefaultClientConnectionOperator.java:158)
	at org.apache.maven.wagon.providers.http.httpclient.impl.conn.AbstractPoolEntry.open(AbstractPoolEntry.java:149)
	at org.apache.maven.wagon.providers.http.httpclient.impl.conn.AbstractPooledConnAdapter.open(AbstractPooledConnAdapter.java:121)
	at org.apache.maven.wagon.providers.http.httpclient.impl.client.DefaultRequestDirector.tryConnect(DefaultRequestDirector.java:573)
	at org.apache.maven.wagon.providers.http.httpclient.impl.client.DefaultRequestDirector.execute(DefaultRequestDirector.java:425)
	at org.apache.maven.wagon.providers.http.httpclient.impl.client.AbstractHttpClient.execute(AbstractHttpClient.java:820)
	at org.apache.maven.wagon.providers.http.httpclient.impl.client.AbstractHttpClient.execute(AbstractHttpClient.java:754)
	at org.apache.maven.wagon.shared.http4.AbstractHttpClientWagon.execute(AbstractHttpClientWagon.java:674)
	at org.apache.maven.wagon.shared.http4.AbstractHttpClientWagon.fillInputData(AbstractHttpClientWagon.java:793)
	... 8 more
Caused by: java.net.ConnectException: Connection timed out
	at java.net.PlainSocketImpl.socketConnect(Native Method)
	at java.net.PlainSocketImpl.doConnect(PlainSocketImpl.java:351)
	at java.net.PlainSocketImpl.connectToAddress(PlainSocketImpl.java:213)
	at java.net.PlainSocketImpl.connect(PlainSocketImpl.java:200)
	at java.net.SocksSocketImpl.connect(SocksSocketImpl.java:366)
	at java.net.Socket.connect(Socket.java:529)
	at com.sun.net.ssl.internal.ssl.SSLSocketImpl.connect(SSLSocketImpl.java:570)
	at org.apache.maven.wagon.providers.http.httpclient.conn.ssl.SSLSocketFactory.connectSocket(SSLSocketFactory.java:375)
	at org.apache.maven.wagon.providers.http.httpclient.impl.conn.DefaultClientConnectionOperator.openConnection(DefaultClientConnectionOperator.java:148)
	... 16 more
[ERROR] 
[ERROR] Re-run Maven using the -X switch to enable full debug logging.
[ERROR] 
[ERROR] For more information about the errors and possible solutions, please read the following
articles:
[ERROR] [Help 1] http://cwiki.apache.org/confluence/display/MAVEN/MojoExecutionException
[ERROR] 
[ERROR] After correcting the problems, you can resume the build with the command
[ERROR]   mvn <goals> -rf :org.apache.karaf.features.management
[JENKINS] Archiving <https://builds.apache.org/job/Karaf-2.3.x/ws/karaf/deployer/wrap/pom.xml>
to org.apache.karaf.deployer/org.apache.karaf.deployer.wrap/2.3.4-SNAPSHOT/org.apache.karaf.deployer.wrap-2.3.4-SNAPSHOT.pom
[JENKINS] Archiving <https://builds.apache.org/job/Karaf-2.3.x/ws/karaf/jaas/config/pom.xml>
to org.apache.karaf.jaas/org.apache.karaf.jaas.config/2.3.4-SNAPSHOT/org.apache.karaf.jaas.config-2.3.4-SNAPSHOT.pom
[JENKINS] Archiving <https://builds.apache.org/job/Karaf-2.3.x/ws/karaf/jaas/config/target/org.apache.karaf.jaas.config-2.3.4-SNAPSHOT.jar>
to org.apache.karaf.jaas/org.apache.karaf.jaas.config/2.3.4-20131105.093259-64/org.apache.karaf.jaas.config-2.3.4-20131105.093259-64.jar
[JENKINS] Archiving <https://builds.apache.org/job/Karaf-2.3.x/ws/karaf/webconsole/pom.xml>
to org.apache.karaf.webconsole/webconsole/2.3.4-SNAPSHOT/webconsole-2.3.4-SNAPSHOT.pom
[JENKINS] Archiving <https://builds.apache.org/job/Karaf-2.3.x/ws/karaf/archetypes/pom.xml>
to org.apache.karaf/archetypes/2.3.4-SNAPSHOT/archetypes-2.3.4-SNAPSHOT.pom
[JENKINS] Archiving <https://builds.apache.org/job/Karaf-2.3.x/ws/karaf/archetypes/command/pom.xml>
to org.apache.karaf.archetypes/karaf-command-archetype/2.3.4-SNAPSHOT/karaf-command-archetype-2.3.4-SNAPSHOT.pom
[JENKINS] Archiving <https://builds.apache.org/job/Karaf-2.3.x/ws/karaf/management/mbeans/log/pom.xml>
to org.apache.karaf.management.mbeans/org.apache.karaf.management.mbeans.log/2.3.4-SNAPSHOT/org.apache.karaf.management.mbeans.log-2.3.4-SNAPSHOT.pom
[JENKINS] Archiving <https://builds.apache.org/job/Karaf-2.3.x/ws/karaf/tooling/exam/container/pom.xml>
to org.apache.karaf.tooling.exam/org.apache.karaf.tooling.exam.container/2.3.4-SNAPSHOT/org.apache.karaf.tooling.exam.container-2.3.4-SNAPSHOT.pom
[JENKINS] Archiving <https://builds.apache.org/job/Karaf-2.3.x/ws/karaf/archetypes/feature/pom.xml>
to org.apache.karaf.archetypes/karaf-feature-archetype/2.3.4-SNAPSHOT/karaf-feature-archetype-2.3.4-SNAPSHOT.pom
[JENKINS] Archiving <https://builds.apache.org/job/Karaf-2.3.x/ws/karaf/features/core/pom.xml>
to org.apache.karaf.features/org.apache.karaf.features.core/2.3.4-SNAPSHOT/org.apache.karaf.features.core-2.3.4-SNAPSHOT.pom
[JENKINS] Archiving <https://builds.apache.org/job/Karaf-2.3.x/ws/karaf/features/core/target/org.apache.karaf.features.core-2.3.4-SNAPSHOT.jar>
to org.apache.karaf.features/org.apache.karaf.features.core/2.3.4-20131105.094605-59/org.apache.karaf.features.core-2.3.4-20131105.094605-59.jar
[JENKINS] Archiving <https://builds.apache.org/job/Karaf-2.3.x/ws/karaf/main/pom.xml>
to org.apache.karaf/org.apache.karaf.main/2.3.4-SNAPSHOT/org.apache.karaf.main-2.3.4-SNAPSHOT.pom
[JENKINS] Archiving <https://builds.apache.org/job/Karaf-2.3.x/ws/karaf/main/target/org.apache.karaf.main-2.3.4-SNAPSHOT.jar>
to org.apache.karaf/org.apache.karaf.main/2.3.4-20131105.092551-64/org.apache.karaf.main-2.3.4-20131105.092551-64.jar
[JENKINS] Archiving <https://builds.apache.org/job/Karaf-2.3.x/ws/karaf/demos/pom.xml>
to org.apache.karaf.demos/demos/2.3.4-SNAPSHOT/demos-2.3.4-SNAPSHOT.pom
[JENKINS] Archiving <https://builds.apache.org/job/Karaf-2.3.x/ws/karaf/deployer/blueprint/pom.xml>
to org.apache.karaf.deployer/org.apache.karaf.deployer.blueprint/2.3.4-SNAPSHOT/org.apache.karaf.deployer.blueprint-2.3.4-SNAPSHOT.pom
[JENKINS] Archiving <https://builds.apache.org/job/Karaf-2.3.x/ws/karaf/tooling/cmdhelp-maven-plugin/pom.xml>
to org.apache.karaf.tooling/cmdhelp-maven-plugin/2.3.4-SNAPSHOT/cmdhelp-maven-plugin-2.3.4-SNAPSHOT.pom
[JENKINS] Archiving <https://builds.apache.org/job/Karaf-2.3.x/ws/karaf/demos/deployer/kar/pom.xml>
to org.apache.karaf.demos.deployer.kar/my-kar/2.3.4-SNAPSHOT/my-kar-2.3.4-SNAPSHOT.pom
[JENKINS] Archiving <https://builds.apache.org/job/Karaf-2.3.x/ws/karaf/demos/branding/shell/pom.xml>
to org.apache.karaf.demos/org.apache.karaf.demos.branding.shell/2.3.4-SNAPSHOT/org.apache.karaf.demos.branding.shell-2.3.4-SNAPSHOT.pom
[JENKINS] Archiving <https://builds.apache.org/job/Karaf-2.3.x/ws/karaf/admin/command/pom.xml>
to org.apache.karaf.admin/org.apache.karaf.admin.command/2.3.4-SNAPSHOT/org.apache.karaf.admin.command-2.3.4-SNAPSHOT.pom
[JENKINS] Archiving <https://builds.apache.org/job/Karaf-2.3.x/ws/karaf/assemblies/features/enterprise/pom.xml>
to org.apache.karaf.assemblies.features/enterprise/2.3.4-SNAPSHOT/enterprise-2.3.4-SNAPSHOT.pom
[JENKINS] Archiving <https://builds.apache.org/job/Karaf-2.3.x/ws/karaf/demos/branding/pom.xml>
to org.apache.karaf.demos/org.apache.karaf.demos.branding/2.3.4-SNAPSHOT/org.apache.karaf.demos.branding-2.3.4-SNAPSHOT.pom
[JENKINS] Archiving <https://builds.apache.org/job/Karaf-2.3.x/ws/karaf/demos/deployer/bundle/pom.xml>
to org.apache.karaf.demos.deployer.bundle/my-bundle/2.3.4-SNAPSHOT/my-bundle-2.3.4-SNAPSHOT.pom
[JENKINS] Archiving <https://builds.apache.org/job/Karaf-2.3.x/ws/karaf/features/pom.xml>
to org.apache.karaf.features/features/2.3.4-SNAPSHOT/features-2.3.4-SNAPSHOT.pom
[JENKINS] Archiving <https://builds.apache.org/job/Karaf-2.3.x/ws/karaf/jaas/command/pom.xml>
to org.apache.karaf.jaas/org.apache.karaf.jaas.command/2.3.4-SNAPSHOT/org.apache.karaf.jaas.command-2.3.4-SNAPSHOT.pom
[JENKINS] Archiving <https://builds.apache.org/job/Karaf-2.3.x/ws/karaf/tooling/exam/pom.xml>
to org.apache.karaf.tooling.exam/exam/2.3.4-SNAPSHOT/exam-2.3.4-SNAPSHOT.pom
[JENKINS] Archiving <https://builds.apache.org/job/Karaf-2.3.x/ws/karaf/demos/deployer/pom.xml>
to org.apache.karaf.demos/org.apache.karaf.demos.deployer/2.3.4-SNAPSHOT/org.apache.karaf.demos.deployer-2.3.4-SNAPSHOT.pom
[JENKINS] Archiving <https://builds.apache.org/job/Karaf-2.3.x/ws/karaf/assemblies/pom.xml>
to org.apache.karaf.assemblies/assemblies/2.3.4-SNAPSHOT/assemblies-2.3.4-SNAPSHOT.pom
[JENKINS] Archiving <https://builds.apache.org/job/Karaf-2.3.x/ws/karaf/jaas/boot/pom.xml>
to org.apache.karaf.jaas/org.apache.karaf.jaas.boot/2.3.4-SNAPSHOT/org.apache.karaf.jaas.boot-2.3.4-SNAPSHOT.pom
[JENKINS] Archiving <https://builds.apache.org/job/Karaf-2.3.x/ws/karaf/jaas/boot/target/org.apache.karaf.jaas.boot-2.3.4-SNAPSHOT.jar>
to org.apache.karaf.jaas/org.apache.karaf.jaas.boot/2.3.4-20131105.093112-64/org.apache.karaf.jaas.boot-2.3.4-20131105.093112-64.jar
[JENKINS] Archiving <https://builds.apache.org/job/Karaf-2.3.x/ws/karaf/diagnostic/command/pom.xml>
to org.apache.karaf.diagnostic/org.apache.karaf.diagnostic.command/2.3.4-SNAPSHOT/org.apache.karaf.diagnostic.command-2.3.4-SNAPSHOT.pom
[JENKINS] Archiving <https://builds.apache.org/job/Karaf-2.3.x/ws/karaf/jaas/modules/pom.xml>
to org.apache.karaf.jaas/org.apache.karaf.jaas.modules/2.3.4-SNAPSHOT/org.apache.karaf.jaas.modules-2.3.4-SNAPSHOT.pom
[JENKINS] Archiving <https://builds.apache.org/job/Karaf-2.3.x/ws/karaf/jaas/modules/target/org.apache.karaf.jaas.modules-2.3.4-SNAPSHOT.jar>
to org.apache.karaf.jaas/org.apache.karaf.jaas.modules/2.3.4-20131105.093523-64/org.apache.karaf.jaas.modules-2.3.4-20131105.093523-64.jar
[JENKINS] Archiving <https://builds.apache.org/job/Karaf-2.3.x/ws/karaf/webconsole/gogo/pom.xml>
to org.apache.karaf.webconsole/org.apache.karaf.webconsole.gogo/2.3.4-SNAPSHOT/org.apache.karaf.webconsole.gogo-2.3.4-SNAPSHOT.pom
[JENKINS] Archiving <https://builds.apache.org/job/Karaf-2.3.x/ws/karaf/diagnostic/management/pom.xml>
to org.apache.karaf.diagnostic/org.apache.karaf.diagnostic.management/2.3.4-SNAPSHOT/org.apache.karaf.diagnostic.management-2.3.4-SNAPSHOT.pom
[JENKINS] Archiving <https://builds.apache.org/job/Karaf-2.3.x/ws/karaf/webconsole/features/pom.xml>
to org.apache.karaf.webconsole/org.apache.karaf.webconsole.features/2.3.4-SNAPSHOT/org.apache.karaf.webconsole.features-2.3.4-SNAPSHOT.pom
[JENKINS] Archiving <https://builds.apache.org/job/Karaf-2.3.x/ws/karaf/management/mbeans/bundles/pom.xml>
to org.apache.karaf.management.mbeans/org.apache.karaf.management.mbeans.bundles/2.3.4-SNAPSHOT/org.apache.karaf.management.mbeans.bundles-2.3.4-SNAPSHOT.pom
[JENKINS] Archiving <https://builds.apache.org/job/Karaf-2.3.x/ws/karaf/management/mbeans/scr/pom.xml>
to org.apache.karaf.management.mbeans/org.apache.karaf.management.mbeans.scr/2.3.4-SNAPSHOT/org.apache.karaf.management.mbeans.scr-2.3.4-SNAPSHOT.pom
[JENKINS] Archiving <https://builds.apache.org/job/Karaf-2.3.x/ws/karaf/tooling/pom.xml>
to org.apache.karaf.tooling/tooling/2.3.4-SNAPSHOT/tooling-2.3.4-SNAPSHOT.pom
[JENKINS] Archiving <https://builds.apache.org/job/Karaf-2.3.x/ws/karaf/shell/commands/pom.xml>
to org.apache.karaf.shell/org.apache.karaf.shell.commands/2.3.4-SNAPSHOT/org.apache.karaf.shell.commands-2.3.4-SNAPSHOT.pom
[JENKINS] Archiving <https://builds.apache.org/job/Karaf-2.3.x/ws/karaf/demos/web/pom.xml>
to org.apache.karaf.demos/web/2.3.4-SNAPSHOT/web-2.3.4-SNAPSHOT.pom
[JENKINS] Archiving <https://builds.apache.org/job/Karaf-2.3.x/ws/karaf/features/command/pom.xml>
to org.apache.karaf.features/org.apache.karaf.features.command/2.3.4-SNAPSHOT/org.apache.karaf.features.command-2.3.4-SNAPSHOT.pom
[JENKINS] Archiving <https://builds.apache.org/job/Karaf-2.3.x/ws/karaf/features/command/target/org.apache.karaf.features.command-2.3.4-SNAPSHOT.jar>
to org.apache.karaf.features/org.apache.karaf.features.command/2.3.4-20131105.094803-59/org.apache.karaf.features.command-2.3.4-20131105.094803-59.jar
[JENKINS] Archiving <https://builds.apache.org/job/Karaf-2.3.x/ws/karaf/management/mbeans/dev/pom.xml>
to org.apache.karaf.management.mbeans/org.apache.karaf.management.mbeans.dev/2.3.4-SNAPSHOT/org.apache.karaf.management.mbeans.dev-2.3.4-SNAPSHOT.pom
[JENKINS] Archiving <https://builds.apache.org/job/Karaf-2.3.x/ws/karaf/demos/dump/pom.xml>
to org.apache.karaf.demos/dump/2.3.4-SNAPSHOT/dump-2.3.4-SNAPSHOT.pom
[JENKINS] Archiving <https://builds.apache.org/job/Karaf-2.3.x/ws/karaf/deployer/kar/pom.xml>
to org.apache.karaf.deployer/org.apache.karaf.deployer.kar/2.3.4-SNAPSHOT/org.apache.karaf.deployer.kar-2.3.4-SNAPSHOT.pom
[JENKINS] Archiving <https://builds.apache.org/job/Karaf-2.3.x/ws/karaf/features/management/pom.xml>
to org.apache.karaf.features/org.apache.karaf.features.management/2.3.4-SNAPSHOT/org.apache.karaf.features.management-2.3.4-SNAPSHOT.pom
[JENKINS] Archiving <https://builds.apache.org/job/Karaf-2.3.x/ws/karaf/features/management/target/org.apache.karaf.features.management-2.3.4-SNAPSHOT.jar>
to org.apache.karaf.features/org.apache.karaf.features.management/2.3.4-SNAPSHOT/org.apache.karaf.features.management-2.3.4-SNAPSHOT.jar
[JENKINS] Archiving <https://builds.apache.org/job/Karaf-2.3.x/ws/karaf/itests/pom.xml>
to org.apache.karaf.itests/itests/2.3.4-SNAPSHOT/itests-2.3.4-SNAPSHOT.pom
[JENKINS] Archiving <https://builds.apache.org/job/Karaf-2.3.x/ws/karaf/shell/scr/pom.xml>
to org.apache.karaf.shell/org.apache.karaf.shell.scr/2.3.4-SNAPSHOT/org.apache.karaf.shell.scr-2.3.4-SNAPSHOT.pom
[JENKINS] Archiving <https://builds.apache.org/job/Karaf-2.3.x/ws/karaf/diagnostic/common/pom.xml>
to org.apache.karaf.diagnostic/org.apache.karaf.diagnostic.common/2.3.4-SNAPSHOT/org.apache.karaf.diagnostic.common-2.3.4-SNAPSHOT.pom
[JENKINS] Archiving <https://builds.apache.org/job/Karaf-2.3.x/ws/karaf/demos/deployer/feature/pom.xml>
to org.apache.karaf.demos.deployer.feature/my-feature/2.3.4-SNAPSHOT/my-feature-2.3.4-SNAPSHOT.pom
[JENKINS] Archiving <https://builds.apache.org/job/Karaf-2.3.x/ws/karaf/management/server/pom.xml>
to org.apache.karaf.management/org.apache.karaf.management.server/2.3.4-SNAPSHOT/org.apache.karaf.management.server-2.3.4-SNAPSHOT.pom
[JENKINS] Archiving <https://builds.apache.org/job/Karaf-2.3.x/ws/karaf/management/server/target/org.apache.karaf.management.server-2.3.4-SNAPSHOT.jar>
to org.apache.karaf.management/org.apache.karaf.management.server/2.3.4-20131105.095332-58/org.apache.karaf.management.server-2.3.4-20131105.095332-58.jar
[JENKINS] Archiving <https://builds.apache.org/job/Karaf-2.3.x/ws/karaf/exception/pom.xml>
to org.apache.karaf/org.apache.karaf.exception/2.3.4-SNAPSHOT/org.apache.karaf.exception-2.3.4-SNAPSHOT.pom
[JENKINS] Archiving <https://builds.apache.org/job/Karaf-2.3.x/ws/karaf/management/mbeans/obr/pom.xml>
to org.apache.karaf.management.mbeans/org.apache.karaf.management.mbeans.obr/2.3.4-SNAPSHOT/org.apache.karaf.management.mbeans.obr-2.3.4-SNAPSHOT.pom
[JENKINS] Archiving <https://builds.apache.org/job/Karaf-2.3.x/ws/karaf/management/mbeans/packages/pom.xml>
to org.apache.karaf.management.mbeans/org.apache.karaf.management.mbeans.packages/2.3.4-SNAPSHOT/org.apache.karaf.management.mbeans.packages-2.3.4-SNAPSHOT.pom
[JENKINS] Archiving <https://builds.apache.org/job/Karaf-2.3.x/ws/karaf/shell/pom.xml>
to org.apache.karaf.shell/shell/2.3.4-SNAPSHOT/shell-2.3.4-SNAPSHOT.pom
[JENKINS] Archiving <https://builds.apache.org/job/Karaf-2.3.x/ws/karaf/management/mbeans/pom.xml>
to org.apache.karaf.management.mbeans/mbeans/2.3.4-SNAPSHOT/mbeans-2.3.4-SNAPSHOT.pom
[JENKINS] Archiving <https://builds.apache.org/job/Karaf-2.3.x/ws/karaf/management/mbeans/services/pom.xml>
to org.apache.karaf.management.mbeans/org.apache.karaf.management.mbeans.services/2.3.4-SNAPSHOT/org.apache.karaf.management.mbeans.services-2.3.4-SNAPSHOT.pom
[JENKINS] Archiving <https://builds.apache.org/job/Karaf-2.3.x/ws/karaf/archetypes/bundle/pom.xml>
to org.apache.karaf.archetypes/karaf-bundle-archetype/2.3.4-SNAPSHOT/karaf-bundle-archetype-2.3.4-SNAPSHOT.pom
[JENKINS] Archiving <https://builds.apache.org/job/Karaf-2.3.x/ws/karaf/management/mbeans/web/pom.xml>
to org.apache.karaf.management.mbeans/org.apache.karaf.management.mbeans.web/2.3.4-SNAPSHOT/org.apache.karaf.management.mbeans.web-2.3.4-SNAPSHOT.pom
[JENKINS] Archiving <https://builds.apache.org/job/Karaf-2.3.x/ws/karaf/shell/config/pom.xml>
to org.apache.karaf.shell/org.apache.karaf.shell.config/2.3.4-SNAPSHOT/org.apache.karaf.shell.config-2.3.4-SNAPSHOT.pom
[JENKINS] Archiving <https://builds.apache.org/job/Karaf-2.3.x/ws/karaf/admin/core/pom.xml>
to org.apache.karaf.admin/org.apache.karaf.admin.core/2.3.4-SNAPSHOT/org.apache.karaf.admin.core-2.3.4-SNAPSHOT.pom
[JENKINS] Archiving <https://builds.apache.org/job/Karaf-2.3.x/ws/karaf/pom.xml> to
org.apache.karaf/karaf/2.3.4-SNAPSHOT/karaf-2.3.4-SNAPSHOT.pom
[JENKINS] Archiving <https://builds.apache.org/job/Karaf-2.3.x/ws/karaf/shell/log/pom.xml>
to org.apache.karaf.shell/org.apache.karaf.shell.log/2.3.4-SNAPSHOT/org.apache.karaf.shell.log-2.3.4-SNAPSHOT.pom
[JENKINS] Archiving <https://builds.apache.org/job/Karaf-2.3.x/ws/karaf/shell/packages/pom.xml>
to org.apache.karaf.shell/org.apache.karaf.shell.packages/2.3.4-SNAPSHOT/org.apache.karaf.shell.packages-2.3.4-SNAPSHOT.pom
[JENKINS] Archiving <https://builds.apache.org/job/Karaf-2.3.x/ws/karaf/demos/deployer/wrap/pom.xml>
to org.apache.karaf.demos.deployer.wrap/osgi.commons-lang/2.3.4-SNAPSHOT/osgi.commons-lang-2.3.4-SNAPSHOT.pom
[JENKINS] Archiving <https://builds.apache.org/job/Karaf-2.3.x/ws/karaf/assemblies/features/pom.xml>
to org.apache.karaf.assemblies.features/features/2.3.4-SNAPSHOT/features-2.3.4-SNAPSHOT.pom
[JENKINS] Archiving <https://builds.apache.org/job/Karaf-2.3.x/ws/karaf/archetypes/assembly/pom.xml>
to org.apache.karaf.archetypes/karaf-assembly-archetype/2.3.4-SNAPSHOT/karaf-assembly-archetype-2.3.4-SNAPSHOT.pom
[JENKINS] Archiving <https://builds.apache.org/job/Karaf-2.3.x/ws/karaf/management/mbeans/config/pom.xml>
to org.apache.karaf.management.mbeans/org.apache.karaf.management.mbeans.config/2.3.4-SNAPSHOT/org.apache.karaf.management.mbeans.config-2.3.4-SNAPSHOT.pom
[JENKINS] Archiving <https://builds.apache.org/job/Karaf-2.3.x/ws/karaf/admin/management/pom.xml>
to org.apache.karaf.admin/org.apache.karaf.admin.management/2.3.4-SNAPSHOT/org.apache.karaf.admin.management-2.3.4-SNAPSHOT.pom
[JENKINS] Archiving <https://builds.apache.org/job/Karaf-2.3.x/ws/karaf/shell/wrapper/pom.xml>
to org.apache.karaf.shell/org.apache.karaf.shell.wrapper/2.3.4-SNAPSHOT/org.apache.karaf.shell.wrapper-2.3.4-SNAPSHOT.pom
[JENKINS] Archiving <https://builds.apache.org/job/Karaf-2.3.x/ws/karaf/management/pom.xml>
to org.apache.karaf.management/management/2.3.4-SNAPSHOT/management-2.3.4-SNAPSHOT.pom
[JENKINS] Archiving <https://builds.apache.org/job/Karaf-2.3.x/ws/karaf/management/mbeans/system/pom.xml>
to org.apache.karaf.management.mbeans/org.apache.karaf.management.mbeans.system/2.3.4-SNAPSHOT/org.apache.karaf.management.mbeans.system-2.3.4-SNAPSHOT.pom
[JENKINS] Archiving <https://builds.apache.org/job/Karaf-2.3.x/ws/karaf/tooling/features-maven-plugin/pom.xml>
to org.apache.karaf.tooling/features-maven-plugin/2.3.4-SNAPSHOT/features-maven-plugin-2.3.4-SNAPSHOT.pom
[JENKINS] Archiving <https://builds.apache.org/job/Karaf-2.3.x/ws/karaf/shell/dev/pom.xml>
to org.apache.karaf.shell/org.apache.karaf.shell.dev/2.3.4-SNAPSHOT/org.apache.karaf.shell.dev-2.3.4-SNAPSHOT.pom
[JENKINS] Archiving <https://builds.apache.org/job/Karaf-2.3.x/ws/karaf/archetypes/blueprint/pom.xml>
to org.apache.karaf.archetypes/karaf-blueprint-archetype/2.3.4-SNAPSHOT/karaf-blueprint-archetype-2.3.4-SNAPSHOT.pom
[JENKINS] Archiving <https://builds.apache.org/job/Karaf-2.3.x/ws/karaf/shell/web/pom.xml>
to org.apache.karaf.shell/org.apache.karaf.shell.web/2.3.4-SNAPSHOT/org.apache.karaf.shell.web-2.3.4-SNAPSHOT.pom
[JENKINS] Archiving <https://builds.apache.org/job/Karaf-2.3.x/ws/karaf/admin/pom.xml>
to org.apache.karaf.admin/admin/2.3.4-SNAPSHOT/admin-2.3.4-SNAPSHOT.pom
[JENKINS] Archiving <https://builds.apache.org/job/Karaf-2.3.x/ws/karaf/jaas/pom.xml>
to org.apache.karaf.jaas/jaas/2.3.4-SNAPSHOT/jaas-2.3.4-SNAPSHOT.pom
[JENKINS] Archiving <https://builds.apache.org/job/Karaf-2.3.x/ws/karaf/deployer/spring/pom.xml>
to org.apache.karaf.deployer/org.apache.karaf.deployer.spring/2.3.4-SNAPSHOT/org.apache.karaf.deployer.spring-2.3.4-SNAPSHOT.pom
[JENKINS] Archiving <https://builds.apache.org/job/Karaf-2.3.x/ws/karaf/demos/command/pom.xml>
to org.apache.karaf.demos/org.apache.karaf.demos.command/2.3.4-SNAPSHOT/org.apache.karaf.demos.command-2.3.4-SNAPSHOT.pom
[JENKINS] Archiving <https://builds.apache.org/job/Karaf-2.3.x/ws/karaf/assemblies/features/standard/pom.xml>
to org.apache.karaf.assemblies.features/standard/2.3.4-SNAPSHOT/standard-2.3.4-SNAPSHOT.pom
[JENKINS] Archiving <https://builds.apache.org/job/Karaf-2.3.x/ws/karaf/webconsole/console/pom.xml>
to org.apache.karaf.webconsole/org.apache.karaf.webconsole.console/2.3.4-SNAPSHOT/org.apache.karaf.webconsole.console-2.3.4-SNAPSHOT.pom
[JENKINS] Archiving <https://builds.apache.org/job/Karaf-2.3.x/ws/karaf/jaas/jasypt/pom.xml>
to org.apache.karaf.jaas/org.apache.karaf.jaas.jasypt/2.3.4-SNAPSHOT/org.apache.karaf.jaas.jasypt-2.3.4-SNAPSHOT.pom
[JENKINS] Archiving <https://builds.apache.org/job/Karaf-2.3.x/ws/karaf/diagnostic/core/pom.xml>
to org.apache.karaf.diagnostic/org.apache.karaf.diagnostic.core/2.3.4-SNAPSHOT/org.apache.karaf.diagnostic.core-2.3.4-SNAPSHOT.pom
[JENKINS] Archiving <https://builds.apache.org/job/Karaf-2.3.x/ws/karaf/util/pom.xml>
to org.apache.karaf/org.apache.karaf.util/2.3.4-SNAPSHOT/org.apache.karaf.util-2.3.4-SNAPSHOT.pom
[JENKINS] Archiving <https://builds.apache.org/job/Karaf-2.3.x/ws/karaf/util/target/org.apache.karaf.util-2.3.4-SNAPSHOT.jar>
to org.apache.karaf/org.apache.karaf.util/2.3.4-20131105.092430-66/org.apache.karaf.util-2.3.4-20131105.092430-66.jar
[JENKINS] Archiving <https://builds.apache.org/job/Karaf-2.3.x/ws/karaf/shell/console/pom.xml>
to org.apache.karaf.shell/org.apache.karaf.shell.console/2.3.4-SNAPSHOT/org.apache.karaf.shell.console-2.3.4-SNAPSHOT.pom
[JENKINS] Archiving <https://builds.apache.org/job/Karaf-2.3.x/ws/karaf/shell/console/target/org.apache.karaf.shell.console-2.3.4-SNAPSHOT.jar>
to org.apache.karaf.shell/org.apache.karaf.shell.console/2.3.4-20131105.093938-62/org.apache.karaf.shell.console-2.3.4-20131105.093938-62.jar
[JENKINS] Archiving <https://builds.apache.org/job/Karaf-2.3.x/ws/karaf/webconsole/branding/pom.xml>
to org.apache.karaf.webconsole/org.apache.karaf.webconsole.branding/2.3.4-SNAPSHOT/org.apache.karaf.webconsole.branding-2.3.4-SNAPSHOT.pom
[JENKINS] Archiving <https://builds.apache.org/job/Karaf-2.3.x/ws/karaf/shell/obr/pom.xml>
to org.apache.karaf.shell/org.apache.karaf.shell.obr/2.3.4-SNAPSHOT/org.apache.karaf.shell.obr-2.3.4-SNAPSHOT.pom
[JENKINS] Archiving <https://builds.apache.org/job/Karaf-2.3.x/ws/karaf/shell/obr/target/org.apache.karaf.shell.obr-2.3.4-SNAPSHOT.jar>
to org.apache.karaf.shell/org.apache.karaf.shell.obr/2.3.4-20131105.094217-61/org.apache.karaf.shell.obr-2.3.4-20131105.094217-61.jar
[JENKINS] Archiving <https://builds.apache.org/job/Karaf-2.3.x/ws/karaf/deployer/pom.xml>
to org.apache.karaf.deployer/deployer/2.3.4-SNAPSHOT/deployer-2.3.4-SNAPSHOT.pom
[JENKINS] Archiving <https://builds.apache.org/job/Karaf-2.3.x/ws/karaf/features/obr/pom.xml>
to org.apache.karaf.features/org.apache.karaf.features.obr/2.3.4-SNAPSHOT/org.apache.karaf.features.obr-2.3.4-SNAPSHOT.pom
[JENKINS] Archiving <https://builds.apache.org/job/Karaf-2.3.x/ws/karaf/shell/ssh/pom.xml>
to org.apache.karaf.shell/org.apache.karaf.shell.ssh/2.3.4-SNAPSHOT/org.apache.karaf.shell.ssh-2.3.4-SNAPSHOT.pom
[JENKINS] Archiving <https://builds.apache.org/job/Karaf-2.3.x/ws/karaf/webconsole/admin/pom.xml>
to org.apache.karaf.webconsole/org.apache.karaf.webconsole.admin/2.3.4-SNAPSHOT/org.apache.karaf.webconsole.admin-2.3.4-SNAPSHOT.pom
[JENKINS] Archiving <https://builds.apache.org/job/Karaf-2.3.x/ws/karaf/shell/osgi/pom.xml>
to org.apache.karaf.shell/org.apache.karaf.shell.osgi/2.3.4-SNAPSHOT/org.apache.karaf.shell.osgi-2.3.4-SNAPSHOT.pom
[JENKINS] Archiving <https://builds.apache.org/job/Karaf-2.3.x/ws/karaf/deployer/features/pom.xml>
to org.apache.karaf.deployer/org.apache.karaf.deployer.features/2.3.4-SNAPSHOT/org.apache.karaf.deployer.features-2.3.4-SNAPSHOT.pom
[JENKINS] Archiving <https://builds.apache.org/job/Karaf-2.3.x/ws/karaf/client/pom.xml>
to org.apache.karaf/org.apache.karaf.client/2.3.4-SNAPSHOT/org.apache.karaf.client-2.3.4-SNAPSHOT.pom
[JENKINS] Archiving <https://builds.apache.org/job/Karaf-2.3.x/ws/karaf/assemblies/apache-karaf/pom.xml>
to org.apache.karaf/apache-karaf/2.3.4-SNAPSHOT/apache-karaf-2.3.4-SNAPSHOT.pom
[JENKINS] Archiving <https://builds.apache.org/job/Karaf-2.3.x/ws/karaf/archetypes/kar/pom.xml>
to org.apache.karaf.archetypes/karaf-kar-archetype/2.3.4-SNAPSHOT/karaf-kar-archetype-2.3.4-SNAPSHOT.pom
[JENKINS] Archiving <https://builds.apache.org/job/Karaf-2.3.x/ws/karaf/tooling/exam/options/pom.xml>
to org.apache.karaf.tooling.exam/org.apache.karaf.tooling.exam.options/2.3.4-SNAPSHOT/org.apache.karaf.tooling.exam.options-2.3.4-SNAPSHOT.pom
Sending e-mails to: commits@karaf.apache.org null@apache.org
Sending e-mails to: commits@karaf.apache.org null@apache.org
channel stopped

Mime
View raw message