karaf-commits mailing list archives

Site index · List index
Message view « Date » · « Thread »
Top « Date » · « Thread »
From Apache Jenkins Server <jenk...@builds.apache.org>
Subject Build failed in Jenkins: Karaf #2335
Date Sun, 03 Nov 2013 11:27:25 GMT
See <https://builds.apache.org/job/Karaf/2335/changes>

Changes:

[jbonofre] [KARAF-2523] Add SQLServer JDBC lock support

------------------------------------------
[...truncated 3472 lines...]
Nov 3, 2013 8:20:37 AM org.apache.karaf.main.lock.DefaultJDBCLock schemaExists
SEVERE: Error testing for db table: java.lang.NullPointerException
Nov 3, 2013 8:20:37 AM org.apache.karaf.main.lock.DefaultJDBCLock createSchema
SEVERE: Could not create schema: java.lang.IllegalStateException: missing behavior definition
for the preceding method call:
Connection.getMetaData()
Usage is: expect(a.foo()).andXXX()
Nov 3, 2013 8:20:37 AM org.apache.karaf.main.lock.DefaultJDBCLock updateLock
WARNING: Failed to update database lock: java.sql.SQLException
Nov 3, 2013 8:20:37 AM org.apache.karaf.main.lock.DefaultJDBCLock updateLock
WARNING: Failed to update database lock: java.sql.SQLException
Nov 3, 2013 8:20:37 AM org.apache.karaf.main.lock.DefaultJDBCLock isAlive
SEVERE: Lost lock!
Nov 3, 2013 8:20:37 AM org.apache.karaf.main.lock.DefaultJDBCLock isAlive
SEVERE: Lost lock!
Nov 3, 2013 8:20:37 AM org.apache.karaf.main.lock.DefaultJDBCLock updateLock
WARNING: Failed to update database lock: java.sql.SQLException
Tests run: 14, Failures: 0, Errors: 0, Skipped: 0, Time elapsed: 0.01 sec
Running org.apache.karaf.main.lock.DerbyJDBCLockIntegrationTest
Tests run: 1, Failures: 0, Errors: 0, Skipped: 1, Time elapsed: 0.024 sec
Running org.apache.karaf.main.lock.DefaultJDBCLockIntegrationTest
Tests run: 1, Failures: 0, Errors: 0, Skipped: 1, Time elapsed: 0 sec
Running org.apache.karaf.main.lock.PostgreSQLJDBCLockTest
Nov 3, 2013 8:20:37 AM org.apache.karaf.main.lock.DefaultJDBCLock schemaExists
SEVERE: Error testing for db table: java.lang.NullPointerException
Nov 3, 2013 8:20:37 AM org.apache.karaf.main.lock.DefaultJDBCLock createSchema
SEVERE: Could not create schema: java.lang.IllegalStateException: missing behavior definition
for the preceding method call:
Connection.getMetaData()
Usage is: expect(a.foo()).andXXX()
Nov 3, 2013 8:20:37 AM org.apache.karaf.main.lock.DefaultJDBCLock updateLock
WARNING: Failed to update database lock: java.sql.SQLException
Nov 3, 2013 8:20:37 AM org.apache.karaf.main.lock.DefaultJDBCLock updateLock
WARNING: Failed to update database lock: java.sql.SQLException
Nov 3, 2013 8:20:37 AM org.apache.karaf.main.lock.DefaultJDBCLock isAlive
SEVERE: Lost lock!
Nov 3, 2013 8:20:37 AM org.apache.karaf.main.lock.DefaultJDBCLock isAlive
SEVERE: Lost lock!
Nov 3, 2013 8:20:37 AM org.apache.karaf.main.lock.DefaultJDBCLock updateLock
WARNING: Failed to update database lock: java.sql.SQLException
Tests run: 14, Failures: 0, Errors: 0, Skipped: 0, Time elapsed: 0.001 sec
Running org.apache.karaf.main.lock.DerbyJDBCLockTest
Nov 3, 2013 8:20:37 AM org.apache.karaf.main.lock.DefaultJDBCLock schemaExists
SEVERE: Error testing for db table: java.lang.NullPointerException
Nov 3, 2013 8:20:37 AM org.apache.karaf.main.lock.DefaultJDBCLock createSchema
SEVERE: Could not create schema: java.lang.IllegalStateException: missing behavior definition
for the preceding method call:
Connection.getMetaData()
Usage is: expect(a.foo()).andXXX()
Nov 3, 2013 8:20:37 AM org.apache.karaf.main.lock.DefaultJDBCLock updateLock
WARNING: Failed to update database lock: java.sql.SQLException
Nov 3, 2013 8:20:37 AM org.apache.karaf.main.lock.DefaultJDBCLock updateLock
WARNING: Failed to update database lock: java.sql.SQLException
Nov 3, 2013 8:20:37 AM org.apache.karaf.main.lock.DefaultJDBCLock isAlive
SEVERE: Lost lock!
Nov 3, 2013 8:20:37 AM org.apache.karaf.main.lock.DefaultJDBCLock isAlive
SEVERE: Lost lock!
Nov 3, 2013 8:20:37 AM org.apache.karaf.main.lock.DefaultJDBCLock updateLock
WARNING: Failed to update database lock: java.sql.SQLException
Tests run: 14, Failures: 0, Errors: 0, Skipped: 0, Time elapsed: 0 sec
Running org.apache.karaf.main.util.SimpleMavenResolverTest
Tests run: 2, Failures: 0, Errors: 0, Skipped: 0, Time elapsed: 0 sec
Running org.apache.karaf.main.util.StringMapTest
Tests run: 1, Failures: 0, Errors: 0, Skipped: 0, Time elapsed: 0.001 sec
Running org.apache.karaf.main.MainLockingTest
Nov 3, 2013 8:20:37 AM org.apache.karaf.main.Main launch
INFO: Installing and starting initial bundles
Nov 3, 2013 8:20:37 AM org.apache.karaf.main.Main launch
INFO: All initial bundles installed and set to start
Nov 3, 2013 8:20:37 AM org.apache.karaf.main.Main$KarafLockCallback lockAquired
INFO: Lock acquired. Setting startlevel to 100
SLF4J: Failed to load class "org.slf4j.impl.StaticLoggerBinder".
SLF4J: Defaulting to no-operation (NOP) logger implementation
SLF4J: See http://www.slf4j.org/codes.html#StaticLoggerBinder for further details.
Write: /tmp/mylitte6299670762152447733jar
Starting timeout activator
Nov 3, 2013 8:20:40 AM org.apache.karaf.main.Main$KarafLockCallback lockLost
WARNING: Lock lost. Setting startlevel to 1
Timeout activator asked to stopped
Stopping timeout activator
Nov 3, 2013 8:20:52 AM org.apache.karaf.main.Main$KarafLockCallback lockAquired
INFO: Lock acquired. Setting startlevel to 100
Starting timeout activator
Timeout activator asked to stopped
Stopping timeout activator
Tests run: 1, Failures: 0, Errors: 0, Skipped: 0, Time elapsed: 26.404 sec
Running org.apache.karaf.main.MainStartTest
Nov 3, 2013 8:21:04 AM org.apache.karaf.main.Main launch
INFO: Installing and starting initial bundles
Nov 3, 2013 8:21:04 AM org.apache.karaf.main.Main launch
INFO: All initial bundles installed and set to start
Nov 3, 2013 8:21:04 AM org.apache.karaf.main.Main$KarafLockCallback lockAquired
INFO: Lock acquired. Setting startlevel to 100
Nov 3, 2013 8:21:05 AM org.apache.karaf.main.Main launch
INFO: Installing and starting initial bundles
Nov 3, 2013 8:21:05 AM org.apache.karaf.main.Main launch
INFO: All initial bundles installed and set to start
Nov 3, 2013 8:21:05 AM org.apache.karaf.main.Main$KarafLockCallback lockAquired
INFO: Lock acquired. Setting startlevel to 100
Write: /tmp/mylitte6936708915732192062jar
Starting timeout activator
Nov 3, 2013 8:21:06 AM org.apache.karaf.main.ShutdownSocketThread run
INFO: Karaf shutdown socket: received shutdown command. Stopping framework...
Timeout activator asked to stopped
Stopping timeout activator
Tests run: 2, Failures: 0, Errors: 0, Skipped: 0, Time elapsed: 12.426 sec

Results :

Tests run: 86, Failures: 0, Errors: 0, Skipped: 5

[JENKINS] Recording test results
[INFO] 
[INFO] --- maven-bundle-plugin:2.4.0:bundle (default-bundle) @ org.apache.karaf.main ---
[INFO] 
[INFO] --- maven-site-plugin:3.1:attach-descriptor (attach-descriptor) @ org.apache.karaf.main
---
[INFO] 
[INFO] --- maven-install-plugin:2.3.1:install (default-install) @ org.apache.karaf.main ---
[INFO] Installing <https://builds.apache.org/job/Karaf/ws/karaf/main/target/org.apache.karaf.main-3.0.0-SNAPSHOT.jar>
to <https://builds.apache.org/job/Karaf/ws/.repository/org/apache/karaf/org.apache.karaf.main/3.0.0-SNAPSHOT/org.apache.karaf.main-3.0.0-SNAPSHOT.jar>
[INFO] Installing <https://builds.apache.org/job/Karaf/ws/karaf/main/pom.xml> to <https://builds.apache.org/job/Karaf/ws/.repository/org/apache/karaf/org.apache.karaf.main/3.0.0-SNAPSHOT/org.apache.karaf.main-3.0.0-SNAPSHOT.pom>
[INFO] 
[INFO] --- maven-bundle-plugin:2.4.0:install (default-install) @ org.apache.karaf.main ---
[INFO] Installing org/apache/karaf/org.apache.karaf.main/3.0.0-SNAPSHOT/org.apache.karaf.main-3.0.0-SNAPSHOT.jar
[INFO] Writing OBR metadata
[INFO] 
[INFO] --- maven-deploy-plugin:2.7:deploy (default-deploy) @ org.apache.karaf.main ---
Downloading: https://repository.apache.org/content/repositories/snapshots/org/apache/karaf/org.apache.karaf.main/3.0.0-SNAPSHOT/maven-metadata.xml
Downloaded: https://repository.apache.org/content/repositories/snapshots/org/apache/karaf/org.apache.karaf.main/3.0.0-SNAPSHOT/maven-metadata.xml
(796 B at 1.3 KB/sec)
Uploading: https://repository.apache.org/content/repositories/snapshots/org/apache/karaf/org.apache.karaf.main/3.0.0-SNAPSHOT/org.apache.karaf.main-3.0.0-20131103.082124-1761.jar
Uploaded: https://repository.apache.org/content/repositories/snapshots/org/apache/karaf/org.apache.karaf.main/3.0.0-SNAPSHOT/org.apache.karaf.main-3.0.0-20131103.082124-1761.jar
(321 KB at 609.7 KB/sec)
Uploading: https://repository.apache.org/content/repositories/snapshots/org/apache/karaf/org.apache.karaf.main/3.0.0-SNAPSHOT/org.apache.karaf.main-3.0.0-20131103.082124-1761.pom
Uploaded: https://repository.apache.org/content/repositories/snapshots/org/apache/karaf/org.apache.karaf.main/3.0.0-SNAPSHOT/org.apache.karaf.main-3.0.0-20131103.082124-1761.pom
(7 KB at 18.7 KB/sec)
Downloading: https://repository.apache.org/content/repositories/snapshots/org/apache/karaf/org.apache.karaf.main/maven-metadata.xml
Downloaded: https://repository.apache.org/content/repositories/snapshots/org/apache/karaf/org.apache.karaf.main/maven-metadata.xml
(682 B at 4.6 KB/sec)
Uploading: https://repository.apache.org/content/repositories/snapshots/org/apache/karaf/org.apache.karaf.main/3.0.0-SNAPSHOT/maven-metadata.xml
Uploaded: https://repository.apache.org/content/repositories/snapshots/org/apache/karaf/org.apache.karaf.main/3.0.0-SNAPSHOT/maven-metadata.xml
(796 B at 2.6 KB/sec)
Uploading: https://repository.apache.org/content/repositories/snapshots/org/apache/karaf/org.apache.karaf.main/maven-metadata.xml
Uploaded: https://repository.apache.org/content/repositories/snapshots/org/apache/karaf/org.apache.karaf.main/maven-metadata.xml
(682 B at 2.0 KB/sec)
[INFO] 
[INFO] --- maven-bundle-plugin:2.4.0:deploy (default-deploy) @ org.apache.karaf.main ---
[INFO] Remote OBR update disabled (enable with -DremoteOBR)
[INFO]                                                                         
[INFO] ------------------------------------------------------------------------
[INFO] Building Apache Karaf :: Region 3.0.0-SNAPSHOT
[INFO] ------------------------------------------------------------------------
[INFO] 
[INFO] --- maven-clean-plugin:2.5:clean (default-clean) @ region ---
[INFO] 
[INFO] --- maven-enforcer-plugin:1.1:enforce (enforce-maven) @ region ---
[INFO] 
[INFO] --- maven-bundle-plugin:2.4.0:cleanVersions (cleanVersions) @ region ---
[INFO] 
[INFO] --- maven-remote-resources-plugin:1.3:process (default) @ region ---
[INFO] 
[INFO] --- maven-site-plugin:3.1:attach-descriptor (attach-descriptor) @ region ---
[INFO] 
[INFO] --- maven-install-plugin:2.3.1:install (default-install) @ region ---
[INFO] Installing <https://builds.apache.org/job/Karaf/ws/karaf/region/pom.xml> to <https://builds.apache.org/job/Karaf/ws/.repository/org/apache/karaf/region/region/3.0.0-SNAPSHOT/region-3.0.0-SNAPSHOT.pom>
[INFO] 
[INFO] --- maven-deploy-plugin:2.7:deploy (default-deploy) @ region ---
Downloading: https://repository.apache.org/content/repositories/snapshots/org/apache/karaf/region/region/3.0.0-SNAPSHOT/maven-metadata.xml
Downloaded: https://repository.apache.org/content/repositories/snapshots/org/apache/karaf/region/region/3.0.0-SNAPSHOT/maven-metadata.xml
(612 B at 1.4 KB/sec)
Uploading: https://repository.apache.org/content/repositories/snapshots/org/apache/karaf/region/region/3.0.0-SNAPSHOT/region-3.0.0-20131103.082348-1724.pom
Uploaded: https://repository.apache.org/content/repositories/snapshots/org/apache/karaf/region/region/3.0.0-SNAPSHOT/region-3.0.0-20131103.082348-1724.pom
(6 KB at 17.5 KB/sec)
Downloading: https://repository.apache.org/content/repositories/snapshots/org/apache/karaf/region/region/maven-metadata.xml
Downloaded: https://repository.apache.org/content/repositories/snapshots/org/apache/karaf/region/region/maven-metadata.xml
(349 B at 1.2 KB/sec)
Uploading: https://repository.apache.org/content/repositories/snapshots/org/apache/karaf/region/region/3.0.0-SNAPSHOT/maven-metadata.xml
Uploaded: https://repository.apache.org/content/repositories/snapshots/org/apache/karaf/region/region/3.0.0-SNAPSHOT/maven-metadata.xml
(612 B at 1.7 KB/sec)
Uploading: https://repository.apache.org/content/repositories/snapshots/org/apache/karaf/region/region/maven-metadata.xml
Uploaded: https://repository.apache.org/content/repositories/snapshots/org/apache/karaf/region/region/maven-metadata.xml
(349 B at 0.8 KB/sec)
[INFO]                                                                         
[INFO] ------------------------------------------------------------------------
[INFO] Building Apache Karaf :: Region :: Core 3.0.0-SNAPSHOT
[INFO] ------------------------------------------------------------------------
[INFO] 
[INFO] --- maven-clean-plugin:2.5:clean (default-clean) @ org.apache.karaf.region.core ---
[INFO] 
[INFO] --- maven-enforcer-plugin:1.1:enforce (enforce-maven) @ org.apache.karaf.region.core
---
[INFO] 
[INFO] --- maven-bundle-plugin:2.4.0:cleanVersions (cleanVersions) @ org.apache.karaf.region.core
---
[INFO] 
[INFO] --- maven-remote-resources-plugin:1.3:process (default) @ org.apache.karaf.region.core
---
[INFO] 
[INFO] --- maven-resources-plugin:2.5:resources (default-resources) @ org.apache.karaf.region.core
---
[debug] execute contextualize
[INFO] Using 'UTF-8' encoding to copy filtered resources.
[INFO] skip non existing resourceDirectory <https://builds.apache.org/job/Karaf/ws/karaf/region/core/src/main/resources>
[INFO] Copying 3 resources
[INFO] 
[INFO] --- maven-compiler-plugin:2.5.1:compile (default-compile) @ org.apache.karaf.region.core
---
[INFO] Compiling 1 source file to <https://builds.apache.org/job/Karaf/ws/karaf/region/core/target/classes>
[INFO] 
[INFO] --- maven-resources-plugin:2.5:testResources (default-testResources) @ org.apache.karaf.region.core
---
[debug] execute contextualize
[INFO] Using 'UTF-8' encoding to copy filtered resources.
[INFO] skip non existing resourceDirectory <https://builds.apache.org/job/Karaf/ws/karaf/region/core/src/test/resources>
[INFO] Copying 3 resources
[INFO] 
[INFO] --- maven-compiler-plugin:2.5.1:testCompile (default-testCompile) @ org.apache.karaf.region.core
---
[INFO] No sources to compile
[INFO] 
[INFO] --- maven-surefire-plugin:2.12:test (default-test) @ org.apache.karaf.region.core ---
[INFO] Surefire report directory: <https://builds.apache.org/job/Karaf/ws/karaf/region/core/target/surefire-reports>

-------------------------------------------------------
 T E S T S
-------------------------------------------------------

Results :

Tests run: 0, Failures: 0, Errors: 0, Skipped: 0

[INFO] 
[JENKINS] Recording test results[INFO] --- maven-bundle-plugin:2.4.0:bundle (default-bundle)
@ org.apache.karaf.region.core ---

[INFO] 
[INFO] --- maven-site-plugin:3.1:attach-descriptor (attach-descriptor) @ org.apache.karaf.region.core
---
[INFO] 
[INFO] --- maven-install-plugin:2.3.1:install (default-install) @ org.apache.karaf.region.core
---
[INFO] Installing <https://builds.apache.org/job/Karaf/ws/karaf/region/core/target/org.apache.karaf.region.core-3.0.0-SNAPSHOT.jar>
to <https://builds.apache.org/job/Karaf/ws/.repository/org/apache/karaf/region/org.apache.karaf.region.core/3.0.0-SNAPSHOT/org.apache.karaf.region.core-3.0.0-SNAPSHOT.jar>
[INFO] Installing <https://builds.apache.org/job/Karaf/ws/karaf/region/core/pom.xml>
to <https://builds.apache.org/job/Karaf/ws/.repository/org/apache/karaf/region/org.apache.karaf.region.core/3.0.0-SNAPSHOT/org.apache.karaf.region.core-3.0.0-SNAPSHOT.pom>
[INFO] 
[INFO] --- maven-bundle-plugin:2.4.0:install (default-install) @ org.apache.karaf.region.core
---
[INFO] Installing org/apache/karaf/region/org.apache.karaf.region.core/3.0.0-SNAPSHOT/org.apache.karaf.region.core-3.0.0-SNAPSHOT.jar
[INFO] Writing OBR metadata
[INFO] 
[INFO] --- maven-deploy-plugin:2.7:deploy (default-deploy) @ org.apache.karaf.region.core
---
Downloading: https://repository.apache.org/content/repositories/snapshots/org/apache/karaf/region/org.apache.karaf.region.core/3.0.0-SNAPSHOT/maven-metadata.xml
Downloaded: https://repository.apache.org/content/repositories/snapshots/org/apache/karaf/region/org.apache.karaf.region.core/3.0.0-SNAPSHOT/maven-metadata.xml
(810 B at 1.1 KB/sec)
Uploading: https://repository.apache.org/content/repositories/snapshots/org/apache/karaf/region/org.apache.karaf.region.core/3.0.0-SNAPSHOT/org.apache.karaf.region.core-3.0.0-20131103.082520-1413.jar
Uploaded: https://repository.apache.org/content/repositories/snapshots/org/apache/karaf/region/org.apache.karaf.region.core/3.0.0-SNAPSHOT/org.apache.karaf.region.core-3.0.0-20131103.082520-1413.jar
(9 KB at 19.4 KB/sec)
Uploading: https://repository.apache.org/content/repositories/snapshots/org/apache/karaf/region/org.apache.karaf.region.core/3.0.0-SNAPSHOT/org.apache.karaf.region.core-3.0.0-20131103.082520-1413.pom
Uploaded: https://repository.apache.org/content/repositories/snapshots/org/apache/karaf/region/org.apache.karaf.region.core/3.0.0-SNAPSHOT/org.apache.karaf.region.core-3.0.0-20131103.082520-1413.pom
(3 KB at 3.4 KB/sec)
Downloading: https://repository.apache.org/content/repositories/snapshots/org/apache/karaf/region/org.apache.karaf.region.core/maven-metadata.xml
Downloaded: https://repository.apache.org/content/repositories/snapshots/org/apache/karaf/region/org.apache.karaf.region.core/maven-metadata.xml
(371 B at 0.4 KB/sec)
Uploading: https://repository.apache.org/content/repositories/snapshots/org/apache/karaf/region/org.apache.karaf.region.core/3.0.0-SNAPSHOT/maven-metadata.xml
Uploaded: https://repository.apache.org/content/repositories/snapshots/org/apache/karaf/region/org.apache.karaf.region.core/3.0.0-SNAPSHOT/maven-metadata.xml
(810 B at 1.9 KB/sec)
Uploading: https://repository.apache.org/content/repositories/snapshots/org/apache/karaf/region/org.apache.karaf.region.core/maven-metadata.xml
Uploaded: https://repository.apache.org/content/repositories/snapshots/org/apache/karaf/region/org.apache.karaf.region.core/maven-metadata.xml
(371 B at 0.7 KB/sec)
[INFO] 
[INFO] --- maven-bundle-plugin:2.4.0:deploy (default-deploy) @ org.apache.karaf.region.core
---
[INFO] Remote OBR update disabled (enable with -DremoteOBR)
[INFO]                                                                         
[INFO] ------------------------------------------------------------------------
[INFO] Building Apache Karaf :: Features 3.0.0-SNAPSHOT
[INFO] ------------------------------------------------------------------------
[INFO] 
[INFO] --- maven-clean-plugin:2.5:clean (default-clean) @ features ---
Sending e-mails to: commits@karaf.apache.org null@apache.org
Build timed out (after 70 minutes). Marking the build as aborted.
ERROR: Maven JVM terminated unexpectedly with exit code 143


Mime
View raw message