karaf-commits mailing list archives

Site index · List index
Message view « Date » · « Thread »
Top « Date » · « Thread »
From Apache Jenkins Server <jenk...@builds.apache.org>
Subject Build failed in Jenkins: Karaf #2337
Date Mon, 04 Nov 2013 23:51:45 GMT
See <https://builds.apache.org/job/Karaf/2337/changes>

Changes:

[jbonofre] [KARAF-2524] Correctly populate the APP_LONG_NAME in wrapper karaf-service script

[jbonofre] [KARAF-2520] Fix NPE in bundle:dynamic-import command

[jbonofre] [KARAF-2535] Add blueprint-web feature

------------------------------------------
[...truncated 3416 lines...]
[INFO] Apache Karaf :: OBR :: Core ....................... SKIPPED
[INFO] Apache Karaf :: OBR :: Command .................... SKIPPED
[INFO] Apache Karaf :: Tooling ........................... SKIPPED
[INFO] Apache Karaf :: Tooling :: Maven Karaf Plugin ..... SKIPPED
[INFO] Apache Karaf :: Assemblies ........................ SKIPPED
[INFO] Apache Karaf :: Assemblies :: Features ............ SKIPPED
[INFO] Apache Karaf :: Assemblies :: Features :: Framework  SKIPPED
[INFO] Apache Karaf :: Assemblies :: Features :: Standard  SKIPPED
[INFO] Apache Karaf :: Assemblies :: Features :: Spring .. SKIPPED
[INFO] Apache Karaf :: Assemblies :: Features :: Enterprise  SKIPPED
[INFO] Apache Karaf :: Assemblies :: Demos ............... SKIPPED
[INFO] Apache Karaf :: Assemblies :: Minimal Distribution  SKIPPED
[INFO] Apache Karaf :: Assemblies :: Default Distribution  SKIPPED
[INFO] Apache Karaf :: Demos ............................. SKIPPED
[INFO] Apache Karaf :: Demos :: Web ...................... SKIPPED
[INFO] Apache Karaf :: Demos :: Branding :: Shell ........ SKIPPED
[INFO] Apache Karaf :: Demos :: Command :: Extend Console  SKIPPED
[INFO] Apache Karaf :: Demos :: Demo Dump provider ....... SKIPPED
[INFO] Apache Karaf :: Demos :: Deployer ................. SKIPPED
[INFO] Apache Karaf :: Demos :: Deployer :: Kar .......... SKIPPED
[INFO] Apache Karaf :: Demos :: Deployer :: Bundle ....... SKIPPED
[INFO] Apache Karaf :: Archetypes ........................ SKIPPED
[INFO] Apache Karaf :: Archetypes :: Assembly Archetype .. SKIPPED
[INFO] Apache Karaf :: Archetypes :: Command Archetype ... SKIPPED
[INFO] Apache Karaf :: Archetypes :: Feature Archetype ... SKIPPED
[INFO] Apache Karaf :: Archetypes :: Kar Archetype ....... SKIPPED
[INFO] Apache Karaf :: Archetypes :: Bundle Archetype .... SKIPPED
[INFO] Apache Karaf :: Archetypes :: Blueprint Archetype . SKIPPED
[INFO] Apache Karaf :: Integration Tests ................. SKIPPED
[INFO] ------------------------------------------------------------------------
[INFO] BUILD FAILURE
[INFO] ------------------------------------------------------------------------
[INFO] Total time: 7:52.403s
[INFO] Finished at: Mon Nov 04 15:14:13 UTC 2013
[INFO] Final Memory: 48M/272M
[INFO] ------------------------------------------------------------------------
Waiting for Jenkins to finish collecting data
[ERROR] Failed to execute goal org.apache.maven.plugins:maven-deploy-plugin:2.7:deploy (default-deploy)
on project karaf: Failed to retrieve remote metadata org.apache.karaf:karaf:3.0.0-SNAPSHOT/maven-metadata.xml:
Could not transfer metadata org.apache.karaf:karaf:3.0.0-SNAPSHOT/maven-metadata.xml from/to
apache.snapshots.https (https://repository.apache.org/content/repositories/snapshots): Connection
to https://repository.apache.org refused: Connection timed out -> [Help 1]
org.apache.maven.lifecycle.LifecycleExecutionException: Failed to execute goal org.apache.maven.plugins:maven-deploy-plugin:2.7:deploy
(default-deploy) on project karaf: Failed to retrieve remote metadata org.apache.karaf:karaf:3.0.0-SNAPSHOT/maven-metadata.xml:
Could not transfer metadata org.apache.karaf:karaf:3.0.0-SNAPSHOT/maven-metadata.xml from/to
apache.snapshots.https (https://repository.apache.org/content/repositories/snapshots): Connection
to https://repository.apache.org refused
	at org.apache.maven.lifecycle.internal.MojoExecutor.execute(MojoExecutor.java:217)
	at org.apache.maven.lifecycle.internal.MojoExecutor.execute(MojoExecutor.java:153)
	at org.apache.maven.lifecycle.internal.MojoExecutor.execute(MojoExecutor.java:145)
	at org.apache.maven.lifecycle.internal.LifecycleModuleBuilder.buildProject(LifecycleModuleBuilder.java:84)
	at org.apache.maven.lifecycle.internal.LifecycleModuleBuilder.buildProject(LifecycleModuleBuilder.java:59)
	at org.apache.maven.lifecycle.internal.LifecycleStarter.singleThreadedBuild(LifecycleStarter.java:183)
	at org.apache.maven.lifecycle.internal.LifecycleStarter.execute(LifecycleStarter.java:161)
	at org.apache.maven.DefaultMaven.doExecute(DefaultMaven.java:320)
[JENKINS] Archiving <https://builds.apache.org/job/Karaf/ws/karaf/deployer/wrap/pom.xml>
to org.apache.karaf.deployer/org.apache.karaf.deployer.wrap/3.0.0-SNAPSHOT/org.apache.karaf.deployer.wrap-3.0.0-SNAPSHOT.pom
	at org.apache.maven.DefaultMaven.execute(DefaultMaven.java:156)
	at org.jvnet.hudson.maven3.launcher.Maven3Launcher.main(Maven3Launcher.java:117)
	at sun.reflect.NativeMethodAccessorImpl.invoke0(Native Method)
	at sun.reflect.NativeMethodAccessorImpl.invoke(NativeMethodAccessorImpl.java:39)
	at sun.reflect.DelegatingMethodAccessorImpl.invoke(DelegatingMethodAccessorImpl.java:25)
	at java.lang.reflect.Method.invoke(Method.java:597)
	at org.codehaus.plexus.classworlds.launcher.Launcher.launchStandard(Launcher.java:329)
	at org.codehaus.plexus.classworlds.launcher.Launcher.launch(Launcher.java:239)
	at org.jvnet.hudson.maven3.agent.Maven3Main.launch(Maven3Main.java:178)
	at sun.reflect.NativeMethodAccessorImpl.invoke0(Native Method)
	at sun.reflect.NativeMethodAccessorImpl.invoke(NativeMethodAccessorImpl.java:39)
	at sun.reflect.DelegatingMethodAccessorImpl.invoke(DelegatingMethodAccessorImpl.java:25)
	at java.lang.reflect.Method.invoke(Method.java:597)
	at hudson.maven.Maven3Builder.call(Maven3Builder.java:134)
	at hudson.maven.Maven3Builder.call(Maven3Builder.java:69)
	at hudson.remoting.UserRequest.perform(UserRequest.java:118)
	at hudson.remoting.UserRequest.perform(UserRequest.java:48)
	at hudson.remoting.Request$2.run(Request.java:326)
	at hudson.remoting.InterceptingExecutorService$1.call(InterceptingExecutorService.java:72)
	at java.util.concurrent.FutureTask$Sync.innerRun(FutureTask.java:303)
	at java.util.concurrent.FutureTask.run(FutureTask.java:138)
	at java.util.concurrent.ThreadPoolExecutor$Worker.runTask(ThreadPoolExecutor.java:895)
	at java.util.concurrent.ThreadPoolExecutor$Worker.run(ThreadPoolExecutor.java:918)
	at java.lang.Thread.run(Thread.java:662)
Caused by: org.apache.maven.plugin.MojoExecutionException: Failed to retrieve remote metadata
org.apache.karaf:karaf:3.0.0-SNAPSHOT/maven-metadata.xml: Could not transfer metadata org.apache.karaf:karaf:3.0.0-SNAPSHOT/maven-metadata.xml
from/to apache.snapshots.https (https://repository.apache.org/content/repositories/snapshots):
Connection to https://repository.apache.org refused
	at org.apache.maven.plugin.deploy.DeployMojo.execute(DeployMojo.java:193)
	at org.apache.maven.plugin.DefaultBuildPluginManager.executeMojo(DefaultBuildPluginManager.java:101)
	at org.apache.maven.lifecycle.internal.MojoExecutor.execute(MojoExecutor.java:209)
	... 31 more
Caused by: org.apache.maven.artifact.deployer.ArtifactDeploymentException: Failed to retrieve
remote metadata org.apache.karaf:karaf:3.0.0-SNAPSHOT/maven-metadata.xml: Could not transfer
metadata org.apache.karaf:karaf:3.0.0-SNAPSHOT/maven-metadata.xml from/to apache.snapshots.https
(https://repository.apache.org/content/repositories/snapshots): Connection to https://repository.apache.org
refused
	at org.apache.maven.artifact.deployer.DefaultArtifactDeployer.deploy(DefaultArtifactDeployer.java:141)
	at org.apache.maven.plugin.deploy.AbstractDeployMojo.deploy(AbstractDeployMojo.java:167)
	at org.apache.maven.plugin.deploy.DeployMojo.execute(DeployMojo.java:149)
	... 33 more
Caused by: org.sonatype.aether.deployment.DeploymentException: Failed to retrieve remote metadata
org.apache.karaf:karaf:3.0.0-SNAPSHOT/maven-metadata.xml: Could not transfer metadata org.apache.karaf:karaf:3.0.0-SNAPSHOT/maven-metadata.xml
from/to apache.snapshots.https (https://repository.apache.org/content/repositories/snapshots):
Connection to https://repository.apache.org refused
	at org.sonatype.aether.impl.internal.DefaultDeployer.upload(DefaultDeployer.java:403)
	at org.sonatype.aether.impl.internal.DefaultDeployer.deploy(DefaultDeployer.java:256)
	at org.sonatype.aether.impl.internal.DefaultDeployer.deploy(DefaultDeployer.java:211)
	at org.sonatype.aether.impl.internal.DefaultRepositorySystem.deploy(DefaultRepositorySystem.java:443)
	at org.apache.maven.artifact.deployer.DefaultArtifactDeployer.deploy(DefaultArtifactDeployer.java:137)
	... 35 more
Caused by: org.sonatype.aether.transfer.MetadataTransferException: Could not transfer metadata
org.apache.karaf:karaf:3.0.0-SNAPSHOT/maven-metadata.xml from/to apache.snapshots.https (https://repository.apache.org/content/repositories/snapshots):
Connection to https://repository.apache.org refused
	at org.sonatype.aether.connector.wagon.WagonRepositoryConnector$3.wrap(WagonRepositoryConnector.java:930)
	at org.sonatype.aether.connector.wagon.WagonRepositoryConnector$3.wrap(WagonRepositoryConnector.java:920)
	at org.sonatype.aether.connector.wagon.WagonRepositoryConnector$GetTask.run(WagonRepositoryConnector.java:669)
	at org.sonatype.aether.util.concurrency.RunnableErrorForwarder$1.run(RunnableErrorForwarder.java:60)
	... 3 more
Caused by: org.apache.maven.wagon.TransferFailedException: Connection to https://repository.apache.org
refused
	at org.apache.maven.wagon.shared.http4.AbstractHttpClientWagon.fillInputData(AbstractHttpClientWagon.java:799)
	at org.apache.maven.wagon.StreamWagon.getInputStream(StreamWagon.java:116)
	at org.apache.maven.wagon.StreamWagon.getIfNewer(StreamWagon.java:88)
	at org.apache.maven.wagon.StreamWagon.get(StreamWagon.java:61)
	at org.sonatype.aether.connector.wagon.WagonRepositoryConnector$GetTask.run(WagonRepositoryConnector.java:601)
	... 4 more
Caused by: org.apache.maven.wagon.providers.http.httpclient.conn.HttpHostConnectException:
Connection to https://repository.apache.org refused
	at org.apache.maven.wagon.providers.http.httpclient.impl.conn.DefaultClientConnectionOperator.openConnection(DefaultClientConnectionOperator.java:158)
	at org.apache.maven.wagon.providers.http.httpclient.impl.conn.AbstractPoolEntry.open(AbstractPoolEntry.java:149)
	at org.apache.maven.wagon.providers.http.httpclient.impl.conn.AbstractPooledConnAdapter.open(AbstractPooledConnAdapter.java:121)
	at org.apache.maven.wagon.providers.http.httpclient.impl.client.DefaultRequestDirector.tryConnect(DefaultRequestDirector.java:573)
	at org.apache.maven.wagon.providers.http.httpclient.impl.client.DefaultRequestDirector.execute(DefaultRequestDirector.java:425)
	at org.apache.maven.wagon.providers.http.httpclient.impl.client.AbstractHttpClient.execute(AbstractHttpClient.java:820)
	at org.apache.maven.wagon.providers.http.httpclient.impl.client.AbstractHttpClient.execute(AbstractHttpClient.java:754)
	at org.apache.maven.wagon.shared.http4.AbstractHttpClientWagon.execute(AbstractHttpClientWagon.java:674)
	at org.apache.maven.wagon.shared.http4.AbstractHttpClientWagon.fillInputData(AbstractHttpClientWagon.java:793)
	... 8 more
Caused by: java.net.ConnectException: Connection timed out
	at java.net.PlainSocketImpl.socketConnect(Native Method)
	at java.net.PlainSocketImpl.doConnect(PlainSocketImpl.java:351)
	at java.net.PlainSocketImpl.connectToAddress(PlainSocketImpl.java:213)
	at java.net.PlainSocketImpl.connect(PlainSocketImpl.java:200)
	at java.net.SocksSocketImpl.connect(SocksSocketImpl.java:366)
	at java.net.Socket.connect(Socket.java:529)
	at com.sun.net.ssl.internal.ssl.SSLSocketImpl.connect(SSLSocketImpl.java:570)
	at org.apache.maven.wagon.providers.http.httpclient.conn.ssl.SSLSocketFactory.connectSocket(SSLSocketFactory.java:375)
	at org.apache.maven.wagon.providers.http.httpclient.impl.conn.DefaultClientConnectionOperator.openConnection(DefaultClientConnectionOperator.java:148)
	... 16 more
[ERROR] 
[ERROR] Re-run Maven using the -X switch to enable full debug logging.
[ERROR] 
[ERROR] For more information about the errors and possible solutions, please read the following
articles:
[ERROR] [Help 1] http://cwiki.apache.org/confluence/display/MAVEN/MojoExecutionException
[JENKINS] Archiving <https://builds.apache.org/job/Karaf/ws/karaf/obr/pom.xml> to org.apache.karaf.obr/obr/3.0.0-SNAPSHOT/obr-3.0.0-SNAPSHOT.pom
[JENKINS] Archiving <https://builds.apache.org/job/Karaf/ws/karaf/jaas/config/pom.xml>
to org.apache.karaf.jaas/org.apache.karaf.jaas.config/3.0.0-SNAPSHOT/org.apache.karaf.jaas.config-3.0.0-SNAPSHOT.pom
[JENKINS] Archiving <https://builds.apache.org/job/Karaf/ws/karaf/webconsole/pom.xml>
to org.apache.karaf.webconsole/webconsole/3.0.0-SNAPSHOT/webconsole-3.0.0-SNAPSHOT.pom
[JENKINS] Archiving <https://builds.apache.org/job/Karaf/ws/karaf/archetypes/pom.xml>
to org.apache.karaf/archetypes/3.0.0-SNAPSHOT/archetypes-3.0.0-SNAPSHOT.pom
[JENKINS] Archiving <https://builds.apache.org/job/Karaf/ws/karaf/archetypes/command/pom.xml>
to org.apache.karaf.archetypes/karaf-command-archetype/3.0.0-SNAPSHOT/karaf-command-archetype-3.0.0-SNAPSHOT.pom
[JENKINS] Archiving <https://builds.apache.org/job/Karaf/ws/karaf/scr/command/pom.xml>
to org.apache.karaf.scr/org.apache.karaf.scr.command/3.0.0-SNAPSHOT/org.apache.karaf.scr.command-3.0.0-SNAPSHOT.pom
[JENKINS] Archiving <https://builds.apache.org/job/Karaf/ws/karaf/service/guard/pom.xml>
to org.apache.karaf.service/org.apache.karaf.service.guard/3.0.0-SNAPSHOT/org.apache.karaf.service.guard-3.0.0-SNAPSHOT.pom
[JENKINS] Archiving <https://builds.apache.org/job/Karaf/ws/karaf/features/core/pom.xml>
to org.apache.karaf.features/org.apache.karaf.features.core/3.0.0-SNAPSHOT/org.apache.karaf.features.core-3.0.0-SNAPSHOT.pom
[JENKINS] Archiving <https://builds.apache.org/job/Karaf/ws/karaf/main/pom.xml> to org.apache.karaf/org.apache.karaf.main/3.0.0-SNAPSHOT/org.apache.karaf.main-3.0.0-SNAPSHOT.pom
[JENKINS] Archiving <https://builds.apache.org/job/Karaf/ws/karaf/package/pom.xml> to
org.apache.karaf.package/package/3.0.0-SNAPSHOT/package-3.0.0-SNAPSHOT.pom
[JENKINS] Archiving <https://builds.apache.org/job/Karaf/ws/karaf/deployer/blueprint/pom.xml>
to org.apache.karaf.deployer/org.apache.karaf.deployer.blueprint/3.0.0-SNAPSHOT/org.apache.karaf.deployer.blueprint-3.0.0-SNAPSHOT.pom
[JENKINS] Archiving <https://builds.apache.org/job/Karaf/ws/karaf/wrapper/command/pom.xml>
to org.apache.karaf.wrapper/org.apache.karaf.wrapper.command/3.0.0-SNAPSHOT/org.apache.karaf.wrapper.command-3.0.0-SNAPSHOT.pom
[JENKINS] Archiving <https://builds.apache.org/job/Karaf/ws/karaf/management/boot/pom.xml>
to org.apache.karaf.management/org.apache.karaf.management.boot/3.0.0-SNAPSHOT/org.apache.karaf.management.boot-3.0.0-SNAPSHOT.pom
[JENKINS] Archiving <https://builds.apache.org/job/Karaf/ws/karaf/scr/pom.xml> to org.apache.karaf.scr/scr/3.0.0-SNAPSHOT/scr-3.0.0-SNAPSHOT.pom
[JENKINS] Archiving <https://builds.apache.org/job/Karaf/ws/karaf/demos/deployer/bundle/pom.xml>
to org.apache.karaf.demos.deployer.bundle/my-bundle/3.0.0-SNAPSHOT/my-bundle-3.0.0-SNAPSHOT.pom
[JENKINS] Archiving <https://builds.apache.org/job/Karaf/ws/karaf/features/pom.xml>
to org.apache.karaf.features/features/3.0.0-SNAPSHOT/features-3.0.0-SNAPSHOT.pom
[JENKINS] Archiving <https://builds.apache.org/job/Karaf/ws/karaf/assemblies/features/standard/pom.xml>
to org.apache.karaf.features/standard/3.0.0-SNAPSHOT/standard-3.0.0-SNAPSHOT.pom
[JENKINS] Archiving <https://builds.apache.org/job/Karaf/ws/karaf/bundle/pom.xml> to
org.apache.karaf.bundle/bundle/3.0.0-SNAPSHOT/bundle-3.0.0-SNAPSHOT.pom
[JENKINS] Archiving <https://builds.apache.org/job/Karaf/ws/karaf/assemblies/demos/pom.xml>
to org.apache.karaf/demos/3.0.0-SNAPSHOT/demos-3.0.0-SNAPSHOT.pom
[JENKINS] Archiving <https://builds.apache.org/job/Karaf/ws/karaf/jaas/modules/pom.xml>
to org.apache.karaf.jaas/org.apache.karaf.jaas.modules/3.0.0-SNAPSHOT/org.apache.karaf.jaas.modules-3.0.0-SNAPSHOT.pom
[JENKINS] Archiving <https://builds.apache.org/job/Karaf/ws/karaf/webconsole/features/pom.xml>
to org.apache.karaf.webconsole/org.apache.karaf.webconsole.features/3.0.0-SNAPSHOT/org.apache.karaf.webconsole.features-3.0.0-SNAPSHOT.pom
[JENKINS] Archiving <https://builds.apache.org/job/Karaf/ws/karaf/obr/command/pom.xml>
to org.apache.karaf.obr/org.apache.karaf.obr.command/3.0.0-SNAPSHOT/org.apache.karaf.obr.command-3.0.0-SNAPSHOT.pom
[JENKINS] Archiving <https://builds.apache.org/job/Karaf/ws/karaf/bundle/core/pom.xml>
to org.apache.karaf.bundle/org.apache.karaf.bundle.core/3.0.0-SNAPSHOT/org.apache.karaf.bundle.core-3.0.0-SNAPSHOT.pom
[JENKINS] Archiving <https://builds.apache.org/job/Karaf/ws/karaf/tooling/pom.xml> to
org.apache.karaf.tooling/tooling/3.0.0-SNAPSHOT/tooling-3.0.0-SNAPSHOT.pom
[JENKINS] Archiving <https://builds.apache.org/job/Karaf/ws/karaf/features/command/pom.xml>
to org.apache.karaf.features/org.apache.karaf.features.command/3.0.0-SNAPSHOT/org.apache.karaf.features.command-3.0.0-SNAPSHOT.pom
[JENKINS] Archiving <https://builds.apache.org/job/Karaf/ws/karaf/deployer/kar/pom.xml>
to org.apache.karaf.deployer/org.apache.karaf.deployer.kar/3.0.0-SNAPSHOT/org.apache.karaf.deployer.kar-3.0.0-SNAPSHOT.pom
[JENKINS] Archiving <https://builds.apache.org/job/Karaf/ws/karaf/itests/pom.xml> to
org.apache.karaf.itests/itests/3.0.0-SNAPSHOT/itests-3.0.0-SNAPSHOT.pom
[JENKINS] Archiving <https://builds.apache.org/job/Karaf/ws/karaf/kar/core/pom.xml>
to org.apache.karaf.kar/org.apache.karaf.kar.core/3.0.0-SNAPSHOT/org.apache.karaf.kar.core-3.0.0-SNAPSHOT.pom
[JENKINS] Archiving <https://builds.apache.org/job/Karaf/ws/karaf/bundle/command/pom.xml>
to org.apache.karaf.bundle/org.apache.karaf.bundle.command/3.0.0-SNAPSHOT/org.apache.karaf.bundle.command-3.0.0-SNAPSHOT.pom
[JENKINS] Archiving <https://builds.apache.org/job/Karaf/ws/karaf/management/server/pom.xml>
to org.apache.karaf.management/org.apache.karaf.management.server/3.0.0-SNAPSHOT/org.apache.karaf.management.server-3.0.0-SNAPSHOT.pom
[JENKINS] Archiving <https://builds.apache.org/job/Karaf/ws/karaf/scr/examples/pom.xml>
to org.apache.karaf.scr/org.apache.karaf.scr.examples/3.0.0-SNAPSHOT/org.apache.karaf.scr.examples-3.0.0-SNAPSHOT.pom
[JENKINS] Archiving <https://builds.apache.org/job/Karaf/ws/karaf/scr/examples/managed-service/pom.xml>
to org.apache.karaf.scr.examples/org.apache.karaf.scr.examples.managed.service/3.0.0-SNAPSHOT/org.apache.karaf.scr.examples.managed.service-3.0.0-SNAPSHOT.pom
[JENKINS] Archiving <https://builds.apache.org/job/Karaf/ws/karaf/scr/examples/service/pom.xml>
to org.apache.karaf.scr.examples/org.apache.karaf.scr.examples.service/3.0.0-SNAPSHOT/org.apache.karaf.scr.examples.service-3.0.0-SNAPSHOT.pom
[JENKINS] Archiving <https://builds.apache.org/job/Karaf/ws/karaf/shell/help/pom.xml>
to org.apache.karaf.shell/org.apache.karaf.shell.help/3.0.0-SNAPSHOT/org.apache.karaf.shell.help-3.0.0-SNAPSHOT.pom
[JENKINS] Archiving <https://builds.apache.org/job/Karaf/ws/karaf/assemblies/features/spring/pom.xml>
to org.apache.karaf.features/spring/3.0.0-SNAPSHOT/spring-3.0.0-SNAPSHOT.pom
[JENKINS] Archiving <https://builds.apache.org/job/Karaf/ws/karaf/assemblies/features/pom.xml>
to org.apache.karaf.assemblies.features/features/3.0.0-SNAPSHOT/features-3.0.0-SNAPSHOT.pom
[JENKINS] Archiving <https://builds.apache.org/job/Karaf/ws/karaf/region/command/pom.xml>
to org.apache.karaf.region/org.apache.karaf.region.command/3.0.0-SNAPSHOT/org.apache.karaf.region.command-3.0.0-SNAPSHOT.pom
[JENKINS] Archiving <https://builds.apache.org/job/Karaf/ws/karaf/config/core/pom.xml>
to org.apache.karaf.config/org.apache.karaf.config.core/3.0.0-SNAPSHOT/org.apache.karaf.config.core-3.0.0-SNAPSHOT.pom
[JENKINS] Archiving <https://builds.apache.org/job/Karaf/ws/karaf/package/core/pom.xml>
to org.apache.karaf.package/org.apache.karaf.package.core/3.0.0-SNAPSHOT/org.apache.karaf.package.core-3.0.0-SNAPSHOT.pom
[JENKINS] Archiving <https://builds.apache.org/job/Karaf/ws/karaf/system/core/pom.xml>
to org.apache.karaf.system/org.apache.karaf.system.core/3.0.0-SNAPSHOT/org.apache.karaf.system.core-3.0.0-SNAPSHOT.pom
[JENKINS] Archiving <https://builds.apache.org/job/Karaf/ws/karaf/jaas/pom.xml> to org.apache.karaf.jaas/jaas/3.0.0-SNAPSHOT/jaas-3.0.0-SNAPSHOT.pom
[JENKINS] Archiving <https://builds.apache.org/job/Karaf/ws/karaf/demos/command/pom.xml>
to org.apache.karaf.demos/org.apache.karaf.demos.command/3.0.0-SNAPSHOT/org.apache.karaf.demos.command-3.0.0-SNAPSHOT.pom
[JENKINS] Archiving <https://builds.apache.org/job/Karaf/ws/karaf/webconsole/console/pom.xml>
to org.apache.karaf.webconsole/org.apache.karaf.webconsole.console/3.0.0-SNAPSHOT/org.apache.karaf.webconsole.console-3.0.0-SNAPSHOT.pom
[JENKINS] Archiving <https://builds.apache.org/job/Karaf/ws/karaf/util/pom.xml> to org.apache.karaf/org.apache.karaf.util/3.0.0-SNAPSHOT/org.apache.karaf.util-3.0.0-SNAPSHOT.pom
[JENKINS] Archiving <https://builds.apache.org/job/Karaf/ws/karaf/web/core/pom.xml>
to org.apache.karaf.web/org.apache.karaf.web.core/3.0.0-SNAPSHOT/org.apache.karaf.web.core-3.0.0-SNAPSHOT.pom
[JENKINS] Archiving <https://builds.apache.org/job/Karaf/ws/karaf/shell/console/pom.xml>
to org.apache.karaf.shell/org.apache.karaf.shell.console/3.0.0-SNAPSHOT/org.apache.karaf.shell.console-3.0.0-SNAPSHOT.pom
[JENKINS] Archiving <https://builds.apache.org/job/Karaf/ws/karaf/package/command/pom.xml>
to org.apache.karaf.package/org.apache.karaf.package.command/3.0.0-SNAPSHOT/org.apache.karaf.package.command-3.0.0-SNAPSHOT.pom
[JENKINS] Archiving <https://builds.apache.org/job/Karaf/ws/karaf/webconsole/branding/pom.xml>
to org.apache.karaf.webconsole/org.apache.karaf.webconsole.branding/3.0.0-SNAPSHOT/org.apache.karaf.webconsole.branding-3.0.0-SNAPSHOT.pom
[JENKINS] Archiving <https://builds.apache.org/job/Karaf/ws/karaf/service/command/pom.xml>
to org.apache.karaf.service/org.apache.karaf.service.command/3.0.0-SNAPSHOT/org.apache.karaf.service.command-3.0.0-SNAPSHOT.pom
[JENKINS] Archiving <https://builds.apache.org/job/Karaf/ws/karaf/service/core/pom.xml>
to org.apache.karaf.service/org.apache.karaf.service.core/3.0.0-SNAPSHOT/org.apache.karaf.service.core-3.0.0-SNAPSHOT.pom
[JENKINS] Archiving <https://builds.apache.org/job/Karaf/ws/karaf/http/pom.xml> to org.apache.karaf.http/http/3.0.0-SNAPSHOT/http-3.0.0-SNAPSHOT.pom
[JENKINS] Archiving <https://builds.apache.org/job/Karaf/ws/karaf/features/obr/pom.xml>
to org.apache.karaf.features/org.apache.karaf.features.obr/3.0.0-SNAPSHOT/org.apache.karaf.features.obr-3.0.0-SNAPSHOT.pom
[JENKINS] Archiving <https://builds.apache.org/job/Karaf/ws/karaf/instance/core/pom.xml>
to org.apache.karaf.instance/org.apache.karaf.instance.core/3.0.0-SNAPSHOT/org.apache.karaf.instance.core-3.0.0-SNAPSHOT.pom
[JENKINS] Archiving <https://builds.apache.org/job/Karaf/ws/karaf/instance/pom.xml>
to org.apache.karaf.instance/instance/3.0.0-SNAPSHOT/instance-3.0.0-SNAPSHOT.pom
[JENKINS] Archiving <https://builds.apache.org/job/Karaf/ws/karaf/config/command/pom.xml>
to org.apache.karaf.config/org.apache.karaf.config.command/3.0.0-SNAPSHOT/org.apache.karaf.config.command-3.0.0-SNAPSHOT.pom
[JENKINS] Archiving <https://builds.apache.org/job/Karaf/ws/karaf/log/command/pom.xml>
to org.apache.karaf.log/org.apache.karaf.log.command/3.0.0-SNAPSHOT/org.apache.karaf.log.command-3.0.0-SNAPSHOT.pom
[JENKINS] Archiving <https://builds.apache.org/job/Karaf/ws/karaf/log/pom.xml> to org.apache.karaf.log/log/3.0.0-SNAPSHOT/log-3.0.0-SNAPSHOT.pom
[JENKINS] Archiving <https://builds.apache.org/job/Karaf/ws/karaf/diagnostic/pom.xml>
to org.apache.karaf.diagnostic/diagnostic/3.0.0-SNAPSHOT/diagnostic-3.0.0-SNAPSHOT.pom
[JENKINS] Archiving <https://builds.apache.org/job/Karaf/ws/karaf/region/core/pom.xml>
to org.apache.karaf.region/org.apache.karaf.region.core/3.0.0-SNAPSHOT/org.apache.karaf.region.core-3.0.0-SNAPSHOT.pom
[JENKINS] Archiving <https://builds.apache.org/job/Karaf/ws/karaf/obr/core/pom.xml>
to org.apache.karaf.obr/org.apache.karaf.obr.core/3.0.0-SNAPSHOT/org.apache.karaf.obr.core-3.0.0-SNAPSHOT.pom
[JENKINS] Archiving <https://builds.apache.org/job/Karaf/ws/karaf/archetypes/feature/pom.xml>
to org.apache.karaf.archetypes/karaf-feature-archetype/3.0.0-SNAPSHOT/karaf-feature-archetype-3.0.0-SNAPSHOT.pom
[JENKINS] Archiving <https://builds.apache.org/job/Karaf/ws/karaf/demos/pom.xml> to
org.apache.karaf.demos/demos/3.0.0-SNAPSHOT/demos-3.0.0-SNAPSHOT.pom
[JENKINS] Archiving <https://builds.apache.org/job/Karaf/ws/karaf/http/core/pom.xml>
to org.apache.karaf.http/org.apache.karaf.http.core/3.0.0-SNAPSHOT/org.apache.karaf.http.core-3.0.0-SNAPSHOT.pom
[JENKINS] Archiving <https://builds.apache.org/job/Karaf/ws/karaf/kar/pom.xml> to org.apache.karaf.kar/kar/3.0.0-SNAPSHOT/kar-3.0.0-SNAPSHOT.pom
[JENKINS] Archiving <https://builds.apache.org/job/Karaf/ws/karaf/demos/branding/pom.xml>
to org.apache.karaf.demos/org.apache.karaf.demos.branding.shell/3.0.0-SNAPSHOT/org.apache.karaf.demos.branding.shell-3.0.0-SNAPSHOT.pom
[JENKINS] Archiving <https://builds.apache.org/job/Karaf/ws/karaf/jaas/command/pom.xml>
to org.apache.karaf.jaas/org.apache.karaf.jaas.command/3.0.0-SNAPSHOT/org.apache.karaf.jaas.command-3.0.0-SNAPSHOT.pom
[JENKINS] Archiving <https://builds.apache.org/job/Karaf/ws/karaf/service/pom.xml> to
org.apache.karaf.service/service/3.0.0-SNAPSHOT/service-3.0.0-SNAPSHOT.pom
[JENKINS] Archiving <https://builds.apache.org/job/Karaf/ws/karaf/wrapper/core/pom.xml>
to org.apache.karaf.wrapper/org.apache.karaf.wrapper.core/3.0.0-SNAPSHOT/org.apache.karaf.wrapper.core-3.0.0-SNAPSHOT.pom
[JENKINS] Archiving <https://builds.apache.org/job/Karaf/ws/karaf/demos/deployer/pom.xml>
to org.apache.karaf.demos/org.apache.karaf.demos.deployer/3.0.0-SNAPSHOT/org.apache.karaf.demos.deployer-3.0.0-SNAPSHOT.pom
[JENKINS] Archiving <https://builds.apache.org/job/Karaf/ws/karaf/assemblies/pom.xml>
to org.apache.karaf.assemblies/assemblies/3.0.0-SNAPSHOT/assemblies-3.0.0-SNAPSHOT.pom
[JENKINS] Archiving <https://builds.apache.org/job/Karaf/ws/karaf/jaas/boot/pom.xml>
to org.apache.karaf.jaas/org.apache.karaf.jaas.boot/3.0.0-SNAPSHOT/org.apache.karaf.jaas.boot-3.0.0-SNAPSHOT.pom
[JENKINS] Archiving <https://builds.apache.org/job/Karaf/ws/karaf/system/pom.xml> to
org.apache.karaf.system/system/3.0.0-SNAPSHOT/system-3.0.0-SNAPSHOT.pom
[JENKINS] Archiving <https://builds.apache.org/job/Karaf/ws/karaf/kar/command/pom.xml>
to org.apache.karaf.kar/org.apache.karaf.kar.command/3.0.0-SNAPSHOT/org.apache.karaf.kar.command-3.0.0-SNAPSHOT.pom
[JENKINS] Archiving <https://builds.apache.org/job/Karaf/ws/karaf/assemblies/features/enterprise/pom.xml>
to org.apache.karaf.features/enterprise/3.0.0-SNAPSHOT/enterprise-3.0.0-SNAPSHOT.pom
[JENKINS] Archiving <https://builds.apache.org/job/Karaf/ws/karaf/diagnostic/command/pom.xml>
to org.apache.karaf.diagnostic/org.apache.karaf.diagnostic.command/3.0.0-SNAPSHOT/org.apache.karaf.diagnostic.command-3.0.0-SNAPSHOT.pom
[JENKINS] Archiving <https://builds.apache.org/job/Karaf/ws/karaf/region/pom.xml> to
org.apache.karaf.region/region/3.0.0-SNAPSHOT/region-3.0.0-SNAPSHOT.pom
[JENKINS] Archiving <https://builds.apache.org/job/Karaf/ws/karaf/webconsole/gogo/pom.xml>
to org.apache.karaf.webconsole/org.apache.karaf.webconsole.gogo/3.0.0-SNAPSHOT/org.apache.karaf.webconsole.gogo-3.0.0-SNAPSHOT.pom
[JENKINS] Archiving <https://builds.apache.org/job/Karaf/ws/karaf/log/core/pom.xml>
to org.apache.karaf.log/org.apache.karaf.log.core/3.0.0-SNAPSHOT/org.apache.karaf.log.core-3.0.0-SNAPSHOT.pom
[JENKINS] Archiving <https://builds.apache.org/job/Karaf/ws/karaf/bundle/springstate/pom.xml>
to org.apache.karaf.bundle/org.apache.karaf.bundle.springstate/3.0.0-SNAPSHOT/org.apache.karaf.bundle.springstate-3.0.0-SNAPSHOT.pom
[JENKINS] Archiving <https://builds.apache.org/job/Karaf/ws/karaf/wrapper/pom.xml> to
org.apache.karaf.wrapper/wrapper/3.0.0-SNAPSHOT/wrapper-3.0.0-SNAPSHOT.pom
[JENKINS] Archiving <https://builds.apache.org/job/Karaf/ws/karaf/demos/deployer/kar/pom.xml>
to org.apache.karaf.demos/my-kar/3.0.0-SNAPSHOT/my-kar-3.0.0-SNAPSHOT.pom
[JENKINS] Archiving <https://builds.apache.org/job/Karaf/ws/karaf/shell/table/pom.xml>
to org.apache.karaf.shell/org.apache.karaf.shell.table/3.0.0-SNAPSHOT/org.apache.karaf.shell.table-3.0.0-SNAPSHOT.pom
[JENKINS] Archiving <https://builds.apache.org/job/Karaf/ws/karaf/shell/commands/pom.xml>
to org.apache.karaf.shell/org.apache.karaf.shell.commands/3.0.0-SNAPSHOT/org.apache.karaf.shell.commands-3.0.0-SNAPSHOT.pom
[JENKINS] Archiving <https://builds.apache.org/job/Karaf/ws/karaf/demos/web/pom.xml>
to org.apache.karaf.demos/web/3.0.0-SNAPSHOT/web-3.0.0-SNAPSHOT.pom
[JENKINS] Archiving <https://builds.apache.org/job/Karaf/ws/karaf/tooling/karaf-maven-plugin/pom.xml>
to org.apache.karaf.tooling/karaf-maven-plugin/3.0.0-SNAPSHOT/karaf-maven-plugin-3.0.0-SNAPSHOT.pom
[JENKINS] Archiving <https://builds.apache.org/job/Karaf/ws/karaf/http/command/pom.xml>
to org.apache.karaf.http/org.apache.karaf.http.command/3.0.0-SNAPSHOT/org.apache.karaf.http.command-3.0.0-SNAPSHOT.pom
[JENKINS] Archiving <https://builds.apache.org/job/Karaf/ws/karaf/demos/dump/pom.xml>
to org.apache.karaf.demos/dump/3.0.0-SNAPSHOT/dump-3.0.0-SNAPSHOT.pom
[JENKINS] Archiving <https://builds.apache.org/job/Karaf/ws/karaf/webconsole/instance/pom.xml>
to org.apache.karaf.webconsole/org.apache.karaf.webconsole.instance/3.0.0-SNAPSHOT/org.apache.karaf.webconsole.instance-3.0.0-SNAPSHOT.pom
[JENKINS] Archiving <https://builds.apache.org/job/Karaf/ws/karaf/assemblies/apache-karaf-minimal/pom.xml>
to org.apache.karaf/apache-karaf-minimal/3.0.0-SNAPSHOT/apache-karaf-minimal-3.0.0-SNAPSHOT.pom
[JENKINS] Archiving <https://builds.apache.org/job/Karaf/ws/karaf/exception/pom.xml>
to org.apache.karaf/org.apache.karaf.exception/3.0.0-SNAPSHOT/org.apache.karaf.exception-3.0.0-SNAPSHOT.pom
[JENKINS] Archiving <https://builds.apache.org/job/Karaf/ws/karaf/shell/pom.xml> to
org.apache.karaf.shell/shell/3.0.0-SNAPSHOT/shell-3.0.0-SNAPSHOT.pom
[JENKINS] Archiving <https://builds.apache.org/job/Karaf/ws/karaf/archetypes/bundle/pom.xml>
to org.apache.karaf.archetypes/karaf-bundle-archetype/3.0.0-SNAPSHOT/karaf-bundle-archetype-3.0.0-SNAPSHOT.pom
[JENKINS] Archiving <https://builds.apache.org/job/Karaf/ws/karaf/pom.xml> to org.apache.karaf/karaf/3.0.0-SNAPSHOT/karaf-3.0.0-SNAPSHOT.pom
[JENKINS] Archiving <https://builds.apache.org/job/Karaf/ws/karaf/archetypes/assembly/pom.xml>
to org.apache.karaf.archetypes/karaf-assembly-archetype/3.0.0-SNAPSHOT/karaf-assembly-archetype-3.0.0-SNAPSHOT.pom
[JENKINS] Archiving <https://builds.apache.org/job/Karaf/ws/karaf/management/pom.xml>
to org.apache.karaf.management/management/3.0.0-SNAPSHOT/management-3.0.0-SNAPSHOT.pom
[JENKINS] Archiving <https://builds.apache.org/job/Karaf/ws/karaf/assemblies/features/framework/pom.xml>
to org.apache.karaf.features/framework/3.0.0-SNAPSHOT/framework-3.0.0-SNAPSHOT.pom
[JENKINS] Archiving <https://builds.apache.org/job/Karaf/ws/karaf/system/command/pom.xml>
to org.apache.karaf.system/org.apache.karaf.system.command/3.0.0-SNAPSHOT/org.apache.karaf.system.command-3.0.0-SNAPSHOT.pom
[JENKINS] Archiving <https://builds.apache.org/job/Karaf/ws/karaf/web/command/pom.xml>
to org.apache.karaf.web/org.apache.karaf.web.command/3.0.0-SNAPSHOT/org.apache.karaf.web.command-3.0.0-SNAPSHOT.pom
[JENKINS] Archiving <https://builds.apache.org/job/Karaf/ws/karaf/archetypes/blueprint/pom.xml>
to org.apache.karaf.archetypes/karaf-blueprint-archetype/3.0.0-SNAPSHOT/karaf-blueprint-archetype-3.0.0-SNAPSHOT.pom
[JENKINS] Archiving <https://builds.apache.org/job/Karaf/ws/karaf/scheduler/core/pom.xml>
to org.apache.karaf.scheduler/org.apache.karaf.scheduler.core/3.0.0-SNAPSHOT/org.apache.karaf.scheduler.core-3.0.0-SNAPSHOT.pom
[JENKINS] Archiving <https://builds.apache.org/job/Karaf/ws/karaf/deployer/spring/pom.xml>
to org.apache.karaf.deployer/org.apache.karaf.deployer.spring/3.0.0-SNAPSHOT/org.apache.karaf.deployer.spring-3.0.0-SNAPSHOT.pom
[JENKINS] Archiving <https://builds.apache.org/job/Karaf/ws/karaf/jaas/jasypt/pom.xml>
to org.apache.karaf.jaas/org.apache.karaf.jaas.jasypt/3.0.0-SNAPSHOT/org.apache.karaf.jaas.jasypt-3.0.0-SNAPSHOT.pom
[JENKINS] Archiving <https://builds.apache.org/job/Karaf/ws/karaf/scheduler/pom.xml>
to org.apache.karaf/scheduler/3.0.0-SNAPSHOT/scheduler-3.0.0-SNAPSHOT.pom
[JENKINS] Archiving <https://builds.apache.org/job/Karaf/ws/karaf/scr/examples/component-factory/pom.xml>
to org.apache.karaf.scr.examples/org.apache.karaf.scr.examples.component.factories/3.0.0-SNAPSHOT/org.apache.karaf.scr.examples.component.factories-3.0.0-SNAPSHOT.pom
[JENKINS] Archiving <https://builds.apache.org/job/Karaf/ws/karaf/diagnostic/core/pom.xml>
to org.apache.karaf.diagnostic/org.apache.karaf.diagnostic.core/3.0.0-SNAPSHOT/org.apache.karaf.diagnostic.core-3.0.0-SNAPSHOT.pom
[JENKINS] Archiving <https://builds.apache.org/job/Karaf/ws/karaf/deployer/pom.xml>
to org.apache.karaf.deployer/deployer/3.0.0-SNAPSHOT/deployer-3.0.0-SNAPSHOT.pom
[JENKINS] Archiving <https://builds.apache.org/job/Karaf/ws/karaf/web/pom.xml> to org.apache.karaf.web/web/3.0.0-SNAPSHOT/web-3.0.0-SNAPSHOT.pom
[JENKINS] Archiving <https://builds.apache.org/job/Karaf/ws/karaf/config/pom.xml> to
org.apache.karaf.config/config/3.0.0-SNAPSHOT/config-3.0.0-SNAPSHOT.pom
[JENKINS] Archiving <https://builds.apache.org/job/Karaf/ws/karaf/shell/ssh/pom.xml>
to org.apache.karaf.shell/org.apache.karaf.shell.ssh/3.0.0-SNAPSHOT/org.apache.karaf.shell.ssh-3.0.0-SNAPSHOT.pom
[JENKINS] Archiving <https://builds.apache.org/job/Karaf/ws/karaf/region/persist/pom.xml>
to org.apache.karaf.region/org.apache.karaf.region.persist/3.0.0-SNAPSHOT/org.apache.karaf.region.persist-3.0.0-SNAPSHOT.pom
[JENKINS] Archiving <https://builds.apache.org/job/Karaf/ws/karaf/instance/command/pom.xml>
to org.apache.karaf.instance/org.apache.karaf.instance.command/3.0.0-SNAPSHOT/org.apache.karaf.instance.command-3.0.0-SNAPSHOT.pom
[JENKINS] Archiving <https://builds.apache.org/job/Karaf/ws/karaf/webconsole/http/pom.xml>
to org.apache.karaf.webconsole/org.apache.karaf.webconsole.http/3.0.0-SNAPSHOT/org.apache.karaf.webconsole.http-3.0.0-SNAPSHOT.pom
[JENKINS] Archiving <https://builds.apache.org/job/Karaf/ws/karaf/deployer/features/pom.xml>
to org.apache.karaf.deployer/org.apache.karaf.deployer.features/3.0.0-SNAPSHOT/org.apache.karaf.deployer.features-3.0.0-SNAPSHOT.pom
[JENKINS] Archiving <https://builds.apache.org/job/Karaf/ws/karaf/client/pom.xml> to
org.apache.karaf/org.apache.karaf.client/3.0.0-SNAPSHOT/org.apache.karaf.client-3.0.0-SNAPSHOT.pom
[JENKINS] Archiving <https://builds.apache.org/job/Karaf/ws/karaf/assemblies/apache-karaf/pom.xml>
to org.apache.karaf/apache-karaf/3.0.0-SNAPSHOT/apache-karaf-3.0.0-SNAPSHOT.pom
[JENKINS] Archiving <https://builds.apache.org/job/Karaf/ws/karaf/archetypes/kar/pom.xml>
to org.apache.karaf.archetypes/karaf-kar-archetype/3.0.0-SNAPSHOT/karaf-kar-archetype-3.0.0-SNAPSHOT.pom
[JENKINS] Archiving <https://builds.apache.org/job/Karaf/ws/karaf/scr/management/pom.xml>
to org.apache.karaf.scr/org.apache.karaf.scr.management/3.0.0-SNAPSHOT/org.apache.karaf.scr.management-3.0.0-SNAPSHOT.pom
Build timed out (after 70 minutes). Marking the build as aborted.
Sending e-mails to: commits@karaf.apache.org null@apache.org
channel stopped

Mime
View raw message