karaf-commits mailing list archives

Site index · List index
Message view « Date » · « Thread »
Top « Date » · « Thread »
From Apache Jenkins Server <jenk...@builds.apache.org>
Subject Build failed in Jenkins: Karaf » Apache Karaf :: Main #2343
Date Fri, 08 Nov 2013 04:50:08 GMT
See <https://builds.apache.org/job/Karaf/org.apache.karaf$org.apache.karaf.main/2343/>

------------------------------------------
[INFO]                                                                         
[INFO] ------------------------------------------------------------------------
[INFO] Building Apache Karaf :: Main 3.0.0-SNAPSHOT
[INFO] ------------------------------------------------------------------------
[INFO] 
[INFO] --- maven-clean-plugin:2.5:clean (default-clean) @ org.apache.karaf.main ---
[INFO] 
[INFO] --- maven-enforcer-plugin:1.1:enforce (enforce-maven) @ org.apache.karaf.main ---
[INFO] 
[INFO] --- maven-bundle-plugin:2.4.0:cleanVersions (cleanVersions) @ org.apache.karaf.main
---
[INFO] 
[INFO] --- maven-remote-resources-plugin:1.3:process (default) @ org.apache.karaf.main ---
[INFO] 
[INFO] --- maven-resources-plugin:2.5:resources (default-resources) @ org.apache.karaf.main
---
[debug] execute contextualize
[INFO] Using 'UTF-8' encoding to copy filtered resources.
[INFO] Copying 2 resources
[INFO] Copying 3 resources
[INFO] 
[INFO] --- maven-compiler-plugin:2.5.1:compile (default-compile) @ org.apache.karaf.main ---
[INFO] Compiling 33 source files to <https://builds.apache.org/job/Karaf/org.apache.karaf$org.apache.karaf.main/ws/target/classes>
[INFO] 
[INFO] --- maven-resources-plugin:2.5:testResources (default-testResources) @ org.apache.karaf.main
---
[debug] execute contextualize
[INFO] Using 'UTF-8' encoding to copy filtered resources.
[INFO] Copying 7 resources
[INFO] Copying 3 resources
[INFO] 
[INFO] --- maven-compiler-plugin:2.5.1:testCompile (default-testCompile) @ org.apache.karaf.main
---
[INFO] Compiling 19 source files to <https://builds.apache.org/job/Karaf/org.apache.karaf$org.apache.karaf.main/ws/target/test-classes>
[INFO] 
[INFO] --- maven-surefire-plugin:2.12:test (default-test) @ org.apache.karaf.main ---
[INFO] Surefire report directory: <https://builds.apache.org/job/Karaf/org.apache.karaf$org.apache.karaf.main/ws/target/surefire-reports>

-------------------------------------------------------
 T E S T S
-------------------------------------------------------
Running org.apache.karaf.main.lock.MySQLJDBCLockIntegrationTest
Tests run: 1, Failures: 0, Errors: 0, Skipped: 1, Time elapsed: 0.012 sec
Running org.apache.karaf.main.lock.OracleJDBCLockIntegrationTest
Tests run: 1, Failures: 0, Errors: 0, Skipped: 1, Time elapsed: 0.001 sec
Running org.apache.karaf.main.lock.PostgreSQLJDBCLockIntegrationTest
Tests run: 1, Failures: 0, Errors: 0, Skipped: 1, Time elapsed: 0 sec
Running org.apache.karaf.main.lock.StatementsTest
Tests run: 6, Failures: 0, Errors: 0, Skipped: 0, Time elapsed: 0.013 sec
Running org.apache.karaf.main.lock.DefaultJDBCLockTest
Nov 8, 2013 4:44:40 AM org.apache.karaf.main.lock.DefaultJDBCLock schemaExists
SEVERE: Error testing for db table: java.lang.NullPointerException
Nov 8, 2013 4:44:40 AM org.apache.karaf.main.lock.DefaultJDBCLock createSchema
SEVERE: Could not create schema: java.lang.IllegalStateException: missing behavior definition
for the preceding method call:
Connection.getMetaData()
Usage is: expect(a.foo()).andXXX()
Nov 8, 2013 4:44:40 AM org.apache.karaf.main.lock.DefaultJDBCLock updateLock
WARNING: Failed to update database lock: java.sql.SQLException
Nov 8, 2013 4:44:40 AM org.apache.karaf.main.lock.DefaultJDBCLock updateLock
WARNING: Failed to update database lock: java.sql.SQLException
Nov 8, 2013 4:44:40 AM org.apache.karaf.main.lock.DefaultJDBCLock isAlive
SEVERE: Lost lock!
Nov 8, 2013 4:44:40 AM org.apache.karaf.main.lock.DefaultJDBCLock isAlive
SEVERE: Lost lock!
Nov 8, 2013 4:44:40 AM org.apache.karaf.main.lock.DefaultJDBCLock updateLock
WARNING: Failed to update database lock: java.sql.SQLException
Tests run: 14, Failures: 0, Errors: 0, Skipped: 0, Time elapsed: 0.12 sec
Running org.apache.karaf.main.lock.OracleJDBCLockTest
Nov 8, 2013 4:44:40 AM org.apache.karaf.main.lock.DefaultJDBCLock aquireLock
WARNING: Failed to acquire database lock: java.sql.SQLException
Nov 8, 2013 4:44:40 AM org.apache.karaf.main.lock.DefaultJDBCLock aquireLock
WARNING: Failed to acquire database lock: java.sql.SQLException
Nov 8, 2013 4:44:40 AM org.apache.karaf.main.lock.DefaultJDBCLock aquireLock
WARNING: Failed to acquire database lock: java.sql.SQLException
Nov 8, 2013 4:44:40 AM org.apache.karaf.main.lock.DefaultJDBCLock isAlive
SEVERE: Lost lock!
Nov 8, 2013 4:44:40 AM org.apache.karaf.main.lock.DefaultJDBCLock isAlive
SEVERE: Lost lock!
Tests run: 13, Failures: 0, Errors: 0, Skipped: 0, Time elapsed: 0.018 sec
Running org.apache.karaf.main.lock.MySQLJDBCLockTest
Nov 8, 2013 4:44:40 AM org.apache.karaf.main.lock.DefaultJDBCLock schemaExists
SEVERE: Error testing for db table: java.lang.NullPointerException
Nov 8, 2013 4:44:40 AM org.apache.karaf.main.lock.DefaultJDBCLock createSchema
SEVERE: Could not create schema: java.lang.IllegalStateException: missing behavior definition
for the preceding method call:
Connection.getMetaData()
Usage is: expect(a.foo()).andXXX()
Nov 8, 2013 4:44:40 AM org.apache.karaf.main.lock.DefaultJDBCLock updateLock
WARNING: Failed to update database lock: java.sql.SQLException
Nov 8, 2013 4:44:40 AM org.apache.karaf.main.lock.DefaultJDBCLock updateLock
WARNING: Failed to update database lock: java.sql.SQLException
Nov 8, 2013 4:44:40 AM org.apache.karaf.main.lock.DefaultJDBCLock isAlive
SEVERE: Lost lock!
Nov 8, 2013 4:44:40 AM org.apache.karaf.main.lock.DefaultJDBCLock isAlive
SEVERE: Lost lock!
Nov 8, 2013 4:44:40 AM org.apache.karaf.main.lock.DefaultJDBCLock updateLock
WARNING: Failed to update database lock: java.sql.SQLException
Tests run: 14, Failures: 0, Errors: 0, Skipped: 0, Time elapsed: 0.02 sec
Running org.apache.karaf.main.lock.DefaultJDBCLockIntegrationTest
Tests run: 1, Failures: 0, Errors: 0, Skipped: 1, Time elapsed: 0 sec
Running org.apache.karaf.main.lock.DerbyJDBCLockIntegrationTest
Tests run: 1, Failures: 0, Errors: 0, Skipped: 1, Time elapsed: 0 sec
Running org.apache.karaf.main.lock.DerbyJDBCLockTest
Nov 8, 2013 4:44:40 AM org.apache.karaf.main.lock.DefaultJDBCLock schemaExists
SEVERE: Error testing for db table: java.lang.NullPointerException
Nov 8, 2013 4:44:40 AM org.apache.karaf.main.lock.DefaultJDBCLock createSchema
SEVERE: Could not create schema: java.lang.IllegalStateException: missing behavior definition
for the preceding method call:
Connection.getMetaData()
Usage is: expect(a.foo()).andXXX()
Nov 8, 2013 4:44:40 AM org.apache.karaf.main.lock.DefaultJDBCLock updateLock
WARNING: Failed to update database lock: java.sql.SQLException
Nov 8, 2013 4:44:40 AM org.apache.karaf.main.lock.DefaultJDBCLock updateLock
WARNING: Failed to update database lock: java.sql.SQLException
Nov 8, 2013 4:44:40 AM org.apache.karaf.main.lock.DefaultJDBCLock isAlive
SEVERE: Lost lock!
Nov 8, 2013 4:44:40 AM org.apache.karaf.main.lock.DefaultJDBCLock isAlive
SEVERE: Lost lock!
Nov 8, 2013 4:44:40 AM org.apache.karaf.main.lock.DefaultJDBCLock updateLock
WARNING: Failed to update database lock: java.sql.SQLException
Tests run: 14, Failures: 0, Errors: 0, Skipped: 0, Time elapsed: 0.016 sec
Running org.apache.karaf.main.lock.PostgreSQLJDBCLockTest
Nov 8, 2013 4:44:40 AM org.apache.karaf.main.lock.DefaultJDBCLock updateLock
WARNING: Failed to update database lock: java.sql.SQLException
Nov 8, 2013 4:44:40 AM org.apache.karaf.main.lock.DefaultJDBCLock updateLock
WARNING: Failed to update database lock: java.sql.SQLException
Nov 8, 2013 4:44:40 AM org.apache.karaf.main.lock.DefaultJDBCLock schemaExists
SEVERE: Error testing for db table: java.lang.NullPointerException
Nov 8, 2013 4:44:40 AM org.apache.karaf.main.lock.DefaultJDBCLock createSchema
SEVERE: Could not create schema: java.lang.IllegalStateException: missing behavior definition
for the preceding method call:
Connection.getMetaData()
Usage is: expect(a.foo()).andXXX()
Nov 8, 2013 4:44:40 AM org.apache.karaf.main.lock.DefaultJDBCLock isAlive
SEVERE: Lost lock!
Nov 8, 2013 4:44:40 AM org.apache.karaf.main.lock.DefaultJDBCLock isAlive
SEVERE: Lost lock!
Nov 8, 2013 4:44:40 AM org.apache.karaf.main.lock.DefaultJDBCLock updateLock
WARNING: Failed to update database lock: java.sql.SQLException
Tests run: 14, Failures: 0, Errors: 0, Skipped: 0, Time elapsed: 0.017 sec
Running org.apache.karaf.main.MainLockingTest
Nov 8, 2013 4:44:40 AM org.apache.karaf.main.Main launch
INFO: Installing and starting initial bundles
Nov 8, 2013 4:44:40 AM org.apache.karaf.main.Main launch
INFO: All initial bundles installed and set to start
Nov 8, 2013 4:44:40 AM org.apache.karaf.main.Main$KarafLockCallback lockAquired
INFO: Lock acquired. Setting startlevel to 100
SLF4J: Failed to load class "org.slf4j.impl.StaticLoggerBinder".
SLF4J: Defaulting to no-operation (NOP) logger implementation
SLF4J: See http://www.slf4j.org/codes.html#StaticLoggerBinder for further details.
Write: /tmp/mylitte2935781209247799973jar
Starting timeout activator
Nov 8, 2013 4:44:43 AM org.apache.karaf.main.Main$KarafLockCallback lockLost
WARNING: Lock lost. Setting startlevel to 1
Timeout activator asked to stopped
Stopping timeout activator
Tests run: 1, Failures: 0, Errors: 0, Skipped: 0, Time elapsed: 16.244 sec
Running org.apache.karaf.main.MainStartTest
Nov 8, 2013 4:44:56 AM org.apache.karaf.main.Main launch
INFO: Installing and starting initial bundles
Nov 8, 2013 4:44:56 AM org.apache.karaf.main.Main launch
INFO: All initial bundles installed and set to start
Nov 8, 2013 4:44:56 AM org.apache.karaf.main.Main$KarafLockCallback lockAquired
INFO: Lock acquired. Setting startlevel to 100
Nov 8, 2013 4:44:57 AM org.apache.karaf.main.Main launch
INFO: Installing and starting initial bundles
Nov 8, 2013 4:44:57 AM org.apache.karaf.main.Main launch
INFO: All initial bundles installed and set to start
Nov 8, 2013 4:44:57 AM org.apache.karaf.main.Main$KarafLockCallback lockAquired
INFO: Lock acquired. Setting startlevel to 100
Write: /tmp/mylitte5048875805052875809jar
Starting timeout activator

Results :

Tests run: 81, Failures: 0, Errors: 0, Skipped: 5

[JENKINS] Recording test results

Mime
View raw message