karaf-commits mailing list archives

Site index · List index
Message view « Date » · « Thread »
Top « Date » · « Thread »
From Apache Jenkins Server <jenk...@builds.apache.org>
Subject Build failed in Jenkins: Karaf » Apache Karaf :: Main #2272
Date Sat, 05 Oct 2013 01:02:41 GMT
See <https://builds.apache.org/job/Karaf/org.apache.karaf$org.apache.karaf.main/2272/>

------------------------------------------
Oct 5, 2013 12:58:35 AM org.apache.maven.cli.event.ExecutionEventLogger projectStarted
INFO:                                                                         
Oct 5, 2013 12:58:35 AM org.apache.maven.cli.event.ExecutionEventLogger projectStarted
INFO: ------------------------------------------------------------------------
Oct 5, 2013 12:58:35 AM org.apache.maven.cli.event.ExecutionEventLogger projectStarted
INFO: Building Apache Karaf :: Main 3.0.0-SNAPSHOT
Oct 5, 2013 12:58:35 AM org.apache.maven.cli.event.ExecutionEventLogger projectStarted
INFO: ------------------------------------------------------------------------
Oct 5, 2013 12:58:36 AM org.apache.maven.cli.event.ExecutionEventLogger mojoStarted
INFO: 
Oct 5, 2013 12:58:36 AM org.apache.maven.cli.event.ExecutionEventLogger mojoStarted
INFO: --- maven-clean-plugin:2.5:clean (default-clean) @ org.apache.karaf.main ---
Oct 5, 2013 12:58:36 AM org.apache.maven.cli.event.ExecutionEventLogger mojoStarted
INFO: 
Oct 5, 2013 12:58:36 AM org.apache.maven.cli.event.ExecutionEventLogger mojoStarted
INFO: --- maven-enforcer-plugin:1.1:enforce (enforce-maven) @ org.apache.karaf.main ---
Oct 5, 2013 12:58:36 AM org.apache.maven.cli.event.ExecutionEventLogger mojoStarted
INFO: 
Oct 5, 2013 12:58:36 AM org.apache.maven.cli.event.ExecutionEventLogger mojoStarted
INFO: --- maven-bundle-plugin:2.3.7:cleanVersions (cleanVersions) @ org.apache.karaf.main
---
Oct 5, 2013 12:58:36 AM org.apache.maven.cli.event.ExecutionEventLogger mojoStarted
INFO: 
Oct 5, 2013 12:58:36 AM org.apache.maven.cli.event.ExecutionEventLogger mojoStarted
INFO: --- maven-remote-resources-plugin:1.3:process (default) @ org.apache.karaf.main ---
Oct 5, 2013 12:58:36 AM org.apache.maven.cli.event.ExecutionEventLogger mojoStarted
INFO: 
Oct 5, 2013 12:58:36 AM org.apache.maven.cli.event.ExecutionEventLogger mojoStarted
INFO: --- maven-resources-plugin:2.5:resources (default-resources) @ org.apache.karaf.main
---
[debug] execute contextualize
[INFO] Using 'UTF-8' encoding to copy filtered resources.
[INFO] Copying 2 resources
[INFO] Copying 3 resources
Oct 5, 2013 12:58:37 AM org.apache.maven.cli.event.ExecutionEventLogger mojoStarted
INFO: 
Oct 5, 2013 12:58:37 AM org.apache.maven.cli.event.ExecutionEventLogger mojoStarted
INFO: --- maven-compiler-plugin:2.5.1:compile (default-compile) @ org.apache.karaf.main ---
[INFO] Compiling 31 source files to <https://builds.apache.org/job/Karaf/org.apache.karaf$org.apache.karaf.main/ws/target/classes>
Oct 5, 2013 12:58:37 AM org.apache.maven.cli.event.ExecutionEventLogger mojoStarted
INFO: 
Oct 5, 2013 12:58:37 AM org.apache.maven.cli.event.ExecutionEventLogger mojoStarted
INFO: --- maven-resources-plugin:2.5:testResources (default-testResources) @ org.apache.karaf.main
---
[debug] execute contextualize
[INFO] Using 'UTF-8' encoding to copy filtered resources.
[INFO] Copying 7 resources
[INFO] Copying 3 resources
Oct 5, 2013 12:58:37 AM org.apache.maven.cli.event.ExecutionEventLogger mojoStarted
INFO: 
Oct 5, 2013 12:58:37 AM org.apache.maven.cli.event.ExecutionEventLogger mojoStarted
INFO: --- maven-compiler-plugin:2.5.1:testCompile (default-testCompile) @ org.apache.karaf.main
---
[INFO] Compiling 19 source files to <https://builds.apache.org/job/Karaf/org.apache.karaf$org.apache.karaf.main/ws/target/test-classes>
Oct 5, 2013 12:58:38 AM org.apache.maven.cli.event.ExecutionEventLogger mojoStarted
INFO: 
Oct 5, 2013 12:58:38 AM org.apache.maven.cli.event.ExecutionEventLogger mojoStarted
INFO: --- maven-surefire-plugin:2.12:test (default-test) @ org.apache.karaf.main ---
[INFO] Surefire report directory: <https://builds.apache.org/job/Karaf/org.apache.karaf$org.apache.karaf.main/ws/target/surefire-reports>

-------------------------------------------------------
 T E S T S
-------------------------------------------------------
Running org.apache.karaf.main.lock.MySQLJDBCLockTest
Oct 5, 2013 12:58:38 AM org.apache.karaf.main.lock.DefaultJDBCLock schemaExists
SEVERE: Error testing for db table: java.lang.NullPointerException
Oct 5, 2013 12:58:38 AM org.apache.karaf.main.lock.DefaultJDBCLock createSchema
SEVERE: Could not create schema: java.lang.IllegalStateException: missing behavior definition
for the preceding method call:
Connection.getMetaData()
Usage is: expect(a.foo()).andXXX()
Oct 5, 2013 12:58:38 AM org.apache.karaf.main.lock.DefaultJDBCLock updateLock
WARNING: Failed to update database lock: java.sql.SQLException
Oct 5, 2013 12:58:38 AM org.apache.karaf.main.lock.DefaultJDBCLock updateLock
WARNING: Failed to update database lock: java.sql.SQLException
Oct 5, 2013 12:58:38 AM org.apache.karaf.main.lock.DefaultJDBCLock isAlive
SEVERE: Lost lock!
Oct 5, 2013 12:58:38 AM org.apache.karaf.main.lock.DefaultJDBCLock isAlive
SEVERE: Lost lock!
Oct 5, 2013 12:58:38 AM org.apache.karaf.main.lock.DefaultJDBCLock updateLock
WARNING: Failed to update database lock: java.sql.SQLException
Tests run: 14, Failures: 0, Errors: 0, Skipped: 0, Time elapsed: 0.196 sec
Running org.apache.karaf.main.lock.OracleJDBCLockTest
Oct 5, 2013 12:58:38 AM org.apache.karaf.main.lock.DefaultJDBCLock aquireLock
WARNING: Failed to acquire database lock: java.sql.SQLException
Oct 5, 2013 12:58:38 AM org.apache.karaf.main.lock.DefaultJDBCLock aquireLock
WARNING: Failed to acquire database lock: java.sql.SQLException
Oct 5, 2013 12:58:38 AM org.apache.karaf.main.lock.DefaultJDBCLock aquireLock
WARNING: Failed to acquire database lock: java.sql.SQLException
Oct 5, 2013 12:58:38 AM org.apache.karaf.main.lock.DefaultJDBCLock isAlive
SEVERE: Lost lock!
Oct 5, 2013 12:58:38 AM org.apache.karaf.main.lock.DefaultJDBCLock isAlive
SEVERE: Lost lock!
Tests run: 13, Failures: 0, Errors: 0, Skipped: 0, Time elapsed: 0.03 sec
Running org.apache.karaf.main.lock.OracleJDBCLockIntegrationTest
Tests run: 1, Failures: 0, Errors: 0, Skipped: 1, Time elapsed: 0 sec
Running org.apache.karaf.main.lock.PostgreSQLJDBCLockIntegrationTest
Tests run: 1, Failures: 0, Errors: 0, Skipped: 1, Time elapsed: 0.001 sec
Running org.apache.karaf.main.lock.MySQLJDBCLockIntegrationTest
Tests run: 1, Failures: 0, Errors: 0, Skipped: 1, Time elapsed: 0 sec
Running org.apache.karaf.main.lock.StatementsTest
Tests run: 6, Failures: 0, Errors: 0, Skipped: 0, Time elapsed: 0 sec
Running org.apache.karaf.main.lock.DefaultJDBCLockTest
Oct 5, 2013 12:58:38 AM org.apache.karaf.main.lock.DefaultJDBCLock schemaExists
SEVERE: Error testing for db table: java.lang.NullPointerException
Oct 5, 2013 12:58:38 AM org.apache.karaf.main.lock.DefaultJDBCLock createSchema
SEVERE: Could not create schema: java.lang.IllegalStateException: missing behavior definition
for the preceding method call:
Connection.getMetaData()
Usage is: expect(a.foo()).andXXX()
Oct 5, 2013 12:58:38 AM org.apache.karaf.main.lock.DefaultJDBCLock updateLock
WARNING: Failed to update database lock: java.sql.SQLException
Oct 5, 2013 12:58:38 AM org.apache.karaf.main.lock.DefaultJDBCLock updateLock
WARNING: Failed to update database lock: java.sql.SQLException
Oct 5, 2013 12:58:38 AM org.apache.karaf.main.lock.DefaultJDBCLock isAlive
SEVERE: Lost lock!
Oct 5, 2013 12:58:38 AM org.apache.karaf.main.lock.DefaultJDBCLock isAlive
SEVERE: Lost lock!
Oct 5, 2013 12:58:38 AM org.apache.karaf.main.lock.DefaultJDBCLock updateLock
WARNING: Failed to update database lock: java.sql.SQLException
Tests run: 14, Failures: 0, Errors: 0, Skipped: 0, Time elapsed: 0.014 sec
Running org.apache.karaf.main.lock.DerbyJDBCLockIntegrationTest
Tests run: 1, Failures: 0, Errors: 0, Skipped: 1, Time elapsed: 0.001 sec
Running org.apache.karaf.main.lock.DefaultJDBCLockIntegrationTest
Tests run: 1, Failures: 0, Errors: 0, Skipped: 1, Time elapsed: 0 sec
Running org.apache.karaf.main.lock.PostgreSQLJDBCLockTest
Oct 5, 2013 12:58:38 AM org.apache.karaf.main.lock.DefaultJDBCLock schemaExists
SEVERE: Error testing for db table: java.lang.NullPointerException
Oct 5, 2013 12:58:38 AM org.apache.karaf.main.lock.DefaultJDBCLock createSchema
SEVERE: Could not create schema: java.lang.IllegalStateException: missing behavior definition
for the preceding method call:
Connection.getMetaData()
Usage is: expect(a.foo()).andXXX()
Oct 5, 2013 12:58:38 AM org.apache.karaf.main.lock.DefaultJDBCLock updateLock
WARNING: Failed to update database lock: java.sql.SQLException
Oct 5, 2013 12:58:38 AM org.apache.karaf.main.lock.DefaultJDBCLock updateLock
WARNING: Failed to update database lock: java.sql.SQLException
Oct 5, 2013 12:58:38 AM org.apache.karaf.main.lock.DefaultJDBCLock isAlive
SEVERE: Lost lock!
Oct 5, 2013 12:58:38 AM org.apache.karaf.main.lock.DefaultJDBCLock isAlive
SEVERE: Lost lock!
Oct 5, 2013 12:58:38 AM org.apache.karaf.main.lock.DefaultJDBCLock updateLock
WARNING: Failed to update database lock: java.sql.SQLException
Tests run: 14, Failures: 0, Errors: 0, Skipped: 0, Time elapsed: 0.02 sec
Running org.apache.karaf.main.lock.DerbyJDBCLockTest
Oct 5, 2013 12:58:38 AM org.apache.karaf.main.lock.DefaultJDBCLock schemaExists
SEVERE: Error testing for db table: java.lang.NullPointerException
Oct 5, 2013 12:58:38 AM org.apache.karaf.main.lock.DefaultJDBCLock createSchema
SEVERE: Could not create schema: java.lang.IllegalStateException: missing behavior definition
for the preceding method call:
Connection.getMetaData()
Usage is: expect(a.foo()).andXXX()
Oct 5, 2013 12:58:38 AM org.apache.karaf.main.lock.DefaultJDBCLock updateLock
WARNING: Failed to update database lock: java.sql.SQLException
Oct 5, 2013 12:58:38 AM org.apache.karaf.main.lock.DefaultJDBCLock updateLock
WARNING: Failed to update database lock: java.sql.SQLException
Oct 5, 2013 12:58:38 AM org.apache.karaf.main.lock.DefaultJDBCLock isAlive
SEVERE: Lost lock!
Oct 5, 2013 12:58:38 AM org.apache.karaf.main.lock.DefaultJDBCLock isAlive
SEVERE: Lost lock!
Oct 5, 2013 12:58:38 AM org.apache.karaf.main.lock.DefaultJDBCLock updateLock
WARNING: Failed to update database lock: java.sql.SQLException
Tests run: 14, Failures: 0, Errors: 0, Skipped: 0, Time elapsed: 0.021 sec
Running org.apache.karaf.main.util.SimpleMavenResolverTest
Tests run: 2, Failures: 0, Errors: 0, Skipped: 0, Time elapsed: 0.004 sec
Running org.apache.karaf.main.util.StringMapTest
Tests run: 1, Failures: 0, Errors: 0, Skipped: 0, Time elapsed: 0.007 sec
Running org.apache.karaf.main.MainLockingTest
Oct 5, 2013 12:58:38 AM org.apache.karaf.main.Main launch
INFO: Installing and starting initial bundles
Oct 5, 2013 12:58:38 AM org.apache.karaf.main.Main launch
INFO: All initial bundles installed and set to start
Oct 5, 2013 12:58:38 AM org.apache.karaf.main.Main$KarafLockCallback lockAquired
INFO: Lock acquired. Setting startlevel to 100
SLF4J: Failed to load class "org.slf4j.impl.StaticLoggerBinder".
SLF4J: Defaulting to no-operation (NOP) logger implementation
SLF4J: See http://www.slf4j.org/codes.html#StaticLoggerBinder for further details.
Write: /tmp/mylitte3956117599526444143jar
Starting timeout activator
Oct 5, 2013 12:58:41 AM org.apache.karaf.main.Main$KarafLockCallback lockLost
WARNING: Lock lost. Setting startlevel to 1
Timeout activator asked to stopped
Stopping timeout activator
Oct 5, 2013 12:58:53 AM org.apache.karaf.main.Main$KarafLockCallback lockAquired
INFO: Lock acquired. Setting startlevel to 100
Starting timeout activator
Timeout activator asked to stopped
Stopping timeout activator
Tests run: 1, Failures: 0, Errors: 0, Skipped: 0, Time elapsed: 26.348 sec
Running org.apache.karaf.main.MainStartTest
Oct 5, 2013 12:59:05 AM org.apache.karaf.main.Main launch
INFO: Installing and starting initial bundles
Oct 5, 2013 12:59:05 AM org.apache.karaf.main.Main launch
INFO: All initial bundles installed and set to start
Oct 5, 2013 12:59:05 AM org.apache.karaf.main.Main$KarafLockCallback lockAquired
INFO: Lock acquired. Setting startlevel to 100
Oct 5, 2013 12:59:06 AM org.apache.karaf.main.Main launch
INFO: Installing and starting initial bundles
Oct 5, 2013 12:59:06 AM org.apache.karaf.main.Main launch
INFO: All initial bundles installed and set to start
Oct 5, 2013 12:59:06 AM org.apache.karaf.main.Main$KarafLockCallback lockAquired
INFO: Lock acquired. Setting startlevel to 100
Write: /tmp/mylitte1473952496352982993jar
Starting timeout activator
Oct 5, 2013 12:59:07 AM org.apache.karaf.main.ShutdownSocketThread run
INFO: Karaf shutdown socket: received shutdown command. Stopping framework...
Timeout activator asked to stopped
Stopping timeout activator
Tests run: 2, Failures: 0, Errors: 0, Skipped: 0, Time elapsed: 12.507 sec

Results :

Tests run: 86, Failures: 0, Errors: 0, Skipped: 5


Mime
View raw message