karaf-commits mailing list archives

Site index · List index
Message view « Date » · « Thread »
Top « Date » · « Thread »
From Apache Jenkins Server <jenk...@builds.apache.org>
Subject Build failed in Jenkins: Karaf-2.2.x #1154
Date Sun, 15 Sep 2013 17:09:57 GMT
See <https://builds.apache.org/job/Karaf-2.2.x/1154/changes>

Changes:

[jbonofre] [KARAF-2471] Service wrapper now returns a correct exit code when using RUN_AS_USER

------------------------------------------
[...truncated 5275 lines...]
[debug] execute contextualize
[INFO] [resources:resources {execution: default-resources}]
[INFO] Using 'UTF-8' encoding to copy filtered resources.
[INFO] Copying 4 resources
[INFO] Copying 1 resource
[INFO] Copying 3 resources
[INFO] Copying 3 resources
[INFO] [compiler:compile {execution: default-compile}]
[INFO] Nothing to compile - all classes are up to date
[debug] execute contextualize
[INFO] [resources:testResources {execution: default-testResources}]
[INFO] Using 'UTF-8' encoding to copy filtered resources.
[INFO] skip non existing resourceDirectory <https://builds.apache.org/job/Karaf-2.2.x/ws/karaf/shell/commands/src/test/resources>
[INFO] Copying 3 resources
[INFO] Copying 3 resources
[INFO] [compiler:testCompile {execution: default-testCompile}]
[INFO] Nothing to compile - all classes are up to date
[INFO] [surefire:test {execution: default-test}]
[INFO] Skipping execution of surefire because it has already been run for this configuration
[INFO] [bundle:bundle {execution: default-bundle}]
[JENKINS] Recording test results
[INFO] [install:install {execution: default-install}]
[INFO] Installing <https://builds.apache.org/job/Karaf-2.2.x/ws/karaf/shell/commands/target/org.apache.karaf.shell.commands-2.2.12-SNAPSHOT.jar>
to <https://builds.apache.org/job/Karaf-2.2.x/ws/.repository/org/apache/karaf/shell/org.apache.karaf.shell.commands/2.2.12-SNAPSHOT/org.apache.karaf.shell.commands-2.2.12-SNAPSHOT.jar>
[INFO] [bundle:install {execution: default-install}]
[INFO] Installing org/apache/karaf/shell/org.apache.karaf.shell.commands/2.2.12-SNAPSHOT/org.apache.karaf.shell.commands-2.2.12-SNAPSHOT.jar
[INFO] Writing OBR metadata
[INFO] [deploy:deploy {execution: default-deploy}]
[INFO] Retrieving previous build number from apache.snapshots.https
[WARNING] *** CHECKSUM FAILED - Checksum failed on download: local = 'a1e07b16c632dc153b30ca721e3348aae4f313f3';
remote = '9053e100e983e37d1cb8ba70cd419e174749f499' - RETRYING
[WARNING] *** CHECKSUM FAILED - Checksum failed on download: local = 'a1e07b16c632dc153b30ca721e3348aae4f313f3';
remote = '9053e100e983e37d1cb8ba70cd419e174749f499' - IGNORING
Uploading: https://repository.apache.org/content/repositories/snapshots/org/apache/karaf/shell/org.apache.karaf.shell.commands/2.2.12-SNAPSHOT/org.apache.karaf.shell.commands-2.2.12-20130915.165236-105.jar
71K uploaded  (org.apache.karaf.shell.commands-2.2.12-20130915.165236-105.jar)
[INFO] Retrieving previous metadata from apache.snapshots.https
[WARNING] *** CHECKSUM FAILED - Checksum failed on download: local = 'a1e07b16c632dc153b30ca721e3348aae4f313f3';
remote = '9053e100e983e37d1cb8ba70cd419e174749f499' - RETRYING
[WARNING] *** CHECKSUM FAILED - Checksum failed on download: local = 'a1e07b16c632dc153b30ca721e3348aae4f313f3';
remote = '9053e100e983e37d1cb8ba70cd419e174749f499' - IGNORING
[INFO] Uploading repository metadata for: 'snapshot org.apache.karaf.shell:org.apache.karaf.shell.commands:2.2.12-SNAPSHOT'
[INFO] Uploading project information for org.apache.karaf.shell.commands 2.2.12-20130915.165236-105
[INFO] Retrieving previous metadata from apache.snapshots.https
[INFO] Uploading repository metadata for: 'artifact org.apache.karaf.shell:org.apache.karaf.shell.commands'
[INFO] [bundle:deploy {execution: default-deploy}]
[INFO] Remote OBR update disabled (enable with -DremoteOBR)
[JENKINS] Archiving <https://builds.apache.org/job/Karaf-2.2.x/ws/karaf/shell/commands/pom.xml>
to /home/hudson/hudson/jobs/Karaf-2.2.x/modules/org.apache.karaf.shell$org.apache.karaf.shell.commands/builds/2013-09-15_16-51-40/archive/org.apache.karaf.shell/org.apache.karaf.shell.commands/2.2.12-SNAPSHOT/org.apache.karaf.shell.commands-2.2.12-SNAPSHOT.pom
[JENKINS] Archiving <https://builds.apache.org/job/Karaf-2.2.x/ws/karaf/shell/commands/target/org.apache.karaf.shell.commands-2.2.12-SNAPSHOT.jar>
to /home/hudson/hudson/jobs/Karaf-2.2.x/modules/org.apache.karaf.shell$org.apache.karaf.shell.commands/builds/2013-09-15_16-51-40/archive/org.apache.karaf.shell/org.apache.karaf.shell.commands/2.2.12-20130915.165236-105/org.apache.karaf.shell.commands-2.2.12-20130915.165236-105.jar
[INFO] ------------------------------------------------------------------------
[INFO] Building Apache Karaf :: Shell :: ConfigAdmin Commands
[INFO]    task-segment: [clean, install, deploy]
[INFO] ------------------------------------------------------------------------
[INFO] [clean:clean {execution: default-clean}]
[INFO] [bundle:cleanVersions {execution: cleanVersions}]
[WARNING] The parameter expression: 'project.build.resources' used in mojo: 'process' has
been deprecated. Use 'project.resources' instead.
[INFO] [remote-resources:process {execution: default}]
[INFO] [antrun:run {execution: copy-notice}]
[INFO] Executing tasks

main:
     [copy] Copying 1 file to <https://builds.apache.org/job/Karaf-2.2.x/ws/karaf/shell/config/target/maven-shared-archive-resources/META-INF>
[INFO] Executed tasks
[debug] execute contextualize
[INFO] [resources:resources {execution: default-resources}]
[INFO] Using 'UTF-8' encoding to copy filtered resources.
[INFO] Copying 5 resources
[INFO] Copying 1 resource
[INFO] Copying 3 resources
[INFO] [compiler:compile {execution: default-compile}]
[INFO] Compiling 13 source files to <https://builds.apache.org/job/Karaf-2.2.x/ws/karaf/shell/config/target/classes>
[debug] execute contextualize
[INFO] [resources:testResources {execution: default-testResources}]
[INFO] Using 'UTF-8' encoding to copy filtered resources.
[INFO] skip non existing resourceDirectory <https://builds.apache.org/job/Karaf-2.2.x/ws/karaf/shell/config/src/test/resources>
[INFO] Copying 3 resources
[INFO] [compiler:testCompile {execution: default-testCompile}]
[INFO] Compiling 3 source files to <https://builds.apache.org/job/Karaf-2.2.x/ws/karaf/shell/config/target/test-classes>
[INFO] [surefire:test {execution: default-test}]
[INFO] Surefire report directory: <https://builds.apache.org/job/Karaf-2.2.x/ws/karaf/shell/config/target/surefire-reports>

-------------------------------------------------------
 T E S T S
-------------------------------------------------------
Running org.apache.karaf.shell.config.UpdateCommandTest
Tests run: 1, Failures: 0, Errors: 0, Skipped: 0, Time elapsed: 0.099 sec
Running org.apache.karaf.shell.config.EditCommandTest
Tests run: 2, Failures: 0, Errors: 0, Skipped: 0, Time elapsed: 0.002 sec

Results :

Tests run: 3, Failures: 0, Errors: 0, Skipped: 0

[JENKINS] Recording test results
[INFO] [bundle:bundle {execution: default-bundle}]
[INFO] [install:install {execution: default-install}]
[INFO] Installing <https://builds.apache.org/job/Karaf-2.2.x/ws/karaf/shell/config/target/org.apache.karaf.shell.config-2.2.12-SNAPSHOT.jar>
to <https://builds.apache.org/job/Karaf-2.2.x/ws/.repository/org/apache/karaf/shell/org.apache.karaf.shell.config/2.2.12-SNAPSHOT/org.apache.karaf.shell.config-2.2.12-SNAPSHOT.jar>
[INFO] [bundle:install {execution: default-install}]
[INFO] Installing org/apache/karaf/shell/org.apache.karaf.shell.config/2.2.12-SNAPSHOT/org.apache.karaf.shell.config-2.2.12-SNAPSHOT.jar
[INFO] Writing OBR metadata
[INFO] [bundle:cleanVersions {execution: cleanVersions}]
[WARNING] The parameter expression: 'project.build.resources' used in mojo: 'process' has
been deprecated. Use 'project.resources' instead.
[INFO] [remote-resources:process {execution: default}]
[INFO] [antrun:run {execution: copy-notice}]
[INFO] Executing tasks

main:
     [copy] Copying 1 file to <https://builds.apache.org/job/Karaf-2.2.x/ws/karaf/shell/config/target/maven-shared-archive-resources/META-INF>
[INFO] Executed tasks
[debug] execute contextualize
[INFO] [resources:resources {execution: default-resources}]
[INFO] Using 'UTF-8' encoding to copy filtered resources.
[INFO] Copying 5 resources
[INFO] Copying 1 resource
[INFO] Copying 3 resources
[INFO] Copying 3 resources
[INFO] [compiler:compile {execution: default-compile}]
[INFO] Nothing to compile - all classes are up to date
[debug] execute contextualize
[INFO] [resources:testResources {execution: default-testResources}]
[INFO] Using 'UTF-8' encoding to copy filtered resources.
[INFO] skip non existing resourceDirectory <https://builds.apache.org/job/Karaf-2.2.x/ws/karaf/shell/config/src/test/resources>
[INFO] Copying 3 resources
[INFO] Copying 3 resources
[INFO] [compiler:testCompile {execution: default-testCompile}]
[INFO] Nothing to compile - all classes are up to date
[INFO] [surefire:test {execution: default-test}]
[INFO] Skipping execution of surefire because it has already been run for this configuration
[JENKINS] Recording test results[INFO] [bundle:bundle {execution: default-bundle}]

[INFO] [install:install {execution: default-install}]
[INFO] Installing <https://builds.apache.org/job/Karaf-2.2.x/ws/karaf/shell/config/target/org.apache.karaf.shell.config-2.2.12-SNAPSHOT.jar>
to <https://builds.apache.org/job/Karaf-2.2.x/ws/.repository/org/apache/karaf/shell/org.apache.karaf.shell.config/2.2.12-SNAPSHOT/org.apache.karaf.shell.config-2.2.12-SNAPSHOT.jar>
[INFO] [bundle:install {execution: default-install}]
[INFO] Installing org/apache/karaf/shell/org.apache.karaf.shell.config/2.2.12-SNAPSHOT/org.apache.karaf.shell.config-2.2.12-SNAPSHOT.jar
[INFO] Writing OBR metadata
[INFO] [deploy:deploy {execution: default-deploy}]
[INFO] Retrieving previous build number from apache.snapshots.https
[WARNING] *** CHECKSUM FAILED - Checksum failed on download: local = '1c0ce837813e5696d847c59e5d451ba61a058ec3';
remote = '8617889834fa2ffb621d5b90a6d8cbb23f4c4123' - RETRYING
[WARNING] *** CHECKSUM FAILED - Checksum failed on download: local = '1c0ce837813e5696d847c59e5d451ba61a058ec3';
remote = '8617889834fa2ffb621d5b90a6d8cbb23f4c4123' - IGNORING
Uploading: https://repository.apache.org/content/repositories/snapshots/org/apache/karaf/shell/org.apache.karaf.shell.config/2.2.12-SNAPSHOT/org.apache.karaf.shell.config-2.2.12-20130915.165236-105.jar
44K uploaded  (org.apache.karaf.shell.config-2.2.12-20130915.165236-105.jar)
[INFO] Retrieving previous metadata from apache.snapshots.https
[WARNING] *** CHECKSUM FAILED - Checksum failed on download: local = '1c0ce837813e5696d847c59e5d451ba61a058ec3';
remote = '8617889834fa2ffb621d5b90a6d8cbb23f4c4123' - RETRYING
[WARNING] *** CHECKSUM FAILED - Checksum failed on download: local = '1c0ce837813e5696d847c59e5d451ba61a058ec3';
remote = '8617889834fa2ffb621d5b90a6d8cbb23f4c4123' - IGNORING
[INFO] Uploading repository metadata for: 'snapshot org.apache.karaf.shell:org.apache.karaf.shell.config:2.2.12-SNAPSHOT'
[INFO] Retrieving previous metadata from apache.snapshots.https
[INFO] Uploading repository metadata for: 'artifact org.apache.karaf.shell:org.apache.karaf.shell.config'
[INFO] Uploading project information for org.apache.karaf.shell.config 2.2.12-20130915.165236-105
[INFO] [bundle:deploy {execution: default-deploy}]
[INFO] Remote OBR update disabled (enable with -DremoteOBR)
[JENKINS] Archiving <https://builds.apache.org/job/Karaf-2.2.x/ws/karaf/shell/config/pom.xml>
to /home/hudson/hudson/jobs/Karaf-2.2.x/modules/org.apache.karaf.shell$org.apache.karaf.shell.config/builds/2013-09-15_16-51-40/archive/org.apache.karaf.shell/org.apache.karaf.shell.config/2.2.12-SNAPSHOT/org.apache.karaf.shell.config-2.2.12-SNAPSHOT.pom
[JENKINS] Archiving <https://builds.apache.org/job/Karaf-2.2.x/ws/karaf/shell/config/target/org.apache.karaf.shell.config-2.2.12-SNAPSHOT.jar>
to /home/hudson/hudson/jobs/Karaf-2.2.x/modules/org.apache.karaf.shell$org.apache.karaf.shell.config/builds/2013-09-15_16-51-40/archive/org.apache.karaf.shell/org.apache.karaf.shell.config/2.2.12-20130915.165236-105/org.apache.karaf.shell.config-2.2.12-20130915.165236-105.jar
[INFO] ------------------------------------------------------------------------
[INFO] Building Apache Karaf :: Shell :: Log Commands
[INFO]    task-segment: [clean, install, deploy]
[INFO] ------------------------------------------------------------------------
[INFO] [clean:clean {execution: default-clean}]
[INFO] [bundle:cleanVersions {execution: cleanVersions}]
[WARNING] The parameter expression: 'project.build.resources' used in mojo: 'process' has
been deprecated. Use 'project.resources' instead.
[INFO] [remote-resources:process {execution: default}]
[INFO] [antrun:run {execution: copy-notice}]
[INFO] Executing tasks

main:
     [copy] Copying 1 file to <https://builds.apache.org/job/Karaf-2.2.x/ws/karaf/shell/log/target/maven-shared-archive-resources/META-INF>
[INFO] Executed tasks
[debug] execute contextualize
[INFO] [resources:resources {execution: default-resources}]
[INFO] Using 'UTF-8' encoding to copy filtered resources.
[INFO] Copying 4 resources
[INFO] Copying 1 resource
[INFO] Copying 3 resources
[INFO] [compiler:compile {execution: default-compile}]
[INFO] Compiling 16 source files to <https://builds.apache.org/job/Karaf-2.2.x/ws/karaf/shell/log/target/classes>
[debug] execute contextualize
[INFO] [resources:testResources {execution: default-testResources}]
[INFO] Using 'UTF-8' encoding to copy filtered resources.
[INFO] skip non existing resourceDirectory <https://builds.apache.org/job/Karaf-2.2.x/ws/karaf/shell/log/src/test/resources>
[INFO] Copying 3 resources
[INFO] [compiler:testCompile {execution: default-testCompile}]
[INFO] Compiling 2 source files to <https://builds.apache.org/job/Karaf-2.2.x/ws/karaf/shell/log/target/test-classes>
[INFO] [surefire:test {execution: default-test}]
[INFO] Surefire report directory: <https://builds.apache.org/job/Karaf-2.2.x/ws/karaf/shell/log/target/surefire-reports>

-------------------------------------------------------
 T E S T S
-------------------------------------------------------
Running org.apache.karaf.shell.log.completers.LogLevelCompleterTest
Tests run: 3, Failures: 0, Errors: 0, Skipped: 0, Time elapsed: 0.032 sec
Running org.apache.karaf.shell.log.SetLogLevelTest
Tests run: 11, Failures: 0, Errors: 0, Skipped: 0, Time elapsed: 0.061 sec

Results :

Tests run: 14, Failures: 0, Errors: 0, Skipped: 0

[JENKINS] Recording test results
[INFO] [bundle:bundle {execution: default-bundle}]
[INFO] [install:install {execution: default-install}]
[INFO] Installing <https://builds.apache.org/job/Karaf-2.2.x/ws/karaf/shell/log/target/org.apache.karaf.shell.log-2.2.12-SNAPSHOT.jar>
to <https://builds.apache.org/job/Karaf-2.2.x/ws/.repository/org/apache/karaf/shell/org.apache.karaf.shell.log/2.2.12-SNAPSHOT/org.apache.karaf.shell.log-2.2.12-SNAPSHOT.jar>
[INFO] [bundle:install {execution: default-install}]
[INFO] Installing org/apache/karaf/shell/org.apache.karaf.shell.log/2.2.12-SNAPSHOT/org.apache.karaf.shell.log-2.2.12-SNAPSHOT.jar
[INFO] Writing OBR metadata
[INFO] [bundle:cleanVersions {execution: cleanVersions}]
[WARNING] The parameter expression: 'project.build.resources' used in mojo: 'process' has
been deprecated. Use 'project.resources' instead.
[INFO] [remote-resources:process {execution: default}]
[INFO] [antrun:run {execution: copy-notice}]
[INFO] Executing tasks

main:
     [copy] Copying 1 file to <https://builds.apache.org/job/Karaf-2.2.x/ws/karaf/shell/log/target/maven-shared-archive-resources/META-INF>
[INFO] Executed tasks
[debug] execute contextualize
[INFO] [resources:resources {execution: default-resources}]
[INFO] Using 'UTF-8' encoding to copy filtered resources.
[INFO] Copying 4 resources
[INFO] Copying 1 resource
[INFO] Copying 3 resources
[INFO] Copying 3 resources
[INFO] [compiler:compile {execution: default-compile}]
[INFO] Nothing to compile - all classes are up to date
[debug] execute contextualize
[INFO] [resources:testResources {execution: default-testResources}]
[INFO] Using 'UTF-8' encoding to copy filtered resources.
[INFO] skip non existing resourceDirectory <https://builds.apache.org/job/Karaf-2.2.x/ws/karaf/shell/log/src/test/resources>
[INFO] Copying 3 resources
[INFO] Copying 3 resources
[INFO] [compiler:testCompile {execution: default-testCompile}]
[INFO] Nothing to compile - all classes are up to date
[INFO] [surefire:test {execution: default-test}]
[INFO] Skipping execution of surefire because it has already been run for this configuration
[INFO] [bundle:bundle {execution: default-bundle}]
[JENKINS] Recording test results
[INFO] [install:install {execution: default-install}]
[INFO] Installing <https://builds.apache.org/job/Karaf-2.2.x/ws/karaf/shell/log/target/org.apache.karaf.shell.log-2.2.12-SNAPSHOT.jar>
to <https://builds.apache.org/job/Karaf-2.2.x/ws/.repository/org/apache/karaf/shell/org.apache.karaf.shell.log/2.2.12-SNAPSHOT/org.apache.karaf.shell.log-2.2.12-SNAPSHOT.jar>
[INFO] [bundle:install {execution: default-install}]
[INFO] Installing org/apache/karaf/shell/org.apache.karaf.shell.log/2.2.12-SNAPSHOT/org.apache.karaf.shell.log-2.2.12-SNAPSHOT.jar
[INFO] Writing OBR metadata
[INFO] [deploy:deploy {execution: default-deploy}]
[INFO] Retrieving previous build number from apache.snapshots.https
[WARNING] *** CHECKSUM FAILED - Checksum failed on download: local = '4150bb73f88a53d8067da06d13b55140f3a21099';
remote = 'cff613e65ebc0496704dd104e13c40fbdebb6369' - RETRYING
[WARNING] *** CHECKSUM FAILED - Checksum failed on download: local = '4150bb73f88a53d8067da06d13b55140f3a21099';
remote = 'cff613e65ebc0496704dd104e13c40fbdebb6369' - IGNORING
Uploading: https://repository.apache.org/content/repositories/snapshots/org/apache/karaf/shell/org.apache.karaf.shell.log/2.2.12-SNAPSHOT/org.apache.karaf.shell.log-2.2.12-20130915.165236-105.jar
44K uploaded  (org.apache.karaf.shell.log-2.2.12-20130915.165236-105.jar)
[INFO] Retrieving previous metadata from apache.snapshots.https
[INFO] Uploading repository metadata for: 'artifact org.apache.karaf.shell:org.apache.karaf.shell.log'
[INFO] Retrieving previous metadata from apache.snapshots.https
[WARNING] *** CHECKSUM FAILED - Checksum failed on download: local = '4150bb73f88a53d8067da06d13b55140f3a21099';
remote = 'cff613e65ebc0496704dd104e13c40fbdebb6369' - RETRYING
[WARNING] *** CHECKSUM FAILED - Checksum failed on download: local = '4150bb73f88a53d8067da06d13b55140f3a21099';
remote = 'cff613e65ebc0496704dd104e13c40fbdebb6369' - IGNORING
[INFO] Uploading repository metadata for: 'snapshot org.apache.karaf.shell:org.apache.karaf.shell.log:2.2.12-SNAPSHOT'
[INFO] Uploading project information for org.apache.karaf.shell.log 2.2.12-20130915.165236-105
[INFO] [bundle:deploy {execution: default-deploy}]
[INFO] Remote OBR update disabled (enable with -DremoteOBR)
ERROR: Maven JVM terminated unexpectedly with exit code 143


Mime
View raw message